rad:z3gqcJUoA1n9HaHKufZs5FCSGazv5 heartwooda052e5d36cd0ecb4c6ec1bec6074748b7a05155f
{
"request": "trigger",
"version": 1,
"event_type": "patch",
"repository": {
"id": "rad:z3gqcJUoA1n9HaHKufZs5FCSGazv5",
"name": "heartwood",
"description": "Radicle Heartwood Protocol & Stack",
"private": false,
"default_branch": "master",
"delegates": [
"did:key:z6MksFqXN3Yhqk8pTJdUGLwATkRfQvwZXPqR2qMEhbS9wzpT",
"did:key:z6MkireRatUThvd3qzfKht1S44wpm4FEWSSa4PRMTSQZ3voM",
"did:key:z6MkkPvBfjP4bQmco5Dm7UGsX2ruDBieEHi8n9DVJWX5sTEz"
]
},
"action": "Created",
"patch": {
"id": "1a1e849d3261952874ff8b0fb759f4f1c98986ad",
"author": {
"id": "did:key:z6MkhjouL6i63oTt9zTH4ympbz38kgSG465NaPFnU3YA6fiq",
"alias": "hu"
},
"title": "Improve git-remote-rad for use with `jj`",
"state": {
"status": "merged",
"conflicts": []
},
"before": "78ba263d0a946c4b90235d562b56ceb7badfc965",
"after": "a052e5d36cd0ecb4c6ec1bec6074748b7a05155f",
"commits": [
"a052e5d36cd0ecb4c6ec1bec6074748b7a05155f",
"60d80abe8ef2d5bd9286fbc5d3dae8c101ab6572"
],
"target": "919d5c780c4da0b5b9f18f1549bc59dffd7125af",
"labels": [],
"assignees": [],
"revisions": [
{
"id": "1a1e849d3261952874ff8b0fb759f4f1c98986ad",
"author": {
"id": "did:key:z6MkhjouL6i63oTt9zTH4ympbz38kgSG465NaPFnU3YA6fiq",
"alias": "hu"
},
"description": "This makes `jj` work a bit better with `git-remote-rad`:\n\n* git-remote-rad: Allow pushing from bare repositories\n\n Bare git repositories are meant to fetch into/push from and\n fetching works, but pushing from a bare repo into radicle-storage\n was prohibited.\n\n This is a problem for me as I want to use `jj`, which uses\n a bare git repository in the back (when not co-located into\n a \"normal\" git repository).\n\n* git-remote-rad: Allow pushing commit SHAs into `refs/patches`\n\n This makes scripting so much simpler than having to change HEAD\n or create a branch first.",
"base": "78ba263d0a946c4b90235d562b56ceb7badfc965",
"oid": "a052e5d36cd0ecb4c6ec1bec6074748b7a05155f",
"timestamp": 1751398410
},
{
"id": "17b349f9cdd619cf73117bc6293d74556134987d",
"author": {
"id": "did:key:z6MkhjouL6i63oTt9zTH4ympbz38kgSG465NaPFnU3YA6fiq",
"alias": "hu"
},
"description": "Changes:\n- Instead parsing a `RefString` and seeing if it is a commit, we use\n `revparse_single` and peel it to its `Oid`.",
"base": "9e010068efdc4314dde2c07386303bdeed12b3ee",
"oid": "1e590d9feb654928003f6e82dea3c5e37d8d1bd4",
"timestamp": 1751983677
},
{
"id": "f12cb010298ac0847de5927500e7d7dbcd1014f9",
"author": {
"id": "did:key:z6MkhjouL6i63oTt9zTH4ympbz38kgSG465NaPFnU3YA6fiq",
"alias": "hu"
},
"description": "Review",
"base": "9e010068efdc4314dde2c07386303bdeed12b3ee",
"oid": "64d6c67afcb1d2d8a395689ccfad256969e4fc36",
"timestamp": 1752672994
},
{
"id": "6b99215de7cdd4344f2bd86c8f53675242a6aff0",
"author": {
"id": "did:key:z6MkhjouL6i63oTt9zTH4ympbz38kgSG465NaPFnU3YA6fiq",
"alias": "hu"
},
"description": "Changes:\n- Rebased\n- Accepted review commit",
"base": "271ef497d78be91751f7c672798bfcfbb8312838",
"oid": "a9f75d47ecca159383fd9df0c3a140f8c063eb57",
"timestamp": 1752873858
}
]
}
}
{
"response": "triggered",
"run_id": {
"id": "e9f562da-883f-4539-a480-68b61a419ff0"
},
"info_url": "https://cci.rad.levitte.org//e9f562da-883f-4539-a480-68b61a419ff0.html"
}
Started at: 2026-09-07 17:36:28.435388+02:00
Commands:
$ rad clone rad:z3gqcJUoA1n9HaHKufZs5FCSGazv5 .
✓ Creating checkout in ./...
✓ Remote cloudhead@z6MksFqXN3Yhqk8pTJdUGLwATkRfQvwZXPqR2qMEhbS9wzpT added
✓ Remote-tracking branch cloudhead@z6MksFqXN3Yhqk8pTJdUGLwATkRfQvwZXPqR2qMEhbS9wzpT/master created for z6MksFqXN3Yhqk8pTJdUGLwATkRfQvwZXPqR2qMEhbS9wzpT
✓ Remote fintohaps@z6MkireRatUThvd3qzfKht1S44wpm4FEWSSa4PRMTSQZ3voM added
✓ Remote-tracking branch fintohaps@z6MkireRatUThvd3qzfKht1S44wpm4FEWSSa4PRMTSQZ3voM/master created for z6MkireRatUThvd3qzfKht1S44wpm4FEWSSa4PRMTSQZ3voM
✓ Remote lorenz@z6MkkPvBfjP4bQmco5Dm7UGsX2ruDBieEHi8n9DVJWX5sTEz added
✓ Remote-tracking branch lorenz@z6MkkPvBfjP4bQmco5Dm7UGsX2ruDBieEHi8n9DVJWX5sTEz/master created for z6MkkPvBfjP4bQmco5Dm7UGsX2ruDBieEHi8n9DVJWX5sTEz
✓ Repository successfully cloned under /opt/radcis/ci.rad.levitte.org/cci/state/e9f562da-883f-4539-a480-68b61a419ff0/w/
╭────────────────────────────────────╮
│ heartwood │
│ Radicle Heartwood Protocol & Stack │
│ 189 issues · 37 patches │
╰────────────────────────────────────╯
Run `cd ./.` to go to the repository directory.
Exit code: 0
$ rad patch checkout 1a1e849d3261952874ff8b0fb759f4f1c98986ad
✓ Switched to branch patch/1a1e849 at revision 1a1e849
✓ Branch patch/1a1e849 setup to track rad/patches/1a1e849d3261952874ff8b0fb759f4f1c98986ad
Exit code: 0
$ git config advice.detachedHead false
Exit code: 0
$ git checkout a052e5d36cd0ecb4c6ec1bec6074748b7a05155f
HEAD is now at a052e5d3 git-remote-rad: Allow pushing commit SHAs into `refs/patches`
Exit code: 0
$ rad patch show 1a1e849d3261952874ff8b0fb759f4f1c98986ad -p
╭───────────────────────────────────────────────────────────────────────────────╮
│ Title Improve git-remote-rad for use with `jj` │
│ Patch 1a1e849d3261952874ff8b0fb759f4f1c98986ad │
│ Author hu z6Mkhjo…3YA6fiq │
│ Head a052e5d36cd0ecb4c6ec1bec6074748b7a05155f │
│ Base 78ba263d0a946c4b90235d562b56ceb7badfc965 │
│ Target master │
│ Branches patch/1a1e849 │
│ Commits ahead 2, behind 1012 │
│ Status merged │
│ │
│ This makes `jj` work a bit better with `git-remote-rad`: │
│ │
│ * git-remote-rad: Allow pushing from bare repositories │
│ │
│ Bare git repositories are meant to fetch into/push from and │
│ fetching works, but pushing from a bare repo into radicle-storage │
│ was prohibited. │
│ │
│ This is a problem for me as I want to use `jj`, which uses │
│ a bare git repository in the back (when not co-located into │
│ a "normal" git repository). │
│ │
│ * git-remote-rad: Allow pushing commit SHAs into `refs/patches` │
│ │
│ This makes scripting so much simpler than having to change HEAD │
│ or create a branch first. │
├───────────────────────────────────────────────────────────────────────────────┤
│ a052e5d git-remote-rad: Allow pushing commit SHAs into `refs/patches` │
│ 60d80ab git-remote-rad: Allow pushing from bare repositories │
├───────────────────────────────────────────────────────────────────────────────┤
│ ● Revision 1a1e849 @ 78ba263..a052e5d by hu z6Mkhjo…3YA6fiq 1 year ago │
│ ↑ Revision 17b349f @ 9e01006..1e590d9 by fintohaps z6Mkire…SQZ3voM 1 year ago │
│ ↑ Revision f12cb01 @ 9e01006..64d6c67 by lorenz z6MkkPv…WX5sTEz 1 year ago │
│ ↑ Revision 6b99215 @ 271ef49..a9f75d4 by fintohaps z6Mkire…SQZ3voM 1 year ago │
│ └─ ✓ merged by fintohaps z6Mkire…SQZ3voM │
╰───────────────────────────────────────────────────────────────────────────────╯
commit a052e5d36cd0ecb4c6ec1bec6074748b7a05155f
Author: Tobias Hunger <tobias.hunger@gmail.com>
Date: Sun Jun 29 09:52:38 2025 +0000
git-remote-rad: Allow pushing commit SHAs into `refs/patches`
This makes scripting so much simpler than having to change HEAD
or create a branch first.
diff --git a/crates/radicle-remote-helper/src/push.rs b/crates/radicle-remote-helper/src/push.rs
index ec4a80dcf..adc1160e7 100644
--- a/crates/radicle-remote-helper/src/push.rs
+++ b/crates/radicle-remote-helper/src/push.rs
@@ -390,6 +390,20 @@ pub fn run(
Ok(())
}
+fn commit_from_string<'repo>(
+ working: &'repo git::raw::Repository,
+ src: &'_ str,
+) -> Result<git::raw::Commit<'repo>, Error> {
+ if let Ok(oid) = git::raw::Oid::from_str(src) {
+ if let Ok(object) = working.find_commit(oid) {
+ return Ok(object);
+ }
+ }
+ let reference = working.find_reference(src)?;
+ let commit = reference.peel_to_commit()?;
+ Ok(commit)
+}
+
/// Open a new patch.
fn patch_open<G>(
src: &git::RefStr,
@@ -408,8 +422,7 @@ fn patch_open<G>(
where
G: crypto::signature::Signer<crypto::Signature>,
{
- let reference = working.find_reference(src.as_str())?;
- let commit = reference.peel_to_commit()?;
+ let commit = commit_from_string(working, src.as_str())?;
let dst = git::refs::storage::staging::patch(nid, commit.id());
// Before creating the patch, we must push the associated git objects to storage.
commit 60d80abe8ef2d5bd9286fbc5d3dae8c101ab6572
Author: Tobias Hunger <tobias.hunger@gmail.com>
Date: Sun Jun 29 09:52:38 2025 +0000
git-remote-rad: Allow pushing from bare repositories
Bare git repositories are meant to fetch into/push from and
fetching works, but pushing from a bare repo into radicle-storage
was prohibited.
This is a problem for me as I want to use `jj`, which uses
a bare git repository in the back (when not co-located into
a "normal" git repository).
diff --git a/crates/radicle-remote-helper/src/push.rs b/crates/radicle-remote-helper/src/push.rs
index eaeccb888..ec4a80dcf 100644
--- a/crates/radicle-remote-helper/src/push.rs
+++ b/crates/radicle-remote-helper/src/push.rs
@@ -826,9 +826,7 @@ fn push_ref(
// Nb. The *force* indicator (`+`) is processed by Git tooling before we even reach this code.
// This happens during the `list for-push` phase.
let refspec = git::Refspec { src, dst, force };
- let repo = working.workdir().ok_or(Error::BareRepository {
- path: working.path().to_path_buf(),
- })?;
+ let repo = working.workdir().unwrap_or_else(|| working.path());
radicle::git::run::<_, _, &str, &str>(
repo,
Exit code: 0
shell: 'cargo --version rustc --version cargo fmt --check cargo clippy --all-targets --workspace -- --deny warnings cargo build --all-targets --workspace cargo doc --workspace --no-deps cargo test --workspace --no-fail-fast '
Commands:
$ podman run --name e9f562da-883f-4539-a480-68b61a419ff0 -v /opt/radcis/ci.rad.levitte.org/cci/state/e9f562da-883f-4539-a480-68b61a419ff0/s:/e9f562da-883f-4539-a480-68b61a419ff0/s:ro -v /opt/radcis/ci.rad.levitte.org/cci/state/e9f562da-883f-4539-a480-68b61a419ff0/w:/e9f562da-883f-4539-a480-68b61a419ff0/w -w /e9f562da-883f-4539-a480-68b61a419ff0/w -v /opt/radcis/ci.rad.levitte.org/.radicle:/${id}/.radicle:ro -e RAD_HOME=/${id}/.radicle rust:trixie bash /e9f562da-883f-4539-a480-68b61a419ff0/s/script.sh
+ cargo --version
info: syncing channel updates for '1.85-x86_64-unknown-linux-gnu'
info: latest update on 2025-03-18, rust version 1.85.1 (4eb161250 2025-03-15)
info: downloading component 'cargo'
info: downloading component 'clippy'
info: downloading component 'rust-docs'
info: downloading component 'rust-src'
info: downloading component 'rust-std'
info: downloading component 'rustc'
info: downloading component 'rustfmt'
info: installing component 'cargo'
info: installing component 'clippy'
info: installing component 'rust-docs'
info: installing component 'rust-src'
info: installing component 'rust-std'
info: installing component 'rustc'
info: installing component 'rustfmt'
cargo 1.85.1 (d73d2caf9 2024-12-31)
+ rustc --version
rustc 1.85.1 (4eb161250 2025-03-15)
+ cargo fmt --check
+ cargo clippy --all-targets --workspace -- --deny warnings
Updating crates.io index
Downloading crates ...
Downloaded adler2 v2.0.0
Downloaded aead v0.5.2
Downloaded amplify_derive v4.0.0
Downloaded amplify v4.6.0
Downloaded anstream v0.6.13
Downloaded popol v3.0.0
Downloaded primeorder v0.13.6
Downloaded pretty_assertions v1.4.0
Downloaded poly1305 v0.8.0
Downloaded blowfish v0.9.1
Downloaded ppv-lite86 v0.2.17
Downloaded typenum v1.17.0
Downloaded fastrand v2.1.0
Downloaded anyhow v1.0.82
Downloaded ssh-cipher v0.2.0
Downloaded fxhash v0.2.1
Downloaded prodash v29.0.2
Downloaded ssh-encoding v0.2.0
Downloaded qcheck-macros v1.0.0
Downloaded spki v0.7.3
Downloaded gix-commitgraph v0.25.1
Downloaded tempfile v3.10.1
Downloaded outref v0.5.2
Downloaded num-bigint v0.4.6
Downloaded ff v0.13.0
Downloaded phf_shared v0.11.3
Downloaded phf v0.11.3
Downloaded gix-transport v0.44.0
Downloaded inout v0.1.3
Downloaded zerovec-derive v0.10.3
Downloaded nonempty v0.9.0
Downloaded signature v1.6.4
Downloaded itoa v1.0.11
Downloaded equivalent v1.0.1
Downloaded utf16_iter v1.0.5
Downloaded percent-encoding v2.3.1
Downloaded utf8parse v0.2.1
Downloaded stable_deref_trait v1.2.0
Downloaded tree-sitter-language v0.1.2
Downloaded sha1_smol v1.0.0
Downloaded gix-utils v0.1.14
Downloaded tree-sitter-highlight v0.24.4
Downloaded siphasher v0.3.11
Downloaded yoke-derive v0.7.5
Downloaded noise-framework v0.4.0
Downloaded gix-quote v0.4.15
Downloaded jobserver v0.1.31
Downloaded home v0.5.9
Downloaded gix-diff v0.49.0
Downloaded gix-prompt v0.9.1
Downloaded zerofrom v0.1.6
Downloaded once_cell v1.21.3
Downloaded write16 v1.0.0
Downloaded yansi v0.5.1
Downloaded hmac v0.12.1
Downloaded xattr v1.3.1
Downloaded sem_safe v0.2.0
Downloaded parking_lot_core v0.9.9
Downloaded zeroize v1.7.0
Downloaded yoke v0.7.5
Downloaded referencing v0.30.0
Downloaded gix-refspec v0.27.0
Downloaded localtime v1.3.1
Downloaded litemap v0.7.5
Downloaded gix-revwalk v0.17.0
Downloaded unicode-ident v1.0.12
Downloaded similar v2.5.0
Downloaded pkg-config v0.3.30
Downloaded version_check v0.9.4
Downloaded gix-revision v0.31.1
Downloaded iana-time-zone v0.1.60
Downloaded gix-protocol v0.47.0
Downloaded icu_locid_transform_data v1.5.1
Downloaded icu_properties v1.5.1
Downloaded log v0.4.21
Downloaded icu_locid v1.5.0
Downloaded pem-rfc7468 v0.7.0
Downloaded hashbrown v0.14.3
Downloaded url v2.5.4
Downloaded memchr v2.7.2
Downloaded unicode-normalization v0.1.23
Downloaded zerocopy v0.7.35
Downloaded zerovec v0.10.4
Downloaded tree-sitter v0.24.4
Downloaded winnow v0.6.26
Downloaded tree-sitter-python v0.23.4
Downloaded idna v1.0.3
Downloaded vcpkg v0.2.15
Downloaded icu_properties_data v1.5.1
Downloaded p384 v0.13.0
Downloaded tree-sitter-rust v0.23.2
Downloaded regex-syntax v0.8.5
Downloaded tree-sitter-md v0.3.2
Downloaded rustix v0.38.34
Downloaded tree-sitter-c v0.23.2
Downloaded syn v1.0.109
Downloaded regex v1.11.1
Downloaded tree-sitter-bash v0.23.3
Downloaded p521 v0.13.3
Downloaded tree-sitter-ruby v0.23.1
Downloaded serde_json v1.0.140
Downloaded icu_collections v1.5.0
Downloaded jsonschema v0.30.0
Downloaded num-bigint-dig v0.8.4
Downloaded uuid v1.16.0
Downloaded regex-automata v0.4.9
Downloaded jiff v0.2.1
Downloaded unicode-segmentation v1.11.0
Downloaded icu_normalizer v1.5.0
Downloaded tree-sitter-go v0.23.4
Downloaded icu_normalizer_data v1.5.1
Downloaded libm v0.2.8
Downloaded rsa v0.9.6
Downloaded rand v0.8.5
Downloaded libc v0.2.155
Downloaded tree-sitter-typescript v0.23.2
Downloaded vsimd v0.8.0
Downloaded pkcs1 v0.7.5
Downloaded inquire v0.7.5
Downloaded tree-sitter-css v0.23.1
Downloaded sha3 v0.10.8
Downloaded serde v1.0.219
Downloaded schemars v1.0.0-alpha.17
Downloaded proc-macro2 v1.0.92
Downloaded gix-ref v0.49.1
Downloaded gix-path v0.10.15
Downloaded writeable v0.5.5
Downloaded uuid-simd v0.8.0
Downloaded num-traits v0.2.19
Downloaded num-integer v0.1.46
Downloaded maybe-async v0.2.10
Downloaded lock_api v0.4.11
Downloaded icu_provider v1.5.0
Downloaded syn v2.0.89
Downloaded icu_locid_transform v1.5.0
Downloaded gix-pack v0.56.0
Downloaded tar v0.4.40
Downloaded smallvec v1.13.2
Downloaded keccak v0.1.5
Downloaded universal-hash v0.5.1
Downloaded numtoa v0.1.0
Downloaded num-iter v0.1.45
Downloaded lazy_static v1.5.0
Downloaded gix-validate v0.9.4
Downloaded num-complex v0.4.6
Downloaded serde_derive v1.0.219
Downloaded ryu v1.0.17
Downloaded signals_receipts v0.2.0
Downloaded unicode-width v0.1.11
Downloaded parking_lot v0.12.3
Downloaded miniz_oxide v0.8.8
Downloaded gix-traverse v0.43.1
Downloaded tree-sitter-toml-ng v0.6.0
Downloaded tinyvec v1.6.0
Downloaded snapbox v0.4.17
Downloaded linux-raw-sys v0.4.13
Downloaded proc-macro-error v1.0.4
Downloaded lexopt v0.3.0
Downloaded gix-odb v0.66.0
Downloaded utf8_iter v1.0.4
Downloaded serde_derive_internals v0.29.1
Downloaded thiserror v1.0.69
Downloaded walkdir v2.5.0
Downloaded pkcs8 v0.10.2
Downloaded idna_adapter v1.2.0
Downloaded p256 v0.13.2
Downloaded thiserror-impl v2.0.12
Downloaded icu_provider_macros v1.5.0
Downloaded io-reactor v0.5.2
Downloaded gix-object v0.46.1
Downloaded gix-tempfile v15.0.0
Downloaded libgit2-sys v0.17.0+1.8.1
Downloaded quote v1.0.36
Downloaded proc-macro-error-attr v1.0.4
Downloaded amplify_num v0.5.2
Downloaded unicode-display-width v0.3.0
Downloaded group v0.13.0
Downloaded multibase v0.9.1
Downloaded tree-sitter-html v0.23.2
Downloaded tinystr v0.7.6
Downloaded thiserror-impl v1.0.69
Downloaded socket2 v0.5.7
Downloaded ref-cast v1.0.24
Downloaded rand_core v0.6.4
Downloaded bit-vec v0.8.0
Downloaded streaming-iterator v0.1.9
Downloaded gix-packetline v0.18.4
Downloaded gix-hash v0.15.1
Downloaded gix-features v0.39.1
Downloaded num-cmp v0.1.0
Downloaded num v0.4.3
Downloaded gix-trace v0.1.12
Downloaded gix-shallow v0.1.0
Downloaded gix-lock v15.0.1
Downloaded memmap2 v0.9.4
Downloaded gix-url v0.28.2
Downloaded gix-negotiate v0.17.0
Downloaded zerofrom-derive v0.1.6
Downloaded pbkdf2 v0.12.2
Downloaded normalize-line-endings v0.3.0
Downloaded tinyvec_macros v0.1.1
Downloaded rfc6979 v0.4.0
Downloaded tree-sitter-json v0.24.8
Downloaded siphasher v1.0.1
Downloaded signature v2.2.0
Downloaded salsa20 v0.10.2
Downloaded radicle-std-ext v0.1.0
Downloaded subtle v2.5.0
Downloaded radicle-git-ext v0.8.1
Downloaded gix-sec v0.10.12
Downloaded gix-fs v0.12.1
Downloaded newline-converter v0.3.0
Downloaded netservices v0.8.0
Downloaded termion v2.0.3
Downloaded sha2 v0.10.8
Downloaded sec1 v0.7.3
Downloaded schemars_derive v1.0.0-alpha.17
Downloaded same-file v1.0.6
Downloaded scrypt v0.11.0
Downloaded flate2 v1.1.1
Downloaded either v1.11.0
Downloaded num-rational v0.4.2
Downloaded git2 v0.19.0
Downloaded emojis v0.6.4
Downloaded sqlite3-src v0.5.1
Downloaded bloomy v1.2.0
Downloaded arc-swap v1.7.1
Downloaded indexmap v2.2.6
Downloaded gix-hashtable v0.6.0
Downloaded shell-words v1.1.0
Downloaded thiserror v2.0.12
Downloaded shlex v1.3.0
Downloaded ref-cast-impl v1.0.24
Downloaded qcheck v1.0.0
Downloaded ascii v1.1.0
Downloaded nonempty v0.5.0
Downloaded timeago v0.4.2
Downloaded radicle-surf v0.22.0
Downloaded generic-array v0.14.7
Downloaded fraction v0.15.3
Downloaded fluent-uri v0.3.2
Downloaded faster-hex v0.9.0
Downloaded dyn-clone v1.0.17
Downloaded cpufeatures v0.2.12
Downloaded chrono v0.4.38
Downloaded cbc v0.1.2
Downloaded bcrypt-pbkdf v0.10.0
Downloaded base64 v0.21.7
Downloaded anstyle-query v1.0.2
Downloaded termion v3.0.0
Downloaded scopeguard v1.2.0
Downloaded gix-command v0.4.1
Downloaded gix-chunk v0.4.11
Downloaded ghash v0.5.1
Downloaded displaydoc v0.2.5
Downloaded diff v0.1.13
Downloaded ecdsa v0.16.9
Downloaded digest v0.10.7
Downloaded data-encoding v2.5.0
Downloaded cypheraddr v0.4.0
Downloaded crossbeam-utils v0.8.19
Downloaded colorchoice v1.0.0
Downloaded bytesize v2.0.1
Downloaded bytecount v0.6.8
Downloaded bstr v1.9.1
Downloaded block-padding v0.3.3
Downloaded block-buffer v0.10.4
Downloaded bitflags v2.5.0
Downloaded base32 v0.4.0
Downloaded base-x v0.2.11
Downloaded opaque-debug v0.3.1
Downloaded synstructure v0.13.1
Downloaded ssh-key v0.6.6
Downloaded spin v0.9.8
Downloaded rand_chacha v0.3.1
Downloaded gix-credentials v0.26.0
Downloaded gix-actor v0.33.2
Downloaded git-ref-format-core v0.3.1
Downloaded git-ref-format v0.3.1
Downloaded getrandom v0.2.15
Downloaded form_urlencoded v1.2.1
Downloaded escargot v0.5.10
Downloaded errno v0.3.9
Downloaded der v0.7.9
Downloaded data-encoding-macro v0.1.14
Downloaded cyphernet v0.5.2
Downloaded ct-codecs v1.1.1
Downloaded crypto-bigint v0.5.5
Downloaded cfg-if v1.0.0
Downloaded fancy-regex v0.14.0
Downloaded ec25519 v0.1.0
Downloaded crypto-common v0.1.6
Downloaded base64 v0.22.1
Downloaded git-ref-format-macro v0.3.1
Downloaded borrow-or-share v0.2.2
Downloaded libz-sys v1.1.16
Downloaded base64ct v1.6.0
Downloaded amplify_syn v2.0.1
Downloaded filetime v0.2.23
Downloaded elliptic-curve v0.13.8
Downloaded ed25519 v1.5.3
Downloaded ctr v0.9.2
Downloaded cipher v0.4.4
Downloaded base64 v0.13.1
Downloaded base16ct v0.2.0
Downloaded autocfg v1.2.0
Downloaded sqlite3-sys v0.15.2
Downloaded sqlite v0.32.0
Downloaded socks5-client v0.4.1
Downloaded gix-config-value v0.14.12
Downloaded email_address v0.2.9
Downloaded data-encoding-macro-internal v0.1.12
Downloaded crossbeam-channel v0.5.15
Downloaded crc32fast v1.4.0
Downloaded colored v2.1.0
Downloaded chacha20 v0.9.1
Downloaded bit-set v0.8.0
Downloaded anstyle v1.0.6
Downloaded cyphergraphy v0.3.0
Downloaded anstyle-parse v0.2.3
Downloaded snapbox-macros v0.3.8
Downloaded const-oid v0.9.6
Downloaded chacha20poly1305 v0.10.1
Downloaded cc v1.2.2
Downloaded byteorder v1.5.0
Downloaded polyval v0.6.2
Downloaded gix-date v0.9.4
Downloaded aho-corasick v1.1.3
Downloaded aes-gcm v0.10.3
Downloaded aes v0.8.4
Downloaded ahash v0.8.11
Compiling libc v0.2.155
Compiling proc-macro2 v1.0.92
Compiling unicode-ident v1.0.12
Checking cfg-if v1.0.0
Compiling shlex v1.3.0
Compiling version_check v0.9.4
Checking memchr v2.7.2
Compiling serde v1.0.219
Compiling quote v1.0.36
Compiling jobserver v0.1.31
Compiling syn v2.0.89
Checking getrandom v0.2.15
Checking aho-corasick v1.1.3
Checking regex-syntax v0.8.5
Compiling cc v1.2.2
Compiling typenum v1.17.0
Checking regex-automata v0.4.9
Compiling generic-array v0.14.7
Compiling autocfg v1.2.0
Checking smallvec v1.13.2
Checking rand_core v0.6.4
Checking fastrand v2.1.0
Checking log v0.4.21
Checking crypto-common v0.1.6
Checking subtle v2.5.0
Checking bitflags v2.5.0
Checking stable_deref_trait v1.2.0
Compiling syn v1.0.109
Checking zeroize v1.7.0
Compiling synstructure v0.13.1
Checking cpufeatures v0.2.12
Checking bstr v1.9.1
Checking once_cell v1.21.3
Checking tinyvec_macros v0.1.1
Checking tinyvec v1.6.0
Checking writeable v0.5.5
Checking litemap v0.7.5
Compiling icu_locid_transform_data v1.5.1
Checking block-padding v0.3.3
Checking unicode-normalization v0.1.23
Compiling icu_properties_data v1.5.1
Compiling serde_derive v1.0.219
Compiling zerofrom-derive v0.1.6
Compiling yoke-derive v0.7.5
Compiling zerovec-derive v0.10.3
Compiling displaydoc v0.2.5
Checking zerofrom v0.1.6
Checking yoke v0.7.5
Compiling icu_provider_macros v1.5.0
Checking zerovec v0.10.4
Checking inout v0.1.3
Checking block-buffer v0.10.4
Compiling pkg-config v0.3.30
Compiling crc32fast v1.4.0
Compiling icu_normalizer_data v1.5.1
Checking tinystr v0.7.6
Checking icu_collections v1.5.0
Checking digest v0.10.7
Checking icu_locid v1.5.0
Checking cipher v0.4.4
Checking write16 v1.0.0
Checking hashbrown v0.14.3
Checking icu_provider v1.5.0
Checking itoa v1.0.11
Checking utf16_iter v1.0.5
Checking icu_locid_transform v1.5.0
Checking utf8_iter v1.0.4
Compiling thiserror v1.0.69
Compiling thiserror-impl v1.0.69
Checking icu_properties v1.5.1
Checking percent-encoding v2.3.1
Compiling rustix v0.38.34
Checking sha2 v0.10.8
Checking linux-raw-sys v0.4.13
Checking form_urlencoded v1.2.1
Checking universal-hash v0.5.1
Compiling vcpkg v0.2.15
Checking opaque-debug v0.3.1
Compiling amplify_syn v2.0.1
Checking icu_normalizer v1.5.0
Compiling libz-sys v1.1.16
Compiling data-encoding v2.5.0
Checking idna_adapter v1.2.0
Checking idna v1.0.3
Checking byteorder v1.5.0
Checking url v2.5.4
Compiling amplify_derive v4.0.0
Checking amplify_num v0.5.2
Compiling data-encoding-macro-internal v0.1.12
Checking ascii v1.1.0
Checking signature v1.6.4
Checking ed25519 v1.5.3
Checking data-encoding-macro v0.1.14
Checking tempfile v3.10.1
Compiling libgit2-sys v0.17.0+1.8.1
Checking aead v0.5.2
Compiling num-traits v0.2.19
Compiling proc-macro-error-attr v1.0.4
Checking ct-codecs v1.1.1
Checking base-x v0.2.11
Checking ec25519 v0.1.0
Checking multibase v0.9.1
Checking poly1305 v0.8.0
Checking chacha20 v0.9.1
Compiling proc-macro-error v1.0.4
Checking amplify v4.6.0
Checking cyphergraphy v0.3.0
Checking keccak v0.1.5
Checking sha3 v0.10.8
Compiling git-ref-format-core v0.3.1
Checking polyval v0.6.2
Checking hmac v0.12.1
Compiling sqlite3-src v0.5.1
Checking ppv-lite86 v0.2.17
Checking base32 v0.4.0
Checking base64ct v1.6.0
Checking rand_chacha v0.3.1
Checking pem-rfc7468 v0.7.0
Checking cypheraddr v0.4.0
Checking pbkdf2 v0.12.2
Compiling git-ref-format-macro v0.3.1
Checking ghash v0.5.1
Checking chacha20poly1305 v0.10.1
Checking ctr v0.9.2
Checking aes v0.8.4
Compiling crossbeam-utils v0.8.19
Checking aes-gcm v0.10.3
Checking git-ref-format v0.3.1
Checking noise-framework v0.4.0
Checking socks5-client v0.4.1
Checking ssh-encoding v0.2.0
Checking rand v0.8.5
Checking blowfish v0.9.1
Checking cbc v0.1.2
Checking radicle-std-ext v0.1.0
Compiling thiserror v2.0.12
Compiling serde_json v1.0.140
Checking equivalent v1.0.1
Checking indexmap v2.2.6
Checking ssh-cipher v0.2.0
Checking bcrypt-pbkdf v0.10.0
Checking cyphernet v0.5.2
Compiling thiserror-impl v2.0.12
Checking ryu v1.0.17
Checking signature v2.2.0
Checking ssh-key v0.6.6
Checking crossbeam-channel v0.5.15
Checking qcheck v1.0.0
Checking radicle-ssh v0.9.0 (/e9f562da-883f-4539-a480-68b61a419ff0/w/crates/radicle-ssh)
Compiling ref-cast v1.0.24
Compiling ref-cast-impl v1.0.24
Checking dyn-clone v1.0.17
Checking lazy_static v1.5.0
Compiling lock_api v0.4.11
Checking siphasher v1.0.1
Compiling parking_lot_core v0.9.9
Checking nonempty v0.9.0
Compiling serde_derive_internals v0.29.1
Checking radicle-dag v0.10.0 (/e9f562da-883f-4539-a480-68b61a419ff0/w/crates/radicle-dag)
Checking scopeguard v1.2.0
Checking tree-sitter-language v0.1.2
Checking iana-time-zone v0.1.60
Checking chrono v0.4.38
Compiling schemars_derive v1.0.0-alpha.17
Checking parking_lot v0.12.3
Checking colored v2.1.0
Checking localtime v1.3.1
Checking bytesize v2.0.1
Compiling anyhow v1.0.82
Checking schemars v1.0.0-alpha.17
Checking base64 v0.21.7
Checking anstyle-query v1.0.2
Checking gix-trace v0.1.12
Checking faster-hex v0.9.0
Checking errno v0.3.9
Checking sem_safe v0.2.0
Checking gix-utils v0.1.14
Checking signals_receipts v0.2.0
Checking adler2 v2.0.0
Checking miniz_oxide v0.8.8
Checking gix-hash v0.15.1
Checking same-file v1.0.6
Checking flate2 v1.1.1
Checking walkdir v2.5.0
Checking radicle-signals v0.11.0 (/e9f562da-883f-4539-a480-68b61a419ff0/w/crates/radicle-signals)
Checking prodash v29.0.2
Compiling tree-sitter v0.24.4
Checking sha1_smol v1.0.0
Checking gix-features v0.39.1
Checking regex v1.11.1
Checking unicode-segmentation v1.11.0
Checking numtoa v0.1.0
Compiling xattr v1.3.1
Compiling filetime v0.2.23
Checking lexopt v0.3.0
Checking home v0.5.9
Checking gix-path v0.10.15
Compiling tar v0.4.40
Checking termion v2.0.3
Checking newline-converter v0.3.0
Checking fxhash v0.2.1
Checking streaming-iterator v0.1.9
Checking unicode-width v0.1.11
Checking inquire v0.7.5
Compiling radicle-surf v0.22.0
Checking termion v3.0.0
Checking unicode-display-width v0.3.0
Compiling tree-sitter-css v0.23.1
Compiling tree-sitter-html v0.23.2
Compiling tree-sitter-c v0.23.2
Compiling tree-sitter-typescript v0.23.2
Compiling tree-sitter-go v0.23.4
Compiling tree-sitter-python v0.23.4
Compiling tree-sitter-toml-ng v0.6.0
Compiling tree-sitter-json v0.24.8
Compiling tree-sitter-md v0.3.2
Compiling tree-sitter-rust v0.23.2
Compiling tree-sitter-ruby v0.23.1
Compiling tree-sitter-bash v0.23.3
Checking sqlite3-sys v0.15.2
Checking sqlite v0.32.0
Checking nonempty v0.5.0
Checking base64 v0.13.1
Compiling radicle-cli v0.13.0 (/e9f562da-883f-4539-a480-68b61a419ff0/w/crates/radicle-cli)
Checking tree-sitter-highlight v0.24.4
Checking timeago v0.4.2
Checking jiff v0.2.1
Checking winnow v0.6.26
Checking gix-hashtable v0.6.0
Checking gix-validate v0.9.4
Checking memmap2 v0.9.4
Checking gix-chunk v0.4.11
Checking gix-commitgraph v0.25.1
Checking gix-fs v0.12.1
Checking shell-words v1.1.0
Checking gix-command v0.4.1
Checking gix-tempfile v15.0.0
Checking utf8parse v0.2.1
Checking anstyle-parse v0.2.3
Checking gix-lock v15.0.1
Checking gix-config-value v0.14.12
Checking gix-url v0.28.2
Checking gix-quote v0.4.15
Checking gix-sec v0.10.12
Checking colorchoice v1.0.0
Checking anstyle v1.0.6
Checking gix-prompt v0.9.1
Checking anstream v0.6.13
Checking gix-packetline v0.18.4
Checking gix-transport v0.44.0
Checking snapbox-macros v0.3.8
Checking gix-credentials v0.26.0
Checking gix-date v0.9.4
Checking gix-actor v0.33.2
Checking gix-shallow v0.1.0
Compiling maybe-async v0.2.10
Checking similar v2.5.0
Checking gix-object v0.46.1
Checking arc-swap v1.7.1
Checking normalize-line-endings v0.3.0
Checking snapbox v0.4.17
Checking popol v3.0.0
Checking gix-revwalk v0.17.0
Checking gix-diff v0.49.0
Checking gix-traverse v0.43.1
Checking gix-revision v0.31.1
Checking gix-negotiate v0.17.0
Checking gix-refspec v0.27.0
Checking gix-ref v0.49.1
Checking gix-pack v0.56.0
Checking either v1.11.0
Checking io-reactor v0.5.2
Checking salsa20 v0.10.2
Checking socket2 v0.5.7
Checking gix-protocol v0.47.0
Checking siphasher v0.3.11
Checking yansi v0.5.1
Checking diff v0.1.13
Checking gix-odb v0.66.0
Compiling radicle-node v0.11.0 (/e9f562da-883f-4539-a480-68b61a419ff0/w/crates/radicle-node)
Checking pretty_assertions v1.4.0
Checking bloomy v1.2.0
Checking netservices v0.8.0
Checking scrypt v0.11.0
Checking num-integer v0.1.46
Compiling escargot v0.5.10
Checking radicle-systemd v0.9.0 (/e9f562da-883f-4539-a480-68b61a419ff0/w/crates/radicle-systemd)
Compiling qcheck-macros v1.0.0
Checking num-bigint v0.4.6
Compiling ahash v0.8.11
Compiling radicle-remote-helper v0.10.0 (/e9f562da-883f-4539-a480-68b61a419ff0/w/crates/radicle-remote-helper)
Checking num-iter v0.1.45
Checking num-complex v0.4.6
Checking bit-vec v0.8.0
Checking num-rational v0.4.2
Checking borrow-or-share v0.2.2
Checking zerocopy v0.7.35
Checking fluent-uri v0.3.2
Checking num v0.4.3
Checking bit-set v0.8.0
Checking phf_shared v0.11.3
Checking vsimd v0.8.0
Checking uuid v1.16.0
Checking outref v0.5.2
Checking phf v0.11.3
Checking referencing v0.30.0
Checking fancy-regex v0.14.0
Checking uuid-simd v0.8.0
Checking fraction v0.15.3
Checking email_address v0.2.9
Checking bytecount v0.6.8
Checking num-cmp v0.1.0
Checking base64 v0.22.1
Checking emojis v0.6.4
Checking jsonschema v0.30.0
Checking git2 v0.19.0
Checking radicle-git-ext v0.8.1
Checking radicle-term v0.12.0 (/e9f562da-883f-4539-a480-68b61a419ff0/w/crates/radicle-term)
Checking radicle-crypto v0.12.0 (/e9f562da-883f-4539-a480-68b61a419ff0/w/crates/radicle-crypto)
Checking radicle-cob v0.14.0 (/e9f562da-883f-4539-a480-68b61a419ff0/w/crates/radicle-cob)
Checking radicle-crdt v0.1.0 (/e9f562da-883f-4539-a480-68b61a419ff0/w/crates/radicle-crdt)
Checking radicle v0.15.0 (/e9f562da-883f-4539-a480-68b61a419ff0/w/crates/radicle)
Checking radicle-fetch v0.11.0 (/e9f562da-883f-4539-a480-68b61a419ff0/w/crates/radicle-fetch)
Checking radicle-cli-test v0.11.0 (/e9f562da-883f-4539-a480-68b61a419ff0/w/crates/radicle-cli-test)
Checking radicle-schemars v0.1.0 (/e9f562da-883f-4539-a480-68b61a419ff0/w/crates/radicle-schemars)
Checking radicle-tools v0.9.0 (/e9f562da-883f-4539-a480-68b61a419ff0/w/crates/radicle-tools)
Finished `dev` profile [unoptimized + debuginfo] target(s) in 45.51s
+ cargo build --all-targets --workspace
Compiling cfg-if v1.0.0
Compiling libc v0.2.155
Compiling shlex v1.3.0
Compiling memchr v2.7.2
Compiling serde v1.0.219
Compiling regex-syntax v0.8.5
Compiling jobserver v0.1.31
Compiling getrandom v0.2.15
Compiling cc v1.2.2
Compiling aho-corasick v1.1.3
Compiling regex-automata v0.4.9
Compiling smallvec v1.13.2
Compiling typenum v1.17.0
Compiling generic-array v0.14.7
Compiling rand_core v0.6.4
Compiling fastrand v2.1.0
Compiling log v0.4.21
Compiling bitflags v2.5.0
Compiling zerofrom v0.1.6
Compiling crypto-common v0.1.6
Compiling stable_deref_trait v1.2.0
Compiling subtle v2.5.0
Compiling yoke v0.7.5
Compiling zeroize v1.7.0
Compiling once_cell v1.21.3
Compiling zerovec v0.10.4
Compiling tinyvec_macros v0.1.1
Compiling cpufeatures v0.2.12
Compiling tinyvec v1.6.0
Compiling writeable v0.5.5
Compiling litemap v0.7.5
Compiling tinystr v0.7.6
Compiling unicode-normalization v0.1.23
Compiling icu_locid v1.5.0
Compiling block-padding v0.3.3
Compiling inout v0.1.3
Compiling bstr v1.9.1
Compiling icu_locid_transform_data v1.5.1
Compiling block-buffer v0.10.4
Compiling icu_provider v1.5.0
Compiling digest v0.10.7
Compiling icu_locid_transform v1.5.0
Compiling cipher v0.4.4
Compiling icu_properties_data v1.5.1
Compiling icu_collections v1.5.0
Compiling icu_normalizer_data v1.5.1
Compiling write16 v1.0.0
Compiling utf8_iter v1.0.4
Compiling hashbrown v0.14.3
Compiling icu_properties v1.5.1
Compiling utf16_iter v1.0.5
Compiling adler2 v2.0.0
Compiling itoa v1.0.11
Compiling miniz_oxide v0.8.8
Compiling crc32fast v1.4.0
Compiling percent-encoding v2.3.1
Compiling thiserror v1.0.69
Compiling sha2 v0.10.8
Compiling linux-raw-sys v0.4.13
Compiling form_urlencoded v1.2.1
Compiling rustix v0.38.34
Compiling universal-hash v0.5.1
Compiling opaque-debug v0.3.1
Compiling libz-sys v1.1.16
Compiling byteorder v1.5.0
Compiling icu_normalizer v1.5.0
Compiling idna_adapter v1.2.0
Compiling idna v1.0.3
Compiling signature v1.6.4
Compiling amplify_num v0.5.2
Compiling url v2.5.4
Compiling ascii v1.1.0
Compiling data-encoding v2.5.0
Compiling data-encoding-macro v0.1.14
Compiling amplify v4.6.0
Compiling tempfile v3.10.1
Compiling ed25519 v1.5.3
Compiling libgit2-sys v0.17.0+1.8.1
Compiling aead v0.5.2
Compiling base-x v0.2.11
Compiling ct-codecs v1.1.1
Compiling multibase v0.9.1
Compiling ec25519 v0.1.0
Compiling poly1305 v0.8.0
Compiling chacha20 v0.9.1
Compiling num-traits v0.2.19
Compiling cyphergraphy v0.3.0
Compiling keccak v0.1.5
Compiling polyval v0.6.2
Compiling git-ref-format-core v0.3.1
Compiling sha3 v0.10.8
Compiling hmac v0.12.1
Compiling sqlite3-src v0.5.1
Compiling base32 v0.4.0
Compiling ppv-lite86 v0.2.17
Compiling base64ct v1.6.0
Compiling rand_chacha v0.3.1
Compiling pem-rfc7468 v0.7.0
Compiling cypheraddr v0.4.0
Compiling pbkdf2 v0.12.2
Compiling git-ref-format-macro v0.3.1
Compiling ghash v0.5.1
Compiling chacha20poly1305 v0.10.1
Compiling ctr v0.9.2
Compiling aes v0.8.4
Compiling git-ref-format v0.3.1
Compiling noise-framework v0.4.0
Compiling aes-gcm v0.10.3
Compiling socks5-client v0.4.1
Compiling ssh-encoding v0.2.0
Compiling rand v0.8.5
Compiling blowfish v0.9.1
Compiling cbc v0.1.2
Compiling radicle-std-ext v0.1.0
Compiling equivalent v1.0.1
Compiling indexmap v2.2.6
Compiling ssh-cipher v0.2.0
Compiling bcrypt-pbkdf v0.10.0
Compiling cyphernet v0.5.2
Compiling crossbeam-utils v0.8.19
Compiling ryu v1.0.17
Compiling signature v2.2.0
Compiling serde_json v1.0.140
Compiling ssh-key v0.6.6
Compiling thiserror v2.0.12
Compiling crossbeam-channel v0.5.15
Compiling qcheck v1.0.0
Compiling radicle-ssh v0.9.0 (/e9f562da-883f-4539-a480-68b61a419ff0/w/crates/radicle-ssh)
Compiling ref-cast v1.0.24
Compiling lazy_static v1.5.0
Compiling dyn-clone v1.0.17
Compiling siphasher v1.0.1
Compiling radicle-dag v0.10.0 (/e9f562da-883f-4539-a480-68b61a419ff0/w/crates/radicle-dag)
Compiling nonempty v0.9.0
Compiling tree-sitter-language v0.1.2
Compiling scopeguard v1.2.0
Compiling lock_api v0.4.11
Compiling parking_lot_core v0.9.9
Compiling iana-time-zone v0.1.60
Compiling chrono v0.4.38
Compiling parking_lot v0.12.3
Compiling schemars v1.0.0-alpha.17
Compiling colored v2.1.0
Compiling bytesize v2.0.1
Compiling localtime v1.3.1
Compiling base64 v0.21.7
Compiling anstyle-query v1.0.2
Compiling gix-trace v0.1.12
Compiling anyhow v1.0.82
Compiling faster-hex v0.9.0
Compiling sem_safe v0.2.0
Compiling errno v0.3.9
Compiling gix-utils v0.1.14
Compiling signals_receipts v0.2.0
Compiling gix-hash v0.15.1
Compiling same-file v1.0.6
Compiling walkdir v2.5.0
Compiling radicle-signals v0.11.0 (/e9f562da-883f-4539-a480-68b61a419ff0/w/crates/radicle-signals)
Compiling prodash v29.0.2
Compiling flate2 v1.1.1
Compiling tree-sitter v0.24.4
Compiling sha1_smol v1.0.0
Compiling gix-features v0.39.1
Compiling regex v1.11.1
Compiling numtoa v0.1.0
Compiling unicode-segmentation v1.11.0
Compiling xattr v1.3.1
Compiling filetime v0.2.23
Compiling lexopt v0.3.0
Compiling home v0.5.9
Compiling gix-path v0.10.15
Compiling newline-converter v0.3.0
Compiling tar v0.4.40
Compiling termion v2.0.3
Compiling fxhash v0.2.1
Compiling unicode-width v0.1.11
Compiling streaming-iterator v0.1.9
Compiling radicle-surf v0.22.0
Compiling inquire v0.7.5
Compiling unicode-display-width v0.3.0
Compiling termion v3.0.0
Compiling tree-sitter-rust v0.23.2
Compiling tree-sitter-typescript v0.23.2
Compiling tree-sitter-go v0.23.4
Compiling tree-sitter-css v0.23.1
Compiling tree-sitter-ruby v0.23.1
Compiling tree-sitter-md v0.3.2
Compiling tree-sitter-json v0.24.8
Compiling tree-sitter-python v0.23.4
Compiling tree-sitter-toml-ng v0.6.0
Compiling tree-sitter-bash v0.23.3
Compiling tree-sitter-c v0.23.2
Compiling tree-sitter-html v0.23.2
Compiling sqlite3-sys v0.15.2
Compiling sqlite v0.32.0
Compiling nonempty v0.5.0
Compiling radicle-cli v0.13.0 (/e9f562da-883f-4539-a480-68b61a419ff0/w/crates/radicle-cli)
Compiling base64 v0.13.1
Compiling tree-sitter-highlight v0.24.4
Compiling timeago v0.4.2
Compiling jiff v0.2.1
Compiling winnow v0.6.26
Compiling gix-hashtable v0.6.0
Compiling gix-validate v0.9.4
Compiling memmap2 v0.9.4
Compiling gix-chunk v0.4.11
Compiling gix-commitgraph v0.25.1
Compiling gix-fs v0.12.1
Compiling gix-tempfile v15.0.0
Compiling shell-words v1.1.0
Compiling gix-command v0.4.1
Compiling utf8parse v0.2.1
Compiling anstyle-parse v0.2.3
Compiling gix-lock v15.0.1
Compiling gix-config-value v0.14.12
Compiling gix-url v0.28.2
Compiling gix-quote v0.4.15
Compiling gix-sec v0.10.12
Compiling anstyle v1.0.6
Compiling colorchoice v1.0.0
Compiling anstream v0.6.13
Compiling gix-prompt v0.9.1
Compiling gix-date v0.9.4
Compiling gix-packetline v0.18.4
Compiling gix-actor v0.33.2
Compiling gix-object v0.46.1
Compiling gix-transport v0.44.0
Compiling gix-revwalk v0.17.0
Compiling gix-traverse v0.43.1
Compiling gix-revision v0.31.1
Compiling gix-diff v0.49.0
Compiling gix-pack v0.56.0
Compiling gix-refspec v0.27.0
Compiling gix-negotiate v0.17.0
Compiling gix-ref v0.49.1
Compiling gix-credentials v0.26.0
Compiling snapbox-macros v0.3.8
Compiling gix-shallow v0.1.0
Compiling arc-swap v1.7.1
Compiling normalize-line-endings v0.3.0
Compiling similar v2.5.0
Compiling snapbox v0.4.17
Compiling gix-odb v0.66.0
Compiling gix-protocol v0.47.0
Compiling popol v3.0.0
Compiling either v1.11.0
Compiling io-reactor v0.5.2
Compiling salsa20 v0.10.2
Compiling socket2 v0.5.7
Compiling radicle-node v0.11.0 (/e9f562da-883f-4539-a480-68b61a419ff0/w/crates/radicle-node)
Compiling siphasher v0.3.11
Compiling yansi v0.5.1
Compiling diff v0.1.13
Compiling bloomy v1.2.0
Compiling netservices v0.8.0
Compiling pretty_assertions v1.4.0
Compiling scrypt v0.11.0
Compiling num-integer v0.1.46
Compiling radicle-systemd v0.9.0 (/e9f562da-883f-4539-a480-68b61a419ff0/w/crates/radicle-systemd)
Compiling escargot v0.5.10
Compiling num-bigint v0.4.6
Compiling radicle-remote-helper v0.10.0 (/e9f562da-883f-4539-a480-68b61a419ff0/w/crates/radicle-remote-helper)
Compiling num-iter v0.1.45
Compiling num-complex v0.4.6
Compiling zerocopy v0.7.35
Compiling num-rational v0.4.2
Compiling borrow-or-share v0.2.2
Compiling bit-vec v0.8.0
Compiling num v0.4.3
Compiling bit-set v0.8.0
Compiling fluent-uri v0.3.2
Compiling ahash v0.8.11
Compiling phf_shared v0.11.3
Compiling uuid v1.16.0
Compiling outref v0.5.2
Compiling vsimd v0.8.0
Compiling referencing v0.30.0
Compiling phf v0.11.3
Compiling fancy-regex v0.14.0
Compiling uuid-simd v0.8.0
Compiling fraction v0.15.3
Compiling email_address v0.2.9
Compiling bytecount v0.6.8
Compiling base64 v0.22.1
Compiling num-cmp v0.1.0
Compiling emojis v0.6.4
Compiling jsonschema v0.30.0
Compiling git2 v0.19.0
Compiling radicle-git-ext v0.8.1
Compiling radicle-term v0.12.0 (/e9f562da-883f-4539-a480-68b61a419ff0/w/crates/radicle-term)
Compiling radicle-crypto v0.12.0 (/e9f562da-883f-4539-a480-68b61a419ff0/w/crates/radicle-crypto)
Compiling radicle-cob v0.14.0 (/e9f562da-883f-4539-a480-68b61a419ff0/w/crates/radicle-cob)
Compiling radicle-crdt v0.1.0 (/e9f562da-883f-4539-a480-68b61a419ff0/w/crates/radicle-crdt)
Compiling radicle v0.15.0 (/e9f562da-883f-4539-a480-68b61a419ff0/w/crates/radicle)
Compiling radicle-fetch v0.11.0 (/e9f562da-883f-4539-a480-68b61a419ff0/w/crates/radicle-fetch)
Compiling radicle-cli-test v0.11.0 (/e9f562da-883f-4539-a480-68b61a419ff0/w/crates/radicle-cli-test)
Compiling radicle-tools v0.9.0 (/e9f562da-883f-4539-a480-68b61a419ff0/w/crates/radicle-tools)
Compiling radicle-schemars v0.1.0 (/e9f562da-883f-4539-a480-68b61a419ff0/w/crates/radicle-schemars)
Finished `dev` profile [unoptimized + debuginfo] target(s) in 1m 13s
+ cargo doc --workspace --no-deps
Checking regex-automata v0.4.9
Compiling syn v1.0.109
Checking idna v1.0.3
Checking radicle-ssh v0.9.0 (/e9f562da-883f-4539-a480-68b61a419ff0/w/crates/radicle-ssh)
Compiling num-traits v0.2.19
Checking url v2.5.4
Checking git2 v0.19.0
Checking radicle-dag v0.10.0 (/e9f562da-883f-4539-a480-68b61a419ff0/w/crates/radicle-dag)
Compiling amplify_syn v2.0.1
Checking bstr v1.9.1
Compiling data-encoding-macro-internal v0.1.12
Compiling proc-macro-error v1.0.4
Compiling amplify_derive v4.0.0
Checking git-ref-format-core v0.3.1
Compiling git-ref-format-macro v0.3.1
Checking data-encoding-macro v0.1.14
Checking multibase v0.9.1
Checking chrono v0.4.38
Checking gix-path v0.10.15
Checking git-ref-format v0.3.1
Checking radicle-signals v0.11.0 (/e9f562da-883f-4539-a480-68b61a419ff0/w/crates/radicle-signals)
Checking radicle-git-ext v0.8.1
Checking regex v1.11.1
Checking gix-date v0.9.4
Checking tree-sitter v0.24.4
Checking gix-actor v0.33.2
Checking gix-validate v0.9.4
Checking radicle-surf v0.22.0
Checking gix-object v0.46.1
Checking tree-sitter-highlight v0.24.4
Checking tree-sitter-toml-ng v0.6.0
Compiling radicle-cli v0.13.0 (/e9f562da-883f-4539-a480-68b61a419ff0/w/crates/radicle-cli)
Checking radicle-term v0.12.0 (/e9f562da-883f-4539-a480-68b61a419ff0/w/crates/radicle-term)
Checking gix-commitgraph v0.25.1
Checking gix-command v0.4.1
Checking gix-config-value v0.14.12
Checking gix-url v0.28.2
Checking amplify v4.6.0
Checking gix-revwalk v0.17.0
Checking gix-quote v0.4.15
Checking gix-prompt v0.9.1
Checking gix-traverse v0.43.1
Checking gix-revision v0.31.1
Checking cyphergraphy v0.3.0
Checking gix-diff v0.49.0
Checking cypheraddr v0.4.0
Checking noise-framework v0.4.0
Checking gix-packetline v0.18.4
Checking gix-pack v0.56.0
Checking gix-refspec v0.27.0
Checking socks5-client v0.4.1
Checking cyphernet v0.5.2
Checking gix-transport v0.44.0
Checking radicle-crypto v0.12.0 (/e9f562da-883f-4539-a480-68b61a419ff0/w/crates/radicle-crypto)
Checking gix-credentials v0.26.0
Checking gix-negotiate v0.17.0
Checking gix-ref v0.49.1
Checking gix-shallow v0.1.0
Checking io-reactor v0.5.2
Checking radicle-cob v0.14.0 (/e9f562da-883f-4539-a480-68b61a419ff0/w/crates/radicle-cob)
Compiling radicle-node v0.11.0 (/e9f562da-883f-4539-a480-68b61a419ff0/w/crates/radicle-node)
Checking gix-odb v0.66.0
Checking radicle v0.15.0 (/e9f562da-883f-4539-a480-68b61a419ff0/w/crates/radicle)
Checking gix-protocol v0.47.0
Checking netservices v0.8.0
Checking radicle-systemd v0.9.0 (/e9f562da-883f-4539-a480-68b61a419ff0/w/crates/radicle-systemd)
Documenting radicle v0.15.0 (/e9f562da-883f-4539-a480-68b61a419ff0/w/crates/radicle)
Documenting radicle-cob v0.14.0 (/e9f562da-883f-4539-a480-68b61a419ff0/w/crates/radicle-cob)
Documenting radicle-crdt v0.1.0 (/e9f562da-883f-4539-a480-68b61a419ff0/w/crates/radicle-crdt)
Documenting radicle-crypto v0.12.0 (/e9f562da-883f-4539-a480-68b61a419ff0/w/crates/radicle-crypto)
Documenting radicle-term v0.12.0 (/e9f562da-883f-4539-a480-68b61a419ff0/w/crates/radicle-term)
Documenting radicle-signals v0.11.0 (/e9f562da-883f-4539-a480-68b61a419ff0/w/crates/radicle-signals)
Documenting radicle-ssh v0.9.0 (/e9f562da-883f-4539-a480-68b61a419ff0/w/crates/radicle-ssh)
Documenting radicle-dag v0.10.0 (/e9f562da-883f-4539-a480-68b61a419ff0/w/crates/radicle-dag)
Documenting radicle-systemd v0.9.0 (/e9f562da-883f-4539-a480-68b61a419ff0/w/crates/radicle-systemd)
Checking radicle-fetch v0.11.0 (/e9f562da-883f-4539-a480-68b61a419ff0/w/crates/radicle-fetch)
Documenting radicle-cli v0.13.0 (/e9f562da-883f-4539-a480-68b61a419ff0/w/crates/radicle-cli)
Documenting radicle-schemars v0.1.0 (/e9f562da-883f-4539-a480-68b61a419ff0/w/crates/radicle-schemars)
Documenting radicle-node v0.11.0 (/e9f562da-883f-4539-a480-68b61a419ff0/w/crates/radicle-node)
Documenting radicle-fetch v0.11.0 (/e9f562da-883f-4539-a480-68b61a419ff0/w/crates/radicle-fetch)
Documenting radicle-cli-test v0.11.0 (/e9f562da-883f-4539-a480-68b61a419ff0/w/crates/radicle-cli-test)
Documenting radicle-remote-helper v0.10.0 (/e9f562da-883f-4539-a480-68b61a419ff0/w/crates/radicle-remote-helper)
Checking radicle-remote-helper v0.10.0 (/e9f562da-883f-4539-a480-68b61a419ff0/w/crates/radicle-remote-helper)
Documenting radicle-tools v0.9.0 (/e9f562da-883f-4539-a480-68b61a419ff0/w/crates/radicle-tools)
Finished `dev` profile [unoptimized + debuginfo] target(s) in 11.77s
Generated /e9f562da-883f-4539-a480-68b61a419ff0/w/target/doc/radicle/index.html and 23 other files
+ cargo test --workspace --no-fail-fast
Finished `test` profile [unoptimized + debuginfo] target(s) in 0.12s
Running unittests src/lib.rs (target/debug/deps/radicle-b4bf1c275801b632)
running 188 tests
test canonical::formatter::test::ascii_control_characters ... ok
test canonical::formatter::test::ordered_nested_object ... ok
test canonical::formatter::test::securesystemslib_asserts ... ok
test cob::cache::migrations::_2::tests::test_patch_json_deserialization ... ok
test cob::common::test::test_color ... ok
test cob::cache::tests::test_check_version ... ok
test cob::common::test::test_emojis ... ok
test cob::cache::tests::test_migrate_to ... ok
test cob::cache::migrations::_2::tests::test_migration_2 ... ok
test cob::identity::test::prop_json_eq_str ... ok
test cob::identity::test::test_identity_redact_revision ... ok
test cob::identity::test::test_identity_reject_concurrent ... ok
test cob::identity::test::test_identity_remove_delegate_concurrent ... ok
test cob::identity::test::test_identity_update_rejected ... ok
test cob::identity::test::test_identity_updates ... ok
test cob::issue::cache::tests::test_counts ... ok
test cob::issue::cache::tests::test_get ... ok
test cob::issue::cache::tests::test_is_empty ... ok
test cob::issue::cache::tests::test_list ... ok
test cob::issue::cache::tests::test_list_by_status ... ok
test cob::issue::cache::tests::test_remove ... ok
test cob::identity::test::test_valid_identity ... ok
test cob::identity::test::test_identity_updates_concurrent ... ok
test cob::issue::test::test_embeds ... ok
test cob::issue::test::test_embeds_edit ... ok
test cob::issue::test::test_invalid_actions ... ok
test cob::issue::test::test_concurrency ... ok
test cob::identity::test::test_identity_updates_concurrent_outdated ... ok
test cob::issue::test::test_invalid_tx ... ok
test cob::issue::test::test_invalid_cob ... ok
test cob::issue::test::test_invalid_tx_reference ... ok
test cob::issue::test::test_issue_comment_redact ... ok
test cob::issue::test::test_issue_all ... ok
test cob::issue::test::test_issue_comment ... ok
test cob::issue::test::test_issue_create_and_assign ... ok
test cob::issue::test::test_issue_create_and_change_state ... ok
test cob::issue::test::test_issue_create_and_get ... ok
test cob::issue::test::test_issue_create_and_reassign ... ok
test cob::issue::test::test_issue_edit ... ok
test cob::issue::test::test_issue_edit_description ... ok
test cob::issue::test::test_issue_create_and_unassign ... ok
test cob::issue::test::test_issue_label ... ok
test cob::issue::test::test_issue_state_serde ... ok
test cob::issue::test::test_ordering ... ok
test cob::issue::test::test_issue_multilines ... ok
test cob::issue::test::test_issue_react ... ok
test cob::issue::test::test_issue_reply ... ok
test cob::patch::cache::tests::test_is_empty ... ok
test cob::patch::cache::tests::test_get ... ok
test cob::patch::cache::tests::test_counts ... ok
test cob::patch::cache::tests::test_list ... ok
test cob::patch::test::test_json ... ok
test cob::patch::test::test_json_serialization ... ok
test cob::patch::cache::tests::test_list_by_status ... ok
test cob::patch::test::test_patch_create_and_get ... ok
test cob::patch::test::test_patch_discussion ... ok
test cob::patch::cache::tests::test_remove ... ok
test cob::patch::test::test_patch_merge ... ok
test cob::patch::test::test_patch_redact ... ok
test cob::patch::test::test_patch_review ... ok
test cob::patch::test::test_patch_review_comment ... ok
test cob::patch::test::test_patch_review_duplicate ... ok
test cob::patch::test::test_patch_review_edit ... ok
test cob::patch::test::test_patch_review_remove_summary ... ok
test cob::patch::test::test_patch_review_edit_comment ... ok
test cob::patch::test::test_reactions_json_serialization ... ok
test cob::patch::test::test_revision_edit_redact ... ok
test cob::patch::test::test_revision_reaction ... ok
test cob::patch::test::test_revision_review_merge_redacted ... ok
test cob::patch::test::test_patch_review_revision_redact ... ok
test cob::thread::tests::test_comment_edit_missing ... ok
test cob::thread::tests::test_comment_edit_redacted ... ok
test cob::thread::tests::test_comment_redact_missing ... ok
test cob::thread::tests::test_duplicate_comments ... ok
test cob::patch::cache::tests::test_find_by_revision ... ok
test cob::thread::tests::test_edit_comment ... ok
test cob::thread::tests::test_redact_comment ... ok
test cob::thread::tests::test_timeline ... ok
test git::canonical::tests::test_quorum_merges ... ok
test cob::patch::test::test_patch_update ... ok
test git::test::test_version_from_str ... ok
test git::test::test_version_ord ... ok
test identity::did::test::test_did_encode_decode ... ok
test identity::did::test::test_did_vectors ... ok
test identity::doc::id::test::prop_from_str ... ok
test git::canonical::tests::test_quorum ... ok
test identity::doc::test::test_canonical_doc ... ok
test identity::doc::test::test_canonical_example ... ok
test identity::doc::test::test_duplicate_dids ... ok
test identity::doc::test::test_future_version_error ... ok
test identity::doc::test::test_is_valid_version ... ok
test git::canonical::tests::test_quorum_properties ... ok
test identity::doc::test::test_not_found ... ok
test identity::doc::test::test_parse_version ... ok
test identity::doc::test::test_visibility_json ... ok
test identity::project::test::test_project_name ... ok
test node::address::store::test::test_alias ... ok
test node::address::store::test::test_disconnected ... ok
test node::address::store::test::test_disconnected_ban ... ok
test node::address::store::test::test_empty ... ok
test node::address::store::test::test_entries ... ok
test identity::doc::test::test_max_delegates ... ok
test node::address::store::test::test_get_none ... ok
test node::address::store::test::test_insert_and_get ... ok
test node::address::store::test::test_insert_and_remove ... ok
test node::address::store::test::test_insert_and_update ... ok
test node::address::store::test::test_insert_duplicate ... ok
test node::address::store::test::test_remove_nothing ... ok
test node::address::store::test::test_node_aliases ... ok
test node::db::test::test_version ... ok
test node::features::test::test_operations ... ok
test node::notifications::store::test::test_branch_notifications ... ok
test node::notifications::store::test::test_clear ... ok
test node::notifications::store::test::test_cob_notifications ... ok
test node::notifications::store::test::test_counts_by_repo ... ok
test node::notifications::store::test::test_duplicate_notifications ... ok
test node::notifications::store::test::test_notification_status ... ok
test node::policy::store::test::test_follow_and_unfollow_node ... ok
test node::policy::store::test::test_node_aliases ... ok
test node::policy::store::test::test_node_policies ... ok
test node::policy::store::test::test_node_policy ... ok
test node::policy::store::test::test_repo_policies ... ok
test node::policy::store::test::test_repo_policy ... ok
test node::policy::store::test::test_seed_and_unseed_repo ... ok
test node::policy::store::test::test_update_alias ... ok
test node::policy::store::test::test_update_scope ... ok
test node::refs::store::test::test_count ... ok
test node::refs::store::test::test_set_and_delete ... ok
test node::refs::store::test::test_set_and_get ... ok
test cob::thread::tests::prop_ordering ... ok
test node::routing::test::test_entries ... ok
test node::routing::test::test_insert_and_get ... ok
test node::routing::test::test_insert_and_get_resources ... ok
test node::routing::test::test_insert_duplicate ... ok
test node::routing::test::test_count ... ok
test node::routing::test::test_insert_existing_updated_time ... ok
test node::routing::test::test_len ... ok
test node::routing::test::test_insert_and_remove ... ok
test node::routing::test::test_remove_many ... ok
test node::routing::test::test_remove_redundant ... ok
test node::routing::test::test_update_existing_multi ... ok
test node::sync::announce::test::announcer_must_reach_preferred_seeds ... ok
test node::sync::announce::test::announcer_reached_max_replication_target ... ok
test node::sync::announce::test::announcer_timed_out ... ok
test node::routing::test::test_prune ... ok
test node::sync::announce::test::announcer_reached_min_replication_target ... ok
test node::sync::announce::test::announcer_will_minimise_replication_factor ... ok
test node::sync::fetch::test::all_nodes_are_candidates ... ok
test node::sync::announce::test::cannot_construct_announcer ... ok
test node::sync::fetch::test::all_nodes_are_fetchable ... ok
test node::sync::fetch::test::ignores_duplicates_and_local_node ... ok
test node::sync::fetch::test::preferred_seeds_target_returned_over_replicas ... ok
test node::sync::fetch::test::could_not_reach_target ... ok
test node::sync::fetch::test::reaches_target_of_preferred_seeds ... ok
test node::sync::test::ensure_replicas_construction ... ok
test node::sync::test::replicas_constrain_to ... ok
test node::test::test_alias ... ok
test node::test::test_command_result ... ok
test node::test::test_user_agent ... ok
test node::timestamp::tests::test_timestamp_max ... ok
test node::sync::fetch::test::reaches_target_of_max_replicas ... ok
test profile::test::canonicalize_home ... ok
test profile::test::test_config ... ok
test node::sync::fetch::test::reaches_target_of_replicas ... ok
test rad::tests::test_fork ... ok
test rad::tests::test_checkout ... ok
test serde_ext::test::test_localtime ... ok
test serde_ext::test::test_localtime_ext ... ok
test rad::tests::test_init ... ok
test storage::git::tests::test_references_of ... ok
test profile::config::test::schema ... ok
test storage::git::transport::local::url::test::test_url_parse ... ok
test storage::git::transport::local::url::test::test_url_to_string ... ok
test storage::git::transport::remote::url::test::test_url_parse ... ok
test storage::refs::tests::prop_canonical_roundtrip ... ok
test storage::git::tests::test_sign_refs ... ok
test storage::tests::test_storage ... ok
test test::assert::test::assert_with_message ... ok
test test::assert::test::test_assert_no_move ... ok
test test::assert::test::test_assert_panic_0 - should panic ... ok
test test::assert::test::test_assert_panic_1 - should panic ... ok
test test::assert::test::test_assert_panic_2 - should panic ... ok
test test::assert::test::test_assert_succeed ... ok
test test::assert::test::test_panic_message ... ok
test version::test::test_version ... ok
test storage::git::tests::test_remote_refs ... ok
test storage::refs::tests::test_rid_verification ... ok
test identity::doc::test::prop_encode_decode ... ok
test result: ok. 188 passed; 0 failed; 0 ignored; 0 measured; 0 filtered out; finished in 2.35s
Running unittests src/lib.rs (target/debug/deps/radicle_cli-c4082d6a1fa8a293)
running 14 tests
test commands::rad_patch::review::builder::tests::test_review_comments_basic ... ok
test commands::rad_inspect::test::test_tree ... ok
test commands::rad_patch::review::builder::tests::test_review_comments_before ... ok
test commands::rad_patch::review::builder::tests::test_review_comments_multiline ... ok
test git::pretty_diff::test::test_pretty ... ignored
test git::ddiff::tests::diff_encode_decode_ddiff_hunk ... ok
test commands::rad_patch::review::builder::tests::test_review_comments_split_hunk ... ok
test git::unified_diff::test::test_diff_content_encode_decode_content ... ok
test git::unified_diff::test::test_diff_encode_decode_diff ... ok
test terminal::format::test::test_bytes ... ok
test terminal::format::test::test_strip_comments ... ok
test terminal::patch::test::test_edit_display_message ... ok
test terminal::patch::test::test_create_display_message ... ok
test terminal::patch::test::test_update_display_message ... ok
test result: ok. 13 passed; 0 failed; 1 ignored; 0 measured; 0 filtered out; finished in 0.01s
Running unittests src/main.rs (target/debug/deps/rad-ada175d36f8264d9)
running 0 tests
test result: ok. 0 passed; 0 failed; 0 ignored; 0 measured; 0 filtered out; finished in 0.00s
Running tests/commands.rs (target/debug/deps/commands-1e8a24d540410ee4)
running 96 tests
test framework_home ... ok
test git_push_amend ... ok
test git_push_and_fetch ... ok
test git_push_diverge ... ok
test rad_auth ... ok
test rad_auth_errors ... ok
test rad_block ... ok
test rad_checkout ... ok
test git_push_rollback ... ok
test git_tag ... ok
test git_push_converge ... ok
test rad_clone ... ok
test rad_clone_connect ... ok
test rad_clean ... ok
test rad_clone_unknown ... ok
test rad_clone_directory ... ok
test rad_clone_all ... ok
test rad_cob_multiset ... ok
test rad_cob_log ... ok
test rad_clone_partial_fail ... ok
test rad_cob_migrate ... ok
test rad_cob_show ... ok
test rad_config ... ok
test rad_cob_update_identity ... ok
test rad_cob_update ... ok
test rad_diff ... ok
test rad_id_collaboration ... ignored, slow
test rad_id ... ok
test rad_id_conflict ... ok
test rad_id_private ... ok
test rad_id_multi_delegate ... ok
test rad_id_threshold ... ok
test rad_id_unknown_field ... ok
test rad_id_update_delete_field ... ok
test rad_id_threshold_soft_fork ... ok
test rad_init ... ok
test rad_init_existing ... ok
test rad_init_no_git ... ok
test rad_init_no_seed ... ok
test rad_init_private ... ok
test rad_inbox ... ok
test rad_init_private_clone ... ok
test rad_init_private_no_seed ... ok
test rad_init_private_clone_seed ... ok
test rad_init_private_seed ... ok
test rad_fetch ... ok
test rad_fork ... ok
test rad_init_sync_not_connected ... ok
test rad_init_sync_preferred ... ok
test rad_init_with_existing_remote ... ok
test rad_inspect ... ok
test rad_issue ... ok
test rad_merge_after_update ... ok
test rad_merge_no_ff ... ok
test rad_merge_via_push ... ok
test rad_node_connect ... ok
test rad_patch ... ok
test rad_node ... ok
test rad_patch_ahead_behind ... ok
test rad_patch_change_base ... ok
test rad_patch_checkout ... ok
test rad_patch_checkout_revision ... ok
test rad_patch_checkout_force ... ok
test rad_patch_detached_head ... ok
test rad_patch_diff ... ok
test rad_patch_draft ... ok
test rad_init_sync_and_clone ... ok
test rad_init_sync_timeout ... ok
test rad_patch_edit ... ok
test rad_patch_fetch_2 ... ok
test rad_patch_merge_draft ... ok
test rad_patch_delete ... ok
test rad_patch_fetch_1 ... ok
test rad_patch_revert_merge ... ok
test rad_patch_update ... ok
test rad_patch_open_explore ... ok
test rad_publish ... ok
test rad_patch_via_push ... ok
test rad_review_by_hunk ... ok
test rad_seed_and_follow ... ok
test rad_remote ... ok
test rad_seed_many ... ok
test rad_self ... ok
test rad_sync_without_node ... ok
test rad_unseed ... ok
test rad_push_and_pull_patches ... ok
test rad_unseed_many ... ok
test rad_warn_old_nodes ... FAILED
test rad_sync ... ok
test rad_watch ... ok
test test_clone_without_seeds ... ok
test test_cob_deletion ... ok
test test_cob_replication ... ok
test rad_workflow ... ok
test rad_patch_pull_update ... ok
test test_replication_via_seed ... ok
failures:
---- rad_warn_old_nodes stdout ----
1788795595 test: Using PATH ["/e9f562da-883f-4539-a480-68b61a419ff0/w/crates/radicle-cli/target/debug", "/usr/local/cargo/bin", "/usr/local/sbin", "/usr/local/bin", "/usr/sbin", "/usr/bin", "/sbin", "/bin", "/tmp/.tmppOd1me"]
1788795595 test: rad-warn-old-nodes.md: Running `/e9f562da-883f-4539-a480-68b61a419ff0/w/target/debug/rad` with ["config", "push", "preferredSeeds", "z6MkrLMMsiPWUcNPHcRajuMi9mDfYckSoJyPwwnknocNYPm7@seed.radicle.garden:8776"] in `/tmp/.tmppOd1me`..
1788795595 test: rad-warn-old-nodes.md: Running `/e9f562da-883f-4539-a480-68b61a419ff0/w/target/debug/rad` with ["config", "push", "node.connect", "z6Mkmqogy2qEM2ummccUthFEaaHvyYmYBYh3dbe9W4ebScxo@ash.radicle.garden:8776"] in `/tmp/.tmppOd1me`..
1788795595 test: rad-warn-old-nodes.md: Running `/e9f562da-883f-4539-a480-68b61a419ff0/w/target/debug/rad` with ["debug"] in `/tmp/.tmppOd1me`..
thread 'rad_warn_old_nodes' panicked at crates/radicle-cli-test/src/lib.rs:487:36:
--- Expected
++++ actual: stdout
1 1 | {
2 2 | "radExe": "[..]",
3 3 | "radVersion": "[..]",
4 - "radicleNodeVersion": "radicle-node [..]",
5 - "gitRemoteRadVersion": "git-remote-rad [..]",
6 - "gitVersion": "git version [..]",
7 - "sshVersion": "[..]",
8 - "gitHead": "[..]",
4 + "radicleNodeVersion": "<unknown>",
5 + "gitRemoteRadVersion": "git-remote-rad pre-release (a052e5d3)",
6 + "gitVersion": "git version 2.47.3",
7 + "sshVersion": "OpenSSH_10.0p2 Debian-7, OpenSSL 3.5.4 30 Sep 2025",
8 + "gitHead": "a052e5d3",
9 9 | "log": {
10 10 | "filename": "[..]",
11 11 | "exists": false,
12 12 | "len": null
13 13 | },
⋮
29 29 | "warnings": [
30 30 | "Value of configuration option `node.connect` at index 0 mentions node with address 'ash.radicle.garden:8776', which has been renamed to 'rosa.radicle.xyz:8776'. Please update your configuration.",
31 31 | "Value of configuration option `preferred_seeds` at index 0 mentions node with address 'seed.radicle.garden:8776', which has been renamed to 'iris.radicle.xyz:8776'. Please update your configuration."
32 32 | ]
33 33 | }
Exit status: 0
note: run with `RUST_BACKTRACE=1` environment variable to display a backtrace
failures:
rad_warn_old_nodes
test result: FAILED. 94 passed; 1 failed; 1 ignored; 0 measured; 0 filtered out; finished in 70.86s
error: test failed, to rerun pass `-p radicle-cli --test commands`
Running unittests src/lib.rs (target/debug/deps/radicle_cli_test-354ae0a9d473645d)
running 3 tests
test tests::test_parse ... ok
test tests::test_run ... ok
test tests::test_example_spaced_brackets ... ok
test result: ok. 3 passed; 0 failed; 0 ignored; 0 measured; 0 filtered out; finished in 0.01s
Running unittests src/lib.rs (target/debug/deps/radicle_cob-e85912e820568959)
running 8 tests
test object::tests::test_serde ... ok
test tests::parse_refstr ... ok
test tests::invalid_parse_refstr ... ok
test tests::traverse_cobs ... ok
test tests::roundtrip ... ok
test type_name::test::valid_typenames ... ok
test tests::list_cobs ... ok
test tests::update_cob ... ok
test result: ok. 8 passed; 0 failed; 0 ignored; 0 measured; 0 filtered out; finished in 0.02s
Running unittests src/lib.rs (target/debug/deps/radicle_crdt-930be78070bafbbb)
running 24 tests
test immutable::test::test_merge_equal ... ok
test immutable::test::test_merge_inequal - should panic ... ok
test lwwmap::tests::test_insert ... ok
test lwwmap::tests::test_insert_remove ... ok
test lwwmap::tests::test_is_empty ... ok
test lwwmap::tests::test_remove_insert ... ok
test lwwreg::tests::prop_semilattice ... ok
test lwwreg::tests::test_merge ... ok
test lwwreg::tests::test_set_get ... ok
test gmap::tests::prop_semilattice ... ok
test lwwset::tests::test_insert ... ok
test lwwset::tests::test_insert_remove ... ok
test lwwset::tests::test_remove_insert ... ok
test redactable::test::prop_invariants ... ok
test redactable::test::test_both_present ... ok
test redactable::test::test_redacted ... ok
test test::test_generator ... ok
test tests::prop_bool_laws ... ok
test tests::prop_option_laws ... ok
test tests::test_bool ... ok
test tests::test_option ... ok
test gset::tests::prop_semilattice ... ok
test lwwmap::tests::prop_semilattice ... ok
test lwwset::tests::prop_semilattice ... ok
test result: ok. 24 passed; 0 failed; 0 ignored; 0 measured; 0 filtered out; finished in 0.09s
Running unittests src/lib.rs (target/debug/deps/radicle_crypto-5617725847bbf5b6)
running 12 tests
test ssh::fmt::test::test_fingerprint ... ok
test ssh::fmt::test::test_key ... ok
test ssh::test::prop_encode_decode_sk ... ok
test ssh::test::test_agent_encoding_remove ... ok
test ssh::test::test_agent_encoding_sign ... ok
test ssh::keystore::tests::test_init_no_passphrase ... ok
test tests::prop_key_equality ... ok
test tests::test_e25519_dh ... ok
test tests::test_encode_decode ... ok
test tests::prop_encode_decode ... ok
test ssh::keystore::tests::test_signer ... ok
test ssh::keystore::tests::test_init_passphrase ... ok
test result: ok. 12 passed; 0 failed; 0 ignored; 0 measured; 0 filtered out; finished in 0.84s
Running unittests src/lib.rs (target/debug/deps/radicle_dag-20ca1aca3d76c348)
running 20 tests
test tests::test_dependencies ... ok
test tests::test_cycle ... ok
test tests::test_contains ... ok
test tests::test_diamond ... ok
test tests::test_fold_reject ... ok
test tests::test_fold_multiple_roots ... ok
test tests::test_complex ... ok
test tests::test_get ... ok
test tests::test_is_empty ... ok
test tests::test_len ... ok
test tests::test_merge_1 ... ok
test tests::test_merge_2 ... ok
test tests::test_prune_1 ... ok
test tests::test_prune_2 ... ok
test tests::test_fold_diamond ... ok
test tests::test_prune_by_sorting ... ok
test tests::test_fold_sorting_2 ... ok
test tests::test_remove ... ok
test tests::test_siblings ... ok
test tests::test_fold_sorting_1 ... ok
test result: ok. 20 passed; 0 failed; 0 ignored; 0 measured; 0 filtered out; finished in 0.00s
Running unittests src/lib.rs (target/debug/deps/radicle_fetch-d2fb41089fc1c71d)
running 0 tests
test result: ok. 0 passed; 0 failed; 0 ignored; 0 measured; 0 filtered out; finished in 0.00s
Running unittests src/lib.rs (target/debug/deps/radicle_node-b756a84f7d576953)
running 113 tests
test deserializer::test::prop_decode_next ... ok
test deserializer::test::test_decode_next ... ok
test deserializer::test::test_unparsed ... ok
test service::filter::test::test_parameters ... ok
test service::filter::test::test_sizes ... ok
test service::limiter::test::test_limitter_different_rates ... ok
test service::limiter::test::test_limitter_multi ... ok
test service::limiter::test::test_limitter_refill ... ok
test service::gossip::store::test::test_announced ... ok
test control::tests::test_seed_unseed ... ok
test control::tests::test_control_socket ... ok
test service::message::tests::test_ref_remote_limit ... ok
test service::message::tests::test_inventory_limit ... ok
test service::message::tests::prop_refs_announcement_signing ... ok
test tests::e2e::missing_default_branch ... ok
test tests::e2e::missing_delegate_default_branch ... ok
test tests::e2e::test_background_foreground_fetch ... ok
test tests::e2e::test_channel_reader_limit ... ok
test tests::e2e::test_catchup_on_refs_announcements ... ok
test service::message::tests::test_node_announcement_validate ... ok
test tests::e2e::test_clone ... ok
test tests::e2e::test_dont_fetch_owned_refs ... ok
test tests::e2e::test_fetch_followed_remotes ... ok
test tests::e2e::test_connection_crossing ... ok
test tests::e2e::test_fetch_preserve_owned_refs ... ok
test tests::e2e::test_fetch_unseeded ... ok
test tests::e2e::test_fetch_up_to_date ... ok
test tests::e2e::test_concurrent_fetches ... ok
test tests::e2e::test_inventory_sync_basic ... ok
test tests::e2e::test_large_fetch ... ok
test tests::e2e::test_migrated_clone ... ok
test tests::e2e::test_missing_remote ... ok
test tests::e2e::test_multiple_offline_inits ... ok
test tests::e2e::test_non_fastforward_sigrefs ... ok
test tests::e2e::test_outdated_delegate_sigrefs ... ok
test tests::e2e::test_outdated_sigrefs ... ok
test tests::e2e::test_replication ... ok
test tests::e2e::test_replication_invalid ... ok
test tests::e2e::test_replication_ref_in_sigrefs ... ok
test tests::e2e::test_inventory_sync_bridge ... ok
test tests::e2e::test_inventory_sync_ring ... ok
test tests::e2e::test_inventory_sync_star ... ok
test tests::test_announcement_rebroadcast ... ok
test tests::test_announcement_rebroadcast_duplicates ... ok
test tests::test_announcement_rebroadcast_timestamp_filtered ... ok
test tests::test_announcement_relay ... ok
test tests::test_connection_kept_alive ... ok
test tests::test_disconnecting_unresponsive_peer ... ok
test tests::test_fetch_missing_inventory_on_gossip ... ok
test tests::test_fetch_missing_inventory_on_schedule ... ok
test tests::test_inbound_connection ... ok
test tests::test_inventory_decode ... ok
test tests::test_init_and_seed ... ok
test tests::test_inventory_relay ... ok
test tests::test_inventory_relay_bad_timestamp ... ok
test tests::test_inventory_sync ... ok
test tests::test_maintain_connections ... ok
test tests::test_maintain_connections_failed_attempt ... ok
test tests::test_maintain_connections_transient ... ok
test tests::test_outbound_connection ... ok
test tests::test_inventory_pruning ... ok
test tests::test_persistent_peer_connect ... ok
test tests::test_persistent_peer_reconnect_success ... ok
test tests::test_persistent_peer_reconnect_attempt ... ok
test tests::test_ping_response ... ok
test tests::test_queued_fetch_from_ann_same_rid ... ok
test tests::test_queued_fetch_from_command_same_rid ... ok
test tests::test_queued_fetch_max_capacity ... ok
test tests::test_redundant_connect ... ok
test tests::test_refs_announcement_followed ... ok
test tests::test_refs_announcement_fetch_trusted_no_inventory ... ok
test tests::test_refs_announcement_no_subscribe ... ok
test tests::test_refs_announcement_offline ... ok
test tests::test_refs_announcement_relay_private ... ok
test tests::test_refs_announcement_relay_public ... ok
test tests::test_refs_synced_event ... ok
test tests::test_seeding ... ok
test wire::frame::test::test_stream_id ... ok
test wire::message::tests::prop_addr ... ok
test tests::test_seed_repo_subscribe ... ok
test wire::message::tests::prop_message_encode_decode ... ok
test tests::prop_inventory_exchange_dense ... ok
test wire::message::tests::test_inv_ann_max_size ... ok
test wire::message::tests::test_node_ann_max_size ... ok
test wire::message::tests::test_pingpong_encode_max_size ... ok
test wire::message::tests::test_pingpong_encode_size_overflow ... ok
test wire::message::tests::prop_zero_bytes_encode_decode ... ok
test wire::protocol::test::test_inventory_ann_with_extension ... ok
test wire::protocol::test::test_pong_message_with_extension ... ok
test wire::tests::prop_filter ... ok
test wire::tests::prop_id ... ok
test wire::tests::prop_oid ... ok
test wire::tests::prop_pubkey ... ok
test wire::tests::prop_refs ... ok
test wire::tests::prop_signature ... ok
test wire::tests::prop_signed_refs ... ok
test wire::tests::prop_string ... ok
test wire::tests::prop_tuple ... ok
test wire::tests::prop_u16 ... ok
test wire::tests::prop_u32 ... ok
test wire::tests::prop_u64 ... ok
test wire::tests::prop_u8 ... ok
test wire::tests::prop_vec ... ok
test wire::tests::test_alias ... ok
test wire::tests::test_bounded_vec_limit ... ok
test wire::tests::test_filter_invalid ... ok
test wire::tests::test_string ... ok
test wire::varint::test::prop_encode_decode ... ok
test wire::varint::test::test_encode_overflow - should panic ... ok
test wire::varint::test::test_encoding ... ok
test wire::message::tests::test_refs_ann_max_size ... ok
test wire::message::tests::prop_message_decoder ... ok
test tests::test_announcement_message_amplification ... ok
test result: ok. 113 passed; 0 failed; 0 ignored; 0 measured; 0 filtered out; finished in 18.51s
Running unittests src/main.rs (target/debug/deps/radicle_node-b016ea98d1d34a3a)
running 0 tests
test result: ok. 0 passed; 0 failed; 0 ignored; 0 measured; 0 filtered out; finished in 0.00s
Running unittests src/lib.rs (target/debug/deps/radicle_remote_helper-ec61d634612a0b04)
running 0 tests
test result: ok. 0 passed; 0 failed; 0 ignored; 0 measured; 0 filtered out; finished in 0.00s
Running unittests src/git-remote-rad.rs (target/debug/deps/git_remote_rad-0d9c364466d413e8)
running 0 tests
test result: ok. 0 passed; 0 failed; 0 ignored; 0 measured; 0 filtered out; finished in 0.00s
Running unittests src/main.rs (target/debug/deps/radicle_schemars-e4157e4268fe0e11)
running 0 tests
test result: ok. 0 passed; 0 failed; 0 ignored; 0 measured; 0 filtered out; finished in 0.00s
Running unittests src/lib.rs (target/debug/deps/radicle_signals-0c183d7d8cb1e457)
running 0 tests
test result: ok. 0 passed; 0 failed; 0 ignored; 0 measured; 0 filtered out; finished in 0.00s
Running unittests src/lib.rs (target/debug/deps/radicle_ssh-02e22359ef9bf046)
running 0 tests
test result: ok. 0 passed; 0 failed; 0 ignored; 0 measured; 0 filtered out; finished in 0.00s
Running unittests src/lib.rs (target/debug/deps/radicle_systemd-28e02dc067eac38d)
running 0 tests
test result: ok. 0 passed; 0 failed; 0 ignored; 0 measured; 0 filtered out; finished in 0.00s
Running unittests src/lib.rs (target/debug/deps/radicle_term-98d660e1537ffc71)
running 20 tests
test ansi::tests::colors_disabled ... ok
test ansi::tests::colors_enabled ... ok
test ansi::tests::wrapping ... ok
test table::test::test_table ... ok
test element::test::test_truncate ... ok
test element::test::test_width ... ok
test table::test::test_table_border_truncated ... ok
test cell::test::test_width ... ok
test table::test::test_table_truncate ... ok
test table::test::test_table_border ... ok
test table::test::test_table_unicode_truncate ... ok
test table::test::test_table_unicode ... ok
test table::test::test_truncate ... ok
test table::test::test_table_border_maximized ... ok
test textarea::test::test_wrapping_code_block ... ok
test textarea::test::test_wrapping ... ok
test textarea::test::test_wrapping_paragraphs ... ok
test textarea::test::test_wrapping_fenced_block ... ok
test vstack::test::test_vstack ... ok
test vstack::test::test_vstack_maximize ... ok
test result: ok. 20 passed; 0 failed; 0 ignored; 0 measured; 0 filtered out; finished in 0.00s
Running unittests src/rad-agent.rs (target/debug/deps/rad_agent-29600e9aa47c0398)
running 0 tests
test result: ok. 0 passed; 0 failed; 0 ignored; 0 measured; 0 filtered out; finished in 0.00s
Running unittests src/rad-cli-demo.rs (target/debug/deps/rad_cli_demo-8f4e590681e29874)
running 0 tests
test result: ok. 0 passed; 0 failed; 0 ignored; 0 measured; 0 filtered out; finished in 0.00s
Running unittests src/rad-init.rs (target/debug/deps/rad_init-355a2aa725d78ac3)
running 0 tests
test result: ok. 0 passed; 0 failed; 0 ignored; 0 measured; 0 filtered out; finished in 0.00s
Running unittests src/rad-merge.rs (target/debug/deps/rad_merge-6532663f28e280fb)
running 0 tests
test result: ok. 0 passed; 0 failed; 0 ignored; 0 measured; 0 filtered out; finished in 0.00s
Running unittests src/rad-push.rs (target/debug/deps/rad_push-7726d3d0446b7214)
running 0 tests
test result: ok. 0 passed; 0 failed; 0 ignored; 0 measured; 0 filtered out; finished in 0.00s
Running unittests src/rad-self.rs (target/debug/deps/rad_self-f374c6b661dae6d9)
running 0 tests
test result: ok. 0 passed; 0 failed; 0 ignored; 0 measured; 0 filtered out; finished in 0.00s
Running unittests src/rad-set-canonical-refs.rs (target/debug/deps/rad_set_canonical_refs-ea6e8fc78a1f9162)
running 0 tests
test result: ok. 0 passed; 0 failed; 0 ignored; 0 measured; 0 filtered out; finished in 0.00s
Doc-tests radicle
running 0 tests
test result: ok. 0 passed; 0 failed; 0 ignored; 0 measured; 0 filtered out; finished in 0.00s
Doc-tests radicle_cli
running 0 tests
test result: ok. 0 passed; 0 failed; 0 ignored; 0 measured; 0 filtered out; finished in 0.00s
Doc-tests radicle_cli_test
running 0 tests
test result: ok. 0 passed; 0 failed; 0 ignored; 0 measured; 0 filtered out; finished in 0.00s
Doc-tests radicle_cob
running 1 test
test crates/radicle-cob/src/backend/git/stable.rs - backend::git::stable::with_advanced_timestamp (line 56) ... ignored
test result: ok. 0 passed; 0 failed; 1 ignored; 0 measured; 0 filtered out; finished in 0.00s
Doc-tests radicle_crdt
running 0 tests
test result: ok. 0 passed; 0 failed; 0 ignored; 0 measured; 0 filtered out; finished in 0.00s
Doc-tests radicle_crypto
running 0 tests
test result: ok. 0 passed; 0 failed; 0 ignored; 0 measured; 0 filtered out; finished in 0.00s
Doc-tests radicle_dag
running 0 tests
test result: ok. 0 passed; 0 failed; 0 ignored; 0 measured; 0 filtered out; finished in 0.00s
Doc-tests radicle_fetch
running 0 tests
test result: ok. 0 passed; 0 failed; 0 ignored; 0 measured; 0 filtered out; finished in 0.00s
Doc-tests radicle_node
running 6 tests
test crates/radicle-node/src/bounded.rs - bounded::BoundedVec<T,N>::truncate (line 50) ... ok
test crates/radicle-node/src/bounded.rs - bounded::BoundedVec<T,N>::max (line 96) ... ok
test crates/radicle-node/src/bounded.rs - bounded::BoundedVec<T,N>::push (line 122) ... ok
test crates/radicle-node/src/bounded.rs - bounded::BoundedVec<T,N>::collect_from (line 30) ... ok
test crates/radicle-node/src/bounded.rs - bounded::BoundedVec<T,N>::unbound (line 149) ... ok
test crates/radicle-node/src/bounded.rs - bounded::BoundedVec<T,N>::with_capacity (line 66) ... ok
test result: ok. 6 passed; 0 failed; 0 ignored; 0 measured; 0 filtered out; finished in 0.49s
Doc-tests radicle_remote_helper
running 0 tests
test result: ok. 0 passed; 0 failed; 0 ignored; 0 measured; 0 filtered out; finished in 0.00s
Doc-tests radicle_signals
running 0 tests
test result: ok. 0 passed; 0 failed; 0 ignored; 0 measured; 0 filtered out; finished in 0.00s
Doc-tests radicle_ssh
running 0 tests
test result: ok. 0 passed; 0 failed; 0 ignored; 0 measured; 0 filtered out; finished in 0.00s
Doc-tests radicle_systemd
running 0 tests
test result: ok. 0 passed; 0 failed; 0 ignored; 0 measured; 0 filtered out; finished in 0.00s
Doc-tests radicle_term
running 1 test
test crates/radicle-term/src/table.rs - table (line 4) ... ok
test result: ok. 1 passed; 0 failed; 0 ignored; 0 measured; 0 filtered out; finished in 0.41s
error: 1 target failed:
`-p radicle-cli --test commands`
Exit code: 101
{
"response": "finished",
"result": "failure"
}