rad:z3gqcJUoA1n9HaHKufZs5FCSGazv5 heartwoodc1d8fde857d2929df5a649dd949efb3ce8ab5643
{
"request": "trigger",
"version": 1,
"event_type": "patch",
"repository": {
"id": "rad:z3gqcJUoA1n9HaHKufZs5FCSGazv5",
"name": "heartwood",
"description": "Radicle Heartwood Protocol & Stack",
"private": false,
"default_branch": "master",
"delegates": [
"did:key:z6MksFqXN3Yhqk8pTJdUGLwATkRfQvwZXPqR2qMEhbS9wzpT",
"did:key:z6MkireRatUThvd3qzfKht1S44wpm4FEWSSa4PRMTSQZ3voM",
"did:key:z6MkkPvBfjP4bQmco5Dm7UGsX2ruDBieEHi8n9DVJWX5sTEz"
]
},
"action": "Created",
"patch": {
"id": "8c41872d7fcfbd221282546f7ae506ed31cb60de",
"author": {
"id": "did:key:z6MkireRatUThvd3qzfKht1S44wpm4FEWSSa4PRMTSQZ3voM",
"alias": null
},
"title": "crypto: shared agent stream",
"state": {
"status": "merged",
"conflicts": []
},
"before": "ee0d19f2eb5744777ed717b8f8ec585e54aed4f0",
"after": "c1d8fde857d2929df5a649dd949efb3ce8ab5643",
"commits": [
"c1d8fde857d2929df5a649dd949efb3ce8ab5643"
],
"target": "3fc92f83fe089263c470b328414d923227cf0e4a",
"labels": [],
"assignees": [],
"revisions": [
{
"id": "8c41872d7fcfbd221282546f7ae506ed31cb60de",
"author": {
"id": "did:key:z6MkireRatUThvd3qzfKht1S44wpm4FEWSSa4PRMTSQZ3voM",
"alias": null
},
"description": "The `Mutex` within `AgentSigner` did not seem to make sense. The `Mutex` could\nnever be shared, since the structs could never be cloned.\n\nIt would make more sense to have an `Arc<Mutex<AgentClient<Stream>>>` within\n`Agent`, which could then be shared and cloned when constructing the\n`AgentSigner`.",
"base": "ee0d19f2eb5744777ed717b8f8ec585e54aed4f0",
"oid": "c1d8fde857d2929df5a649dd949efb3ce8ab5643",
"timestamp": 1737136653
},
{
"id": "db31adc0fdbc14e74fcec2a33863a802953521c4",
"author": {
"id": "did:key:z6MkireRatUThvd3qzfKht1S44wpm4FEWSSa4PRMTSQZ3voM",
"alias": null
},
"description": "Here's a version that uses `RefCell` instead of `Mutex`. This required dropping `Sync` from `Signer` (which would indeed require `Mutex`).",
"base": "ee0d19f2eb5744777ed717b8f8ec585e54aed4f0",
"oid": "2e6ad5ac37ac88e7886fb4ffce47a7d328067cde",
"timestamp": 1737408758
},
{
"id": "fbfed72034ab8f3f57551afa138ad26c1610f1e6",
"author": {
"id": "did:key:z6MkireRatUThvd3qzfKht1S44wpm4FEWSSa4PRMTSQZ3voM",
"alias": null
},
"description": "Rebase.",
"base": "62d000f7cb8c5dc7c8be482fc1e3a81b4efa6689",
"oid": "3b5fac178eaf9bca639fbd0c1df0c68619a7f51f",
"timestamp": 1738069565
}
]
}
}
{
"response": "triggered",
"run_id": {
"id": "c10adf5d-f5b6-4f26-b6dc-996d5dd15371"
},
"info_url": "https://cci.rad.levitte.org//c10adf5d-f5b6-4f26-b6dc-996d5dd15371.html"
}
Started at: 2026-09-08 00:13:50.511121+02:00
Commands:
$ rad clone rad:z3gqcJUoA1n9HaHKufZs5FCSGazv5 .
✓ Creating checkout in ./...
✓ Remote cloudhead@z6MksFqXN3Yhqk8pTJdUGLwATkRfQvwZXPqR2qMEhbS9wzpT added
✓ Remote-tracking branch cloudhead@z6MksFqXN3Yhqk8pTJdUGLwATkRfQvwZXPqR2qMEhbS9wzpT/master created for z6MksFqXN3Yhqk8pTJdUGLwATkRfQvwZXPqR2qMEhbS9wzpT
✓ Remote fintohaps@z6MkireRatUThvd3qzfKht1S44wpm4FEWSSa4PRMTSQZ3voM added
✓ Remote-tracking branch fintohaps@z6MkireRatUThvd3qzfKht1S44wpm4FEWSSa4PRMTSQZ3voM/master created for z6MkireRatUThvd3qzfKht1S44wpm4FEWSSa4PRMTSQZ3voM
✓ Remote lorenz@z6MkkPvBfjP4bQmco5Dm7UGsX2ruDBieEHi8n9DVJWX5sTEz added
✓ Remote-tracking branch lorenz@z6MkkPvBfjP4bQmco5Dm7UGsX2ruDBieEHi8n9DVJWX5sTEz/master created for z6MkkPvBfjP4bQmco5Dm7UGsX2ruDBieEHi8n9DVJWX5sTEz
✓ Repository successfully cloned under /opt/radcis/ci.rad.levitte.org/cci/state/c10adf5d-f5b6-4f26-b6dc-996d5dd15371/w/
╭────────────────────────────────────╮
│ heartwood │
│ Radicle Heartwood Protocol & Stack │
│ 189 issues · 38 patches │
╰────────────────────────────────────╯
Run `cd ./.` to go to the repository directory.
Exit code: 0
$ rad patch checkout 8c41872d7fcfbd221282546f7ae506ed31cb60de
✓ Switched to branch patch/8c41872 at revision 8c41872
✓ Branch patch/8c41872 setup to track rad/patches/8c41872d7fcfbd221282546f7ae506ed31cb60de
Exit code: 0
$ git config advice.detachedHead false
Exit code: 0
$ git checkout c1d8fde857d2929df5a649dd949efb3ce8ab5643
HEAD is now at c1d8fde8 crypto: shared agent stream
Exit code: 0
$ rad patch show 8c41872d7fcfbd221282546f7ae506ed31cb60de -p
╭────────────────────────────────────────────────────────────────────────────────╮
│ Title crypto: shared agent stream │
│ Patch 8c41872d7fcfbd221282546f7ae506ed31cb60de │
│ Author fintohaps z6Mkire…SQZ3voM │
│ Head c1d8fde857d2929df5a649dd949efb3ce8ab5643 │
│ Base ee0d19f2eb5744777ed717b8f8ec585e54aed4f0 │
│ Target master │
│ Branches patch/8c41872 │
│ Commits ahead 1, behind 1119 │
│ Status merged │
│ │
│ The `Mutex` within `AgentSigner` did not seem to make sense. The `Mutex` could │
│ never be shared, since the structs could never be cloned. │
│ │
│ It would make more sense to have an `Arc<Mutex<AgentClient<Stream>>>` within │
│ `Agent`, which could then be shared and cloned when constructing the │
│ `AgentSigner`. │
├────────────────────────────────────────────────────────────────────────────────┤
│ c1d8fde crypto: shared agent stream │
├────────────────────────────────────────────────────────────────────────────────┤
│ ● Revision 8c41872 @ ee0d19f..c1d8fde by fintohaps z6Mkire…SQZ3voM 1 year ago │
│ ↑ Revision db31adc @ ee0d19f..2e6ad5a by lorenz z6MkkPv…WX5sTEz 1 year ago │
│ ↑ Revision fbfed72 @ 62d000f..3b5fac1 by cloudhead z6MksFq…bS9wzpT 1 year ago │
│ └─ ✓ merged by cloudhead z6MksFq…bS9wzpT │
╰────────────────────────────────────────────────────────────────────────────────╯
commit c1d8fde857d2929df5a649dd949efb3ce8ab5643
Author: Fintan Halpenny <fintan.halpenny@gmail.com>
Date: Fri Jan 17 14:37:20 2025 +0000
crypto: shared agent stream
The `Mutex` within `AgentSigner` did not seem to make sense. The `Mutex` could
never be shared, since the structs could never be cloned.
It would make more sense to have an `Arc<Mutex<AgentClient<Stream>>>` within
`Agent`, which could then be shared and cloned when constructing the
`AgentSigner`.
diff --git a/radicle-crypto/src/ssh/agent.rs b/radicle-crypto/src/ssh/agent.rs
index 6f3d9854c..c15f8138b 100644
--- a/radicle-crypto/src/ssh/agent.rs
+++ b/radicle-crypto/src/ssh/agent.rs
@@ -1,5 +1,4 @@
-use std::ops::{Deref, DerefMut};
-use std::sync::Mutex;
+use std::sync::{Arc, Mutex};
pub use radicle_ssh::agent::client::AgentClient;
pub use radicle_ssh::agent::client::Error;
@@ -12,56 +11,63 @@ pub use std::net::TcpStream as Stream;
#[cfg(unix)]
pub use std::os::unix::net::UnixStream as Stream;
+#[derive(Clone)]
pub struct Agent {
- client: AgentClient<Stream>,
+ client: Arc<Mutex<AgentClient<Stream>>>,
}
impl Agent {
/// Connect to a running SSH agent.
pub fn connect() -> Result<Self, ssh::agent::client::Error> {
- Stream::connect_env().map(|client| Self { client })
+ Stream::connect_env().map(|client| Self {
+ client: Arc::new(Mutex::new(client)),
+ })
}
/// Register a key with the agent.
pub fn register(&mut self, key: &SecretKey) -> Result<(), ssh::Error> {
- self.client.add_identity(key, &[])
+ self.client.lock().unwrap().add_identity(key, &[])
}
- /// Get a signer from this agent, given the public key.
- pub fn signer(self, key: PublicKey) -> AgentSigner {
- AgentSigner::new(self, key)
+ pub fn unregister(&mut self, key: &PublicKey) -> Result<(), ssh::Error> {
+ self.client.lock().unwrap().remove_identity(key)
}
-}
-impl Deref for Agent {
- type Target = AgentClient<Stream>;
+ pub fn unregister_all(&mut self) -> Result<(), ssh::Error> {
+ self.client.lock().unwrap().remove_all_identities()
+ }
- fn deref(&self) -> &Self::Target {
- &self.client
+ pub fn sign(&self, key: &PublicKey, data: &[u8]) -> Result<[u8; 64], ssh::Error> {
+ self.client.lock().unwrap().sign(key, data)
+ }
+
+ /// Get a signer from this agent, given the public key.
+ pub fn signer(&self, key: PublicKey) -> AgentSigner {
+ AgentSigner::new(self.clone(), key)
}
-}
-impl DerefMut for Agent {
- fn deref_mut(&mut self) -> &mut Self::Target {
- &mut self.client
+ pub fn pid(&self) -> Option<u32> {
+ self.client.lock().unwrap().pid()
+ }
+
+ pub fn request_identities(&self) -> Result<Vec<PublicKey>, ssh::agent::client::Error> {
+ self.client.lock().unwrap().request_identities()
}
}
/// A [`Signer`] that uses `ssh-agent`.
pub struct AgentSigner {
- agent: Mutex<Agent>,
+ agent: Agent,
public: PublicKey,
}
impl AgentSigner {
pub fn new(agent: Agent, public: PublicKey) -> Self {
- let agent = Mutex::new(agent);
-
Self { agent, public }
}
pub fn is_ready(&self) -> Result<bool, Error> {
- let ids = self.agent.lock().unwrap().request_identities()?;
+ let ids = self.agent.client.lock().unwrap().request_identities()?;
Ok(ids.contains(&self.public))
}
@@ -84,6 +90,7 @@ impl Signer for AgentSigner {
fn try_sign(&self, msg: &[u8]) -> Result<Signature, SignerError> {
let sig = self
.agent
+ .client
.lock()
// We'll take our chances here; the worse that can happen is the agent returns an error.
.unwrap_or_else(|e| e.into_inner())
diff --git a/radicle-tools/src/rad-agent.rs b/radicle-tools/src/rad-agent.rs
index 82d7005fa..317098f64 100644
--- a/radicle-tools/src/rad-agent.rs
+++ b/radicle-tools/src/rad-agent.rs
@@ -28,11 +28,11 @@ fn main() -> anyhow::Result<()> {
println!("ok");
}
Some("remove") => {
- agent.remove_identity(profile.id())?;
+ agent.unregister(profile.id())?;
println!("ok");
}
Some("remove-all") => {
- agent.remove_all_identities()?;
+ agent.unregister_all()?;
println!("ok");
}
Some("sign") => {
Exit code: 0
shell: 'cargo --version rustc --version cargo fmt --check cargo clippy --all-targets --workspace -- --deny warnings cargo build --all-targets --workspace cargo doc --workspace --no-deps cargo test --workspace --no-fail-fast '
Commands:
$ podman run --name c10adf5d-f5b6-4f26-b6dc-996d5dd15371 -v /opt/radcis/ci.rad.levitte.org/cci/state/c10adf5d-f5b6-4f26-b6dc-996d5dd15371/s:/c10adf5d-f5b6-4f26-b6dc-996d5dd15371/s:ro -v /opt/radcis/ci.rad.levitte.org/cci/state/c10adf5d-f5b6-4f26-b6dc-996d5dd15371/w:/c10adf5d-f5b6-4f26-b6dc-996d5dd15371/w -w /c10adf5d-f5b6-4f26-b6dc-996d5dd15371/w -v /opt/radcis/ci.rad.levitte.org/.radicle:/${id}/.radicle:ro -e RAD_HOME=/${id}/.radicle rust:trixie bash /c10adf5d-f5b6-4f26-b6dc-996d5dd15371/s/script.sh
+ cargo --version
info: syncing channel updates for '1.80-x86_64-unknown-linux-gnu'
info: latest update on 2024-08-08, rust version 1.80.1 (3f5fd8dd4 2024-08-06)
info: downloading component 'cargo'
info: downloading component 'clippy'
info: downloading component 'rust-docs'
info: downloading component 'rust-src'
info: downloading component 'rust-std'
info: downloading component 'rustc'
info: downloading component 'rustfmt'
info: installing component 'cargo'
info: installing component 'clippy'
info: installing component 'rust-docs'
info: installing component 'rust-src'
info: installing component 'rust-std'
info: installing component 'rustc'
info: installing component 'rustfmt'
cargo 1.80.1 (376290515 2024-07-16)
+ rustc --version
rustc 1.80.1 (3f5fd8dd4 2024-08-06)
+ cargo fmt --check
+ cargo clippy --all-targets --workspace -- --deny warnings
Updating crates.io index
Downloading crates ...
Downloaded amplify_syn v2.0.1
Downloaded anstream v0.6.13
Downloaded amplify v4.6.0
Downloaded adler v1.0.2
Downloaded cc v1.2.2
Downloaded cipher v0.4.4
Downloaded siphasher v0.3.11
Downloaded const-oid v0.9.6
Downloaded crossbeam-channel v0.5.13
Downloaded shlex v1.3.0
Downloaded tinyvec v1.6.0
Downloaded gix-path v0.10.9
Downloaded ssh-encoding v0.2.0
Downloaded gix-prompt v0.8.4
Downloaded tree-sitter-json v0.24.8
Downloaded utf8parse v0.2.1
Downloaded percent-encoding v2.3.1
Downloaded noise-framework v0.4.0
Downloaded gix-packetline v0.17.5
Downloaded newline-converter v0.3.0
Downloaded pkcs8 v0.10.2
Downloaded multibase v0.9.1
Downloaded netservices v0.8.0
Downloaded ryu v1.0.17
Downloaded radicle-surf v0.22.0
Downloaded num_threads v0.1.7
Downloaded gix-revwalk v0.13.2
Downloaded opaque-debug v0.3.1
Downloaded pbkdf2 v0.12.2
Downloaded nonempty v0.5.0
Downloaded scrypt v0.11.0
Downloaded proc-macro-error v1.0.4
Downloaded radicle-git-ext v0.8.0
Downloaded memmap2 v0.9.4
Downloaded sec1 v0.7.3
Downloaded nonempty v0.9.0
Downloaded sha2 v0.10.8
Downloaded serde v1.0.198
Downloaded log v0.4.21
Downloaded rustix v0.38.34
Downloaded normalize-line-endings v0.3.0
Downloaded memchr v2.7.2
Downloaded gix-url v0.27.3
Downloaded rand_core v0.6.4
Downloaded iana-time-zone v0.1.60
Downloaded sha3 v0.10.8
Downloaded jobserver v0.1.31
Downloaded streaming-iterator v0.1.9
Downloaded spin v0.9.8
Downloaded io-reactor v0.5.2
Downloaded typenum v1.17.0
Downloaded tempfile v3.10.1
Downloaded hmac v0.12.1
Downloaded unicode-bidi v0.3.15
Downloaded termion v3.0.0
Downloaded socket2 v0.5.7
Downloaded tree-sitter-css v0.23.1
Downloaded group v0.13.0
Downloaded zeroize v1.7.0
Downloaded time-macros v0.2.18
Downloaded gix-transport v0.42.0
Downloaded tar v0.4.40
Downloaded pretty_assertions v1.4.0
Downloaded thiserror v1.0.69
Downloaded spki v0.7.3
Downloaded indexmap v2.2.6
Downloaded rand v0.8.5
Downloaded libm v0.2.8
Downloaded inquire v0.7.5
Downloaded unicode-normalization v0.1.23
Downloaded hashbrown v0.14.3
Downloaded time v0.3.36
Downloaded num-bigint-dig v0.8.4
Downloaded winnow v0.6.8
Downloaded tree-sitter-python v0.23.4
Downloaded vcpkg v0.2.15
Downloaded regex-syntax v0.8.5
Downloaded tree-sitter-ruby v0.23.1
Downloaded regex-automata v0.4.9
Downloaded libc v0.2.155
Downloaded tree-sitter-typescript v0.23.2
Downloaded tree-sitter-md v0.3.2
Downloaded tree-sitter-bash v0.23.3
Downloaded linux-raw-sys v0.4.13
Downloaded libgit2-sys v0.17.0+1.8.1
Downloaded syn v2.0.89
Downloaded regex v1.11.1
Downloaded idna v0.5.0
Downloaded tree-sitter-rust v0.23.2
Downloaded tree-sitter-c v0.23.2
Downloaded sqlite3-src v0.5.1
Downloaded syn v1.0.109
Downloaded tree-sitter v0.24.4
Downloaded unicode-segmentation v1.11.0
Downloaded tree-sitter-go v0.23.4
Downloaded ssh-key v0.6.6
Downloaded url v2.5.0
Downloaded libz-sys v1.1.16
Downloaded gix-tempfile v14.0.1
Downloaded serde_json v1.0.116
Downloaded rand_chacha v0.3.1
Downloaded p521 v0.13.3
Downloaded p384 v0.13.0
Downloaded lexopt v0.3.0
Downloaded lazy_static v1.5.0
Downloaded keccak v0.1.5
Downloaded itoa v1.0.11
Downloaded inout v0.1.3
Downloaded home v0.5.9
Downloaded gix-validate v0.8.5
Downloaded gix-utils v0.1.12
Downloaded gix-traverse v0.39.2
Downloaded gix-trace v0.1.9
Downloaded gix-sec v0.10.6
Downloaded gix-quote v0.4.12
Downloaded yansi v0.5.1
Downloaded walkdir v2.5.0
Downloaded version_check v0.9.4
Downloaded unicode-width v0.1.11
Downloaded unicode-ident v1.0.12
Downloaded tree-sitter-toml-ng v0.6.0
Downloaded tree-sitter-html v0.23.2
Downloaded timeago v0.4.2
Downloaded thiserror-impl v1.0.69
Downloaded termion v2.0.3
Downloaded sqlite v0.32.0
Downloaded socks5-client v0.4.1
Downloaded tree-sitter-language v0.1.2
Downloaded tree-sitter-highlight v0.24.4
Downloaded time-core v0.1.2
Downloaded rsa v0.9.6
Downloaded prodash v28.0.0
Downloaded proc-macro2 v1.0.92
Downloaded primeorder v0.13.6
Downloaded num-traits v0.2.18
Downloaded serde_derive v1.0.198
Downloaded quote v1.0.36
Downloaded p256 v0.13.2
Downloaded num-iter v0.1.44
Downloaded num-integer v0.1.46
Downloaded ppv-lite86 v0.2.17
Downloaded bloomy v1.2.0
Downloaded maybe-async v0.2.10
Downloaded sha1_smol v1.0.0
Downloaded scopeguard v1.2.0
Downloaded qcheck v1.0.0
Downloaded polyval v0.6.2
Downloaded xattr v1.3.1
Downloaded bstr v1.9.1
Downloaded powerfmt v0.2.0
Downloaded popol v3.0.0
Downloaded localtime v1.3.1
Downloaded rfc6979 v0.4.0
Downloaded radicle-std-ext v0.1.0
Downloaded qcheck-macros v1.0.0
Downloaded proc-macro-error-attr v1.0.4
Downloaded parking_lot v0.12.1
Downloaded snapbox-macros v0.3.8
Downloaded subtle v2.5.0
Downloaded git2 v0.19.0
Downloaded poly1305 v0.8.0
Downloaded parking_lot_core v0.9.9
Downloaded universal-hash v0.5.1
Downloaded gix-pack v0.51.1
Downloaded signature v2.2.0
Downloaded crypto-bigint v0.5.5
Downloaded arc-swap v1.7.1
Downloaded sqlite3-sys v0.15.2
Downloaded gix-odb v0.61.1
Downloaded diff v0.1.13
Downloaded pkg-config v0.3.30
Downloaded pkcs1 v0.7.5
Downloaded pem-rfc7468 v0.7.0
Downloaded miniz_oxide v0.7.2
Downloaded lock_api v0.4.11
Downloaded base64 v0.21.7
Downloaded base64 v0.13.1
Downloaded once_cell v1.19.0
Downloaded gix-object v0.42.3
Downloaded bitflags v2.5.0
Downloaded base64ct v1.6.0
Downloaded anyhow v1.0.82
Downloaded same-file v1.0.6
Downloaded salsa20 v0.10.2
Downloaded unicode-display-width v0.3.0
Downloaded flate2 v1.0.28
Downloaded escargot v0.5.10
Downloaded cyphernet v0.5.2
Downloaded gix-credentials v0.24.2
Downloaded numtoa v0.1.0
Downloaded num-conv v0.1.0
Downloaded gix-diff v0.44.1
Downloaded git-ref-format-macro v0.3.0
Downloaded filetime v0.2.23
Downloaded fastrand v2.1.0
Downloaded crossbeam-utils v0.8.19
Downloaded block-buffer v0.10.4
Downloaded base-x v0.2.11
Downloaded tinyvec_macros v0.1.1
Downloaded gix-hashtable v0.5.2
Downloaded cypheraddr v0.4.0
Downloaded crypto-common v0.1.6
Downloaded generic-array v0.14.7
Downloaded anstyle-query v1.0.2
Downloaded ghash v0.5.1
Downloaded ec25519 v0.1.0
Downloaded digest v0.10.7
Downloaded chacha20 v0.9.1
Downloaded autocfg v1.2.0
Downloaded anstyle-parse v0.2.3
Downloaded ssh-cipher v0.2.0
Downloaded snapbox v0.4.17
Downloaded siphasher v1.0.1
Downloaded similar v2.5.0
Downloaded gix-features v0.38.2
Downloaded gix-commitgraph v0.24.3
Downloaded gix-command v0.3.6
Downloaded getrandom v0.2.14
Downloaded fxhash v0.2.1
Downloaded ecdsa v0.16.9
Downloaded deranged v0.3.11
Downloaded der v0.7.9
Downloaded data-encoding-macro v0.1.14
Downloaded anstyle v1.0.6
Downloaded gix-chunk v0.4.8
Downloaded git-ref-format-core v0.3.0
Downloaded git-ref-format v0.3.0
Downloaded errno v0.3.8
Downloaded either v1.11.0
Downloaded ct-codecs v1.1.1
Downloaded smallvec v1.13.2
Downloaded signature v1.6.4
Downloaded shell-words v1.1.0
Downloaded gix-protocol v0.45.0
Downloaded gix-hash v0.14.2
Downloaded gix-fs v0.11.2
Downloaded gix-date v0.8.7
Downloaded gix-actor v0.31.5
Downloaded ff v0.13.0
Downloaded faster-hex v0.9.0
Downloaded equivalent v1.0.1
Downloaded elliptic-curve v0.13.8
Downloaded ed25519 v1.5.3
Downloaded dyn-clone v1.0.17
Downloaded data-encoding-macro-internal v0.1.12
Downloaded colorchoice v1.0.0
Downloaded byteorder v1.5.0
Downloaded blowfish v0.9.1
Downloaded block-padding v0.3.3
Downloaded bcrypt-pbkdf v0.10.0
Downloaded gix-config-value v0.14.6
Downloaded form_urlencoded v1.2.1
Downloaded data-encoding v2.5.0
Downloaded cyphergraphy v0.3.0
Downloaded ctr v0.9.2
Downloaded crc32fast v1.4.0
Downloaded cpufeatures v0.2.12
Downloaded colored v2.1.0
Downloaded base32 v0.4.0
Downloaded base16ct v0.2.0
Downloaded chacha20poly1305 v0.10.1
Downloaded aes v0.8.4
Downloaded cbc v0.1.2
Downloaded ascii v1.1.0
Downloaded aho-corasick v1.1.3
Downloaded chrono v0.4.38
Downloaded cfg-if v1.0.0
Downloaded amplify_derive v4.0.0
Downloaded aes-gcm v0.10.3
Downloaded aead v0.5.2
Downloaded amplify_num v0.5.2
Compiling libc v0.2.155
Compiling proc-macro2 v1.0.92
Compiling unicode-ident v1.0.12
Checking cfg-if v1.0.0
Compiling shlex v1.3.0
Compiling version_check v0.9.4
Compiling thiserror v1.0.69
Compiling typenum v1.17.0
Compiling quote v1.0.36
Checking getrandom v0.2.14
Compiling generic-array v0.14.7
Compiling jobserver v0.1.31
Compiling syn v2.0.89
Compiling cc v1.2.2
Checking rand_core v0.6.4
Checking memchr v2.7.2
Checking crypto-common v0.1.6
Checking aho-corasick v1.1.3
Checking regex-syntax v0.8.5
Checking tinyvec_macros v0.1.1
Checking tinyvec v1.6.0
Checking fastrand v2.1.0
Checking subtle v2.5.0
Compiling syn v1.0.109
Checking zeroize v1.7.0
Checking unicode-normalization v0.1.23
Checking cpufeatures v0.2.12
Checking regex-automata v0.4.9
Checking bitflags v2.5.0
Checking block-padding v0.3.3
Checking inout v0.1.3
Checking block-buffer v0.10.4
Compiling pkg-config v0.3.30
Compiling thiserror-impl v1.0.69
Checking digest v0.10.7
Checking cipher v0.4.4
Compiling autocfg v1.2.0
Compiling crc32fast v1.4.0
Checking sha2 v0.10.8
Checking bstr v1.9.1
Checking unicode-bidi v0.3.15
Checking once_cell v1.19.0
Checking percent-encoding v2.3.1
Checking form_urlencoded v1.2.1
Checking idna v0.5.0
Checking universal-hash v0.5.1
Compiling serde v1.0.198
Compiling vcpkg v0.2.15
Checking opaque-debug v0.3.1
Checking url v2.5.0
Compiling amplify_syn v2.0.1
Compiling serde_derive v1.0.198
Compiling data-encoding v2.5.0
Compiling libz-sys v1.1.16
Compiling rustix v0.38.34
Checking byteorder v1.5.0
Compiling data-encoding-macro-internal v0.1.12
Compiling amplify_derive v4.0.0
Checking itoa v1.0.11
Checking signature v1.6.4
Checking linux-raw-sys v0.4.13
Checking ascii v1.1.0
Checking amplify_num v0.5.2
Checking log v0.4.21
Checking data-encoding-macro v0.1.14
Checking ed25519 v1.5.3
Compiling libgit2-sys v0.17.0+1.8.1
Checking aead v0.5.2
Compiling proc-macro-error-attr v1.0.4
Checking amplify v4.6.0
Checking base-x v0.2.11
Checking ct-codecs v1.1.1
Checking multibase v0.9.1
Checking ec25519 v0.1.0
Checking poly1305 v0.8.0
Checking chacha20 v0.9.1
Compiling proc-macro-error v1.0.4
Checking cyphergraphy v0.3.0
Checking keccak v0.1.5
Checking sha3 v0.10.8
Compiling git-ref-format-core v0.3.0
Checking polyval v0.6.2
Checking hmac v0.12.1
Compiling sqlite3-src v0.5.1
Checking base32 v0.4.0
Checking hashbrown v0.14.3
Checking ppv-lite86 v0.2.17
Checking base64ct v1.6.0
Checking rand_chacha v0.3.1
Checking pem-rfc7468 v0.7.0
Compiling git-ref-format-macro v0.3.0
Checking cypheraddr v0.4.0
Checking pbkdf2 v0.12.2
Checking ghash v0.5.1
Checking chacha20poly1305 v0.10.1
Checking tempfile v3.10.1
Checking aes v0.8.4
Checking ctr v0.9.2
Compiling crossbeam-utils v0.8.19
Checking aes-gcm v0.10.3
Checking git-ref-format v0.3.0
Checking noise-framework v0.4.0
Checking socks5-client v0.4.1
Checking ssh-encoding v0.2.0
Checking rand v0.8.5
Checking blowfish v0.9.1
Checking cbc v0.1.2
Checking radicle-std-ext v0.1.0
Checking ssh-cipher v0.2.0
Checking bcrypt-pbkdf v0.10.0
Checking cyphernet v0.5.2
Checking signature v2.2.0
Checking ssh-key v0.6.6
Checking crossbeam-channel v0.5.13
Checking qcheck v1.0.0
Checking radicle-ssh v0.9.0 (/c10adf5d-f5b6-4f26-b6dc-996d5dd15371/w/radicle-ssh)
Compiling num-traits v0.2.18
Compiling serde_json v1.0.116
Checking equivalent v1.0.1
Checking indexmap v2.2.6
Checking ryu v1.0.17
Checking tree-sitter-language v0.1.2
Checking nonempty v0.9.0
Checking radicle-dag v0.10.0 (/c10adf5d-f5b6-4f26-b6dc-996d5dd15371/w/radicle-dag)
Compiling anyhow v1.0.82
Checking lazy_static v1.5.0
Checking iana-time-zone v0.1.60
Checking anstyle-query v1.0.2
Checking chrono v0.4.38
Checking colored v2.1.0
Checking localtime v1.3.1
Checking utf8parse v0.2.1
Checking siphasher v1.0.1
Checking base64 v0.21.7
Checking anstyle-parse v0.2.3
Checking colorchoice v1.0.0
Checking anstyle v1.0.6
Checking anstream v0.6.13
Checking snapbox-macros v0.3.8
Checking normalize-line-endings v0.3.0
Checking similar v2.5.0
Checking radicle-signals v0.10.0 (/c10adf5d-f5b6-4f26-b6dc-996d5dd15371/w/radicle-signals)
Compiling tree-sitter v0.24.4
Checking snapbox v0.4.17
Checking yansi v0.5.1
Checking unicode-segmentation v1.11.0
Checking gix-trace v0.1.9
Checking numtoa v0.1.0
Checking diff v0.1.13
Compiling adler v1.0.2
Compiling miniz_oxide v0.7.2
Checking pretty_assertions v1.4.0
Compiling xattr v1.3.1
Compiling filetime v0.2.23
Checking lexopt v0.3.0
Compiling escargot v0.5.10
Compiling tar v0.4.40
Compiling flate2 v1.0.28
Checking termion v2.0.3
Checking newline-converter v0.3.0
Checking fxhash v0.2.1
Checking regex v1.11.1
Checking dyn-clone v1.0.17
Checking unicode-width v0.1.11
Checking faster-hex v0.9.0
Checking streaming-iterator v0.1.9
Checking inquire v0.7.5
Compiling radicle-surf v0.22.0
Checking termion v3.0.0
Checking unicode-display-width v0.3.0
Checking gix-utils v0.1.12
Compiling tree-sitter-rust v0.23.2
Compiling tree-sitter-md v0.3.2
Compiling tree-sitter-css v0.23.1
Compiling tree-sitter-go v0.23.4
Compiling tree-sitter-c v0.23.2
Compiling tree-sitter-bash v0.23.3
Compiling tree-sitter-ruby v0.23.1
Compiling tree-sitter-json v0.24.8
Compiling tree-sitter-html v0.23.2
Compiling tree-sitter-typescript v0.23.2
Compiling tree-sitter-toml-ng v0.6.0
Compiling tree-sitter-python v0.23.4
Checking gix-hash v0.14.2
Checking same-file v1.0.6
Checking nonempty v0.5.0
Compiling radicle-cli v0.12.1 (/c10adf5d-f5b6-4f26-b6dc-996d5dd15371/w/radicle-cli)
Checking sqlite3-sys v0.15.2
Checking base64 v0.13.1
Checking sqlite v0.32.0
Checking walkdir v2.5.0
Checking tree-sitter-highlight v0.24.4
Checking sha1_smol v1.0.0
Checking timeago v0.4.2
Checking prodash v28.0.0
Checking smallvec v1.13.2
Compiling lock_api v0.4.11
Compiling parking_lot_core v0.9.9
Checking gix-features v0.38.2
Compiling num-conv v0.1.0
Checking scopeguard v1.2.0
Compiling time-core v0.1.2
Checking powerfmt v0.2.0
Compiling time-macros v0.2.18
Checking deranged v0.3.11
Checking num_threads v0.1.7
Checking home v0.5.9
Checking gix-path v0.10.9
Checking parking_lot v0.12.1
Checking winnow v0.6.8
Checking gix-validate v0.8.5
Checking gix-chunk v0.4.8
Checking memmap2 v0.9.4
Checking shell-words v1.1.0
Checking time v0.3.36
Checking gix-command v0.3.6
Checking gix-commitgraph v0.24.3
Checking gix-hashtable v0.5.2
Checking gix-url v0.27.3
Checking gix-config-value v0.14.6
Checking gix-fs v0.11.2
Checking gix-quote v0.4.12
Checking gix-sec v0.10.6
Checking gix-prompt v0.8.4
Checking gix-tempfile v14.0.1
Checking gix-packetline v0.17.5
Checking gix-credentials v0.24.2
Checking gix-date v0.8.7
Checking gix-transport v0.42.0
Compiling maybe-async v0.2.10
Checking gix-actor v0.31.5
Checking gix-object v0.42.3
Checking arc-swap v1.7.1
Checking popol v3.0.0
Checking either v1.11.0
Checking io-reactor v0.5.2
Checking gix-revwalk v0.13.2
Checking gix-diff v0.44.1
Checking gix-protocol v0.45.0
Checking gix-traverse v0.39.2
Checking salsa20 v0.10.2
Checking socket2 v0.5.7
Checking gix-pack v0.51.1
Compiling radicle-node v0.10.0 (/c10adf5d-f5b6-4f26-b6dc-996d5dd15371/w/radicle-node)
Checking siphasher v0.3.11
Checking bloomy v1.2.0
Checking netservices v0.8.0
Checking scrypt v0.11.0
Checking radicle-systemd v0.9.0 (/c10adf5d-f5b6-4f26-b6dc-996d5dd15371/w/radicle-systemd)
Compiling qcheck-macros v1.0.0
Compiling radicle-remote-helper v0.10.0 (/c10adf5d-f5b6-4f26-b6dc-996d5dd15371/w/radicle-remote-helper)
Checking gix-odb v0.61.1
Checking git2 v0.19.0
Checking radicle-git-ext v0.8.0
Checking radicle-term v0.12.0 (/c10adf5d-f5b6-4f26-b6dc-996d5dd15371/w/radicle-term)
Checking radicle-crypto v0.11.0 (/c10adf5d-f5b6-4f26-b6dc-996d5dd15371/w/radicle-crypto)
Checking radicle-cob v0.13.0 (/c10adf5d-f5b6-4f26-b6dc-996d5dd15371/w/radicle-cob)
Checking radicle-crdt v0.1.0 (/c10adf5d-f5b6-4f26-b6dc-996d5dd15371/w/radicle-crdt)
Checking radicle v0.14.0 (/c10adf5d-f5b6-4f26-b6dc-996d5dd15371/w/radicle)
Checking radicle-cli-test v0.10.0 (/c10adf5d-f5b6-4f26-b6dc-996d5dd15371/w/radicle-cli-test)
Checking radicle-fetch v0.10.0 (/c10adf5d-f5b6-4f26-b6dc-996d5dd15371/w/radicle-fetch)
Checking radicle-tools v0.9.0 (/c10adf5d-f5b6-4f26-b6dc-996d5dd15371/w/radicle-tools)
Finished `dev` profile [unoptimized + debuginfo] target(s) in 41.67s
+ cargo build --all-targets --workspace
Compiling cfg-if v1.0.0
Compiling libc v0.2.155
Compiling shlex v1.3.0
Compiling thiserror v1.0.69
Compiling typenum v1.17.0
Compiling memchr v2.7.2
Compiling regex-syntax v0.8.5
Compiling generic-array v0.14.7
Compiling jobserver v0.1.31
Compiling getrandom v0.2.14
Compiling aho-corasick v1.1.3
Compiling cc v1.2.2
Compiling rand_core v0.6.4
Compiling crypto-common v0.1.6
Compiling tinyvec_macros v0.1.1
Compiling tinyvec v1.6.0
Compiling regex-automata v0.4.9
Compiling unicode-normalization v0.1.23
Compiling fastrand v2.1.0
Compiling bitflags v2.5.0
Compiling subtle v2.5.0
Compiling zeroize v1.7.0
Compiling cpufeatures v0.2.12
Compiling block-padding v0.3.3
Compiling block-buffer v0.10.4
Compiling unicode-bidi v0.3.15
Compiling inout v0.1.3
Compiling digest v0.10.7
Compiling cipher v0.4.4
Compiling sha2 v0.10.8
Compiling once_cell v1.19.0
Compiling percent-encoding v2.3.1
Compiling form_urlencoded v1.2.1
Compiling bstr v1.9.1
Compiling idna v0.5.0
Compiling universal-hash v0.5.1
Compiling adler v1.0.2
Compiling opaque-debug v0.3.1
Compiling url v2.5.0
Compiling miniz_oxide v0.7.2
Compiling libz-sys v1.1.16
Compiling crc32fast v1.4.0
Compiling byteorder v1.5.0
Compiling serde v1.0.198
Compiling log v0.4.21
Compiling itoa v1.0.11
Compiling amplify_num v0.5.2
Compiling data-encoding v2.5.0
Compiling signature v1.6.4
Compiling ascii v1.1.0
Compiling linux-raw-sys v0.4.13
Compiling rustix v0.38.34
Compiling amplify v4.6.0
Compiling ed25519 v1.5.3
Compiling data-encoding-macro v0.1.14
Compiling libgit2-sys v0.17.0+1.8.1
Compiling aead v0.5.2
Compiling base-x v0.2.11
Compiling ct-codecs v1.1.1
Compiling multibase v0.9.1
Compiling ec25519 v0.1.0
Compiling poly1305 v0.8.0
Compiling chacha20 v0.9.1
Compiling cyphergraphy v0.3.0
Compiling keccak v0.1.5
Compiling sha3 v0.10.8
Compiling polyval v0.6.2
Compiling hmac v0.12.1
Compiling sqlite3-src v0.5.1
Compiling git-ref-format-core v0.3.0
Compiling ppv-lite86 v0.2.17
Compiling base32 v0.4.0
Compiling hashbrown v0.14.3
Compiling base64ct v1.6.0
Compiling git-ref-format-macro v0.3.0
Compiling pem-rfc7468 v0.7.0
Compiling cypheraddr v0.4.0
Compiling rand_chacha v0.3.1
Compiling pbkdf2 v0.12.2
Compiling ghash v0.5.1
Compiling tempfile v3.10.1
Compiling chacha20poly1305 v0.10.1
Compiling ctr v0.9.2
Compiling aes v0.8.4
Compiling git-ref-format v0.3.0
Compiling noise-framework v0.4.0
Compiling aes-gcm v0.10.3
Compiling rand v0.8.5
Compiling socks5-client v0.4.1
Compiling ssh-encoding v0.2.0
Compiling blowfish v0.9.1
Compiling cbc v0.1.2
Compiling radicle-std-ext v0.1.0
Compiling ssh-cipher v0.2.0
Compiling bcrypt-pbkdf v0.10.0
Compiling cyphernet v0.5.2
Compiling crossbeam-utils v0.8.19
Compiling signature v2.2.0
Compiling ssh-key v0.6.6
Compiling crossbeam-channel v0.5.13
Compiling qcheck v1.0.0
Compiling radicle-ssh v0.9.0 (/c10adf5d-f5b6-4f26-b6dc-996d5dd15371/w/radicle-ssh)
Compiling equivalent v1.0.1
Compiling ryu v1.0.17
Compiling indexmap v2.2.6
Compiling tree-sitter-language v0.1.2
Compiling num-traits v0.2.18
Compiling serde_json v1.0.116
Compiling nonempty v0.9.0
Compiling radicle-dag v0.10.0 (/c10adf5d-f5b6-4f26-b6dc-996d5dd15371/w/radicle-dag)
Compiling lazy_static v1.5.0
Compiling iana-time-zone v0.1.60
Compiling anstyle-query v1.0.2
Compiling chrono v0.4.38
Compiling colored v2.1.0
Compiling localtime v1.3.1
Compiling utf8parse v0.2.1
Compiling siphasher v1.0.1
Compiling base64 v0.21.7
Compiling anstyle-parse v0.2.3
Compiling anyhow v1.0.82
Compiling anstyle v1.0.6
Compiling colorchoice v1.0.0
Compiling anstream v0.6.13
Compiling similar v2.5.0
Compiling snapbox-macros v0.3.8
Compiling normalize-line-endings v0.3.0
Compiling snapbox v0.4.17
Compiling radicle-signals v0.10.0 (/c10adf5d-f5b6-4f26-b6dc-996d5dd15371/w/radicle-signals)
Compiling tree-sitter v0.24.4
Compiling gix-trace v0.1.9
Compiling numtoa v0.1.0
Compiling yansi v0.5.1
Compiling diff v0.1.13
Compiling unicode-segmentation v1.11.0
Compiling pretty_assertions v1.4.0
Compiling xattr v1.3.1
Compiling filetime v0.2.23
Compiling lexopt v0.3.0
Compiling tar v0.4.40
Compiling newline-converter v0.3.0
Compiling termion v2.0.3
Compiling fxhash v0.2.1
Compiling flate2 v1.0.28
Compiling regex v1.11.1
Compiling streaming-iterator v0.1.9
Compiling unicode-width v0.1.11
Compiling dyn-clone v1.0.17
Compiling faster-hex v0.9.0
Compiling inquire v0.7.5
Compiling radicle-surf v0.22.0
Compiling escargot v0.5.10
Compiling unicode-display-width v0.3.0
Compiling termion v3.0.0
Compiling gix-utils v0.1.12
Compiling tree-sitter-python v0.23.4
Compiling tree-sitter-md v0.3.2
Compiling tree-sitter-ruby v0.23.1
Compiling tree-sitter-toml-ng v0.6.0
Compiling tree-sitter-html v0.23.2
Compiling tree-sitter-rust v0.23.2
Compiling tree-sitter-typescript v0.23.2
Compiling tree-sitter-c v0.23.2
Compiling tree-sitter-go v0.23.4
Compiling tree-sitter-bash v0.23.3
Compiling tree-sitter-css v0.23.1
Compiling tree-sitter-json v0.24.8
Compiling sqlite3-sys v0.15.2
Compiling sqlite v0.32.0
Compiling gix-hash v0.14.2
Compiling same-file v1.0.6
Compiling nonempty v0.5.0
Compiling base64 v0.13.1
Compiling radicle-cli v0.12.1 (/c10adf5d-f5b6-4f26-b6dc-996d5dd15371/w/radicle-cli)
Compiling walkdir v2.5.0
Compiling tree-sitter-highlight v0.24.4
Compiling timeago v0.4.2
Compiling sha1_smol v1.0.0
Compiling prodash v28.0.0
Compiling gix-features v0.38.2
Compiling smallvec v1.13.2
Compiling time-core v0.1.2
Compiling num-conv v0.1.0
Compiling scopeguard v1.2.0
Compiling powerfmt v0.2.0
Compiling lock_api v0.4.11
Compiling time-macros v0.2.18
Compiling deranged v0.3.11
Compiling parking_lot_core v0.9.9
Compiling num_threads v0.1.7
Compiling home v0.5.9
Compiling gix-path v0.10.9
Compiling parking_lot v0.12.1
Compiling winnow v0.6.8
Compiling gix-validate v0.8.5
Compiling memmap2 v0.9.4
Compiling time v0.3.36
Compiling gix-chunk v0.4.8
Compiling shell-words v1.1.0
Compiling gix-command v0.3.6
Compiling gix-commitgraph v0.24.3
Compiling gix-hashtable v0.5.2
Compiling gix-url v0.27.3
Compiling gix-config-value v0.14.6
Compiling gix-date v0.8.7
Compiling gix-actor v0.31.5
Compiling gix-object v0.42.3
Compiling gix-fs v0.11.2
Compiling gix-quote v0.4.12
Compiling gix-sec v0.10.6
Compiling gix-tempfile v14.0.1
Compiling gix-revwalk v0.13.2
Compiling gix-diff v0.44.1
Compiling gix-traverse v0.39.2
Compiling gix-prompt v0.8.4
Compiling gix-packetline v0.17.5
Compiling gix-credentials v0.24.2
Compiling gix-transport v0.42.0
Compiling gix-pack v0.51.1
Compiling arc-swap v1.7.1
Compiling gix-protocol v0.45.0
Compiling popol v3.0.0
Compiling either v1.11.0
Compiling gix-odb v0.61.1
Compiling io-reactor v0.5.2
Compiling salsa20 v0.10.2
Compiling socket2 v0.5.7
Compiling siphasher v0.3.11
Compiling radicle-node v0.10.0 (/c10adf5d-f5b6-4f26-b6dc-996d5dd15371/w/radicle-node)
Compiling bloomy v1.2.0
Compiling netservices v0.8.0
Compiling scrypt v0.11.0
Compiling radicle-systemd v0.9.0 (/c10adf5d-f5b6-4f26-b6dc-996d5dd15371/w/radicle-systemd)
Compiling radicle-remote-helper v0.10.0 (/c10adf5d-f5b6-4f26-b6dc-996d5dd15371/w/radicle-remote-helper)
Compiling git2 v0.19.0
Compiling radicle-git-ext v0.8.0
Compiling radicle-term v0.12.0 (/c10adf5d-f5b6-4f26-b6dc-996d5dd15371/w/radicle-term)
Compiling radicle-crypto v0.11.0 (/c10adf5d-f5b6-4f26-b6dc-996d5dd15371/w/radicle-crypto)
Compiling radicle-cob v0.13.0 (/c10adf5d-f5b6-4f26-b6dc-996d5dd15371/w/radicle-cob)
Compiling radicle-crdt v0.1.0 (/c10adf5d-f5b6-4f26-b6dc-996d5dd15371/w/radicle-crdt)
Compiling radicle v0.14.0 (/c10adf5d-f5b6-4f26-b6dc-996d5dd15371/w/radicle)
Compiling radicle-cli-test v0.10.0 (/c10adf5d-f5b6-4f26-b6dc-996d5dd15371/w/radicle-cli-test)
Compiling radicle-fetch v0.10.0 (/c10adf5d-f5b6-4f26-b6dc-996d5dd15371/w/radicle-fetch)
Compiling radicle-tools v0.9.0 (/c10adf5d-f5b6-4f26-b6dc-996d5dd15371/w/radicle-tools)
Finished `dev` profile [unoptimized + debuginfo] target(s) in 1m 08s
+ cargo doc --workspace --no-deps
Compiling syn v1.0.109
Checking radicle-ssh v0.9.0 (/c10adf5d-f5b6-4f26-b6dc-996d5dd15371/w/radicle-ssh)
Checking radicle-dag v0.10.0 (/c10adf5d-f5b6-4f26-b6dc-996d5dd15371/w/radicle-dag)
Checking radicle-signals v0.10.0 (/c10adf5d-f5b6-4f26-b6dc-996d5dd15371/w/radicle-signals)
Compiling radicle-cli v0.12.1 (/c10adf5d-f5b6-4f26-b6dc-996d5dd15371/w/radicle-cli)
Checking radicle-term v0.12.0 (/c10adf5d-f5b6-4f26-b6dc-996d5dd15371/w/radicle-term)
Compiling radicle-node v0.10.0 (/c10adf5d-f5b6-4f26-b6dc-996d5dd15371/w/radicle-node)
Checking radicle-systemd v0.9.0 (/c10adf5d-f5b6-4f26-b6dc-996d5dd15371/w/radicle-systemd)
Documenting radicle-term v0.12.0 (/c10adf5d-f5b6-4f26-b6dc-996d5dd15371/w/radicle-term)
Documenting radicle-signals v0.10.0 (/c10adf5d-f5b6-4f26-b6dc-996d5dd15371/w/radicle-signals)
Documenting radicle-ssh v0.9.0 (/c10adf5d-f5b6-4f26-b6dc-996d5dd15371/w/radicle-ssh)
Documenting radicle-dag v0.10.0 (/c10adf5d-f5b6-4f26-b6dc-996d5dd15371/w/radicle-dag)
Documenting radicle-systemd v0.9.0 (/c10adf5d-f5b6-4f26-b6dc-996d5dd15371/w/radicle-systemd)
Compiling amplify_syn v2.0.1
Compiling proc-macro-error v1.0.4
Compiling amplify_derive v4.0.0
Compiling data-encoding-macro-internal v0.1.12
Compiling git-ref-format-macro v0.3.0
Checking data-encoding-macro v0.1.14
Checking git-ref-format v0.3.0
Checking multibase v0.9.1
Checking radicle-git-ext v0.8.0
Checking radicle-surf v0.22.0
Checking amplify v4.6.0
Checking cyphergraphy v0.3.0
Checking io-reactor v0.5.2
Checking cypheraddr v0.4.0
Checking noise-framework v0.4.0
Checking socks5-client v0.4.1
Checking cyphernet v0.5.2
Checking radicle-crypto v0.11.0 (/c10adf5d-f5b6-4f26-b6dc-996d5dd15371/w/radicle-crypto)
Checking netservices v0.8.0
Documenting radicle-crypto v0.11.0 (/c10adf5d-f5b6-4f26-b6dc-996d5dd15371/w/radicle-crypto)
Checking radicle-cob v0.13.0 (/c10adf5d-f5b6-4f26-b6dc-996d5dd15371/w/radicle-cob)
Documenting radicle-cob v0.13.0 (/c10adf5d-f5b6-4f26-b6dc-996d5dd15371/w/radicle-cob)
Documenting radicle-crdt v0.1.0 (/c10adf5d-f5b6-4f26-b6dc-996d5dd15371/w/radicle-crdt)
Checking radicle v0.14.0 (/c10adf5d-f5b6-4f26-b6dc-996d5dd15371/w/radicle)
Documenting radicle v0.14.0 (/c10adf5d-f5b6-4f26-b6dc-996d5dd15371/w/radicle)
Checking radicle-cli-test v0.10.0 (/c10adf5d-f5b6-4f26-b6dc-996d5dd15371/w/radicle-cli-test)
Checking radicle-fetch v0.10.0 (/c10adf5d-f5b6-4f26-b6dc-996d5dd15371/w/radicle-fetch)
Documenting radicle-cli-test v0.10.0 (/c10adf5d-f5b6-4f26-b6dc-996d5dd15371/w/radicle-cli-test)
Documenting radicle-fetch v0.10.0 (/c10adf5d-f5b6-4f26-b6dc-996d5dd15371/w/radicle-fetch)
Documenting radicle-cli v0.12.1 (/c10adf5d-f5b6-4f26-b6dc-996d5dd15371/w/radicle-cli)
Documenting radicle-node v0.10.0 (/c10adf5d-f5b6-4f26-b6dc-996d5dd15371/w/radicle-node)
Documenting radicle-remote-helper v0.10.0 (/c10adf5d-f5b6-4f26-b6dc-996d5dd15371/w/radicle-remote-helper)
Checking radicle-remote-helper v0.10.0 (/c10adf5d-f5b6-4f26-b6dc-996d5dd15371/w/radicle-remote-helper)
Documenting radicle-tools v0.9.0 (/c10adf5d-f5b6-4f26-b6dc-996d5dd15371/w/radicle-tools)
Finished `dev` profile [unoptimized + debuginfo] target(s) in 9.55s
Generated /c10adf5d-f5b6-4f26-b6dc-996d5dd15371/w/target/doc/radicle/index.html and 22 other files
+ cargo test --workspace --no-fail-fast
Finished `test` profile [unoptimized + debuginfo] target(s) in 0.10s
Running unittests src/lib.rs (target/debug/deps/radicle-18f107ba76e5475a)
running 167 tests
test canonical::formatter::test::ascii_control_characters ... ok
test canonical::formatter::test::ordered_nested_object ... ok
test canonical::formatter::test::securesystemslib_asserts ... ok
test cob::cache::migrations::_2::tests::test_patch_json_deserialization ... ok
test cob::common::test::test_color ... ok
test cob::cache::migrations::_2::tests::test_migration_2 ... ok
test cob::cache::tests::test_migrate_to ... ok
test cob::cache::tests::test_check_version ... ok
test cob::identity::test::prop_json_eq_str ... ok
test cob::identity::test::test_identity_redact_revision ... ok
test cob::identity::test::test_identity_update_rejected ... ok
test cob::identity::test::test_identity_remove_delegate_concurrent ... ok
test cob::identity::test::test_identity_reject_concurrent ... ok
test cob::identity::test::test_identity_updates ... ok
test cob::issue::cache::tests::test_counts ... ok
test cob::issue::cache::tests::test_get ... ok
test cob::issue::cache::tests::test_is_empty ... ok
test cob::issue::cache::tests::test_list ... ok
test cob::issue::cache::tests::test_list_by_status ... ok
test cob::issue::cache::tests::test_remove ... ok
test cob::identity::test::test_valid_identity ... ok
test cob::issue::test::test_embeds ... ok
test cob::issue::test::test_embeds_edit ... ok
test cob::identity::test::test_identity_updates_concurrent ... ok
test cob::issue::test::test_invalid_actions ... ok
test cob::issue::test::test_invalid_cob ... ok
test cob::issue::test::test_invalid_tx ... ok
test cob::identity::test::test_identity_updates_concurrent_outdated ... ok
test cob::issue::test::test_issue_all ... ok
test cob::issue::test::test_concurrency ... ok
test cob::issue::test::test_issue_comment ... ok
test cob::issue::test::test_issue_comment_redact ... ok
test cob::issue::test::test_issue_create_and_change_state ... ok
test cob::issue::test::test_issue_create_and_assign ... ok
test cob::issue::test::test_issue_create_and_get ... ok
test cob::issue::test::test_issue_create_and_unassign ... ok
test cob::issue::test::test_issue_edit ... ok
test cob::issue::test::test_issue_create_and_reassign ... ok
test cob::issue::test::test_issue_edit_description ... ok
test cob::issue::test::test_issue_multilines ... ok
test cob::issue::test::test_issue_state_serde ... ok
test cob::issue::test::test_ordering ... ok
test cob::issue::test::test_issue_label ... ok
test cob::patch::cache::tests::test_find_by_revision ... ok
test cob::issue::test::test_issue_react ... ok
test cob::patch::cache::tests::test_is_empty ... ok
test cob::patch::cache::tests::test_list ... ok
test cob::issue::test::test_issue_reply ... ok
test cob::patch::cache::tests::test_list_by_status ... ok
test cob::patch::test::test_json ... ok
test cob::patch::test::test_json_serialization ... ok
test cob::patch::cache::tests::test_counts ... ok
test cob::patch::cache::tests::test_get ... ok
test cob::patch::test::test_patch_create_and_get ... ok
test cob::patch::cache::tests::test_remove ... ok
test cob::patch::test::test_patch_discussion ... ok
test cob::patch::test::test_patch_merge ... ok
test cob::patch::test::test_patch_redact ... ok
test cob::patch::test::test_patch_review_duplicate ... ok
test cob::patch::test::test_patch_review ... ok
test cob::patch::test::test_patch_review_comment ... ok
test cob::patch::test::test_patch_review_edit ... ok
test cob::patch::test::test_patch_review_remove_summary ... ok
test cob::patch::test::test_reactions_json_serialization ... ok
test cob::patch::test::test_revision_edit_redact ... ok
test cob::patch::test::test_revision_reaction ... ok
test cob::patch::test::test_revision_review_merge_redacted ... ok
test cob::patch::test::test_patch_review_edit_comment ... ok
test cob::thread::tests::test_comment_edit_missing ... ok
test cob::patch::test::test_patch_review_revision_redact ... ok
test cob::thread::tests::test_comment_edit_redacted ... ok
test cob::thread::tests::test_comment_redact_missing ... ok
test cob::thread::tests::test_edit_comment ... ok
test cob::thread::tests::test_duplicate_comments ... ok
test cob::thread::tests::test_redact_comment ... ok
test cob::thread::tests::test_timeline ... ok
test git::canonical::tests::test_quorum_merges ... ok
test cob::patch::test::test_patch_update ... ok
test git::test::test_version_from_str ... ok
test git::test::test_version_ord ... ok
test identity::did::test::test_did_encode_decode ... ok
test identity::did::test::test_did_vectors ... ok
test identity::doc::id::test::prop_from_str ... ok
test git::canonical::tests::test_quorum ... ok
test identity::doc::test::test_canonical_doc ... ok
test identity::doc::test::test_canonical_example ... ok
test identity::doc::test::test_duplicate_dids ... ok
test identity::doc::test::test_future_version_error ... ok
test identity::doc::test::test_is_valid_version ... ok
test identity::doc::test::test_max_delegates ... ok
test identity::doc::test::test_not_found ... ok
test identity::doc::test::test_parse_version ... ok
test identity::doc::test::test_visibility_json ... ok
test identity::project::test::test_project_name ... ok
test git::canonical::tests::test_quorum_properties ... ok
test node::address::store::test::test_alias ... ok
test node::address::store::test::test_disconnected ... ok
test node::address::store::test::test_disconnected_ban ... ok
test node::address::store::test::test_entries ... ok
test node::address::store::test::test_get_none ... ok
test node::address::store::test::test_insert_and_get ... ok
test node::address::store::test::test_insert_and_remove ... ok
test node::address::store::test::test_insert_and_update ... ok
test node::address::store::test::test_insert_duplicate ... ok
test node::address::store::test::test_remove_nothing ... ok
test node::db::test::test_version ... ok
test node::features::test::test_operations ... ok
test node::notifications::store::test::test_branch_notifications ... ok
test node::notifications::store::test::test_clear ... ok
test node::notifications::store::test::test_cob_notifications ... ok
test node::notifications::store::test::test_counts_by_repo ... ok
test node::notifications::store::test::test_duplicate_notifications ... ok
test node::notifications::store::test::test_notification_status ... ok
test node::policy::store::test::test_follow_and_unfollow_node ... ok
test node::policy::store::test::test_node_policies ... ok
test node::policy::store::test::test_node_policy ... ok
test node::policy::store::test::test_repo_policies ... ok
test node::policy::store::test::test_repo_policy ... ok
test node::policy::store::test::test_seed_and_unseed_repo ... ok
test node::policy::store::test::test_update_alias ... ok
test node::policy::store::test::test_update_scope ... ok
test node::refs::store::test::test_count ... ok
test node::refs::store::test::test_set_and_delete ... ok
test node::address::store::test::test_empty ... ok
test node::routing::test::test_count ... ok
test node::refs::store::test::test_set_and_get ... ok
test node::routing::test::test_insert_and_get ... ok
test node::routing::test::test_entries ... ok
test node::routing::test::test_insert_and_get_resources ... ok
test node::routing::test::test_insert_and_remove ... ok
test node::routing::test::test_insert_duplicate ... ok
test node::routing::test::test_insert_existing_updated_time ... ok
test node::routing::test::test_len ... ok
test node::routing::test::test_remove_many ... ok
test node::routing::test::test_remove_redundant ... ok
test node::routing::test::test_update_existing_multi ... ok
test node::test::test_alias ... ok
test node::test::test_command_result ... ok
test node::test::test_user_agent ... ok
test node::timestamp::tests::test_timestamp_max ... ok
test profile::test::canonicalize_home ... ok
test profile::test::test_config ... ok
test node::routing::test::test_prune ... ok
test rad::tests::test_fork ... ok
test rad::tests::test_checkout ... ok
test serde_ext::test::test_localtime ... ok
test serde_ext::test::test_localtime_ext ... ok
test rad::tests::test_init ... ok
test cob::thread::tests::prop_ordering ... ok
test storage::git::tests::test_references_of ... ok
test storage::git::transport::local::url::test::test_url_parse ... ok
test storage::git::transport::local::url::test::test_url_to_string ... ok
test storage::git::transport::remote::url::test::test_url_parse ... ok
test storage::refs::tests::prop_canonical_roundtrip ... ok
test storage::git::tests::test_sign_refs ... ok
test storage::tests::test_storage ... ok
test test::assert::test::assert_with_message ... ok
test test::assert::test::test_assert_no_move ... ok
test test::assert::test::test_assert_panic_0 - should panic ... ok
test test::assert::test::test_assert_panic_1 - should panic ... ok
test test::assert::test::test_assert_panic_2 - should panic ... ok
test test::assert::test::test_assert_succeed ... ok
test test::assert::test::test_panic_message ... ok
test version::test::test_version ... ok
test storage::git::tests::test_remote_refs ... ok
test storage::refs::tests::test_rid_verification ... ok
test identity::doc::test::prop_encode_decode ... ok
test result: ok. 167 passed; 0 failed; 0 ignored; 0 measured; 0 filtered out; finished in 2.26s
Running unittests src/lib.rs (target/debug/deps/radicle_cli-f95f6c1620dc5f6c)
running 14 tests
test commands::rad_inspect::test::test_tree ... ok
test commands::rad_patch::review::builder::tests::test_review_comments_split_hunk ... ok
test commands::rad_patch::review::builder::tests::test_review_comments_before ... ok
test commands::rad_patch::review::builder::tests::test_review_comments_basic ... ok
test commands::rad_patch::review::builder::tests::test_review_comments_multiline ... ok
test git::pretty_diff::test::test_pretty ... ignored
test git::ddiff::tests::diff_encode_decode_ddiff_hunk ... ok
test git::unified_diff::test::test_diff_content_encode_decode_content ... ok
test terminal::format::test::test_bytes ... ok
test terminal::format::test::test_strip_comments ... ok
test terminal::patch::test::test_edit_display_message ... ok
test git::unified_diff::test::test_diff_encode_decode_diff ... ok
test terminal::patch::test::test_create_display_message ... ok
test terminal::patch::test::test_update_display_message ... ok
test result: ok. 13 passed; 0 failed; 1 ignored; 0 measured; 0 filtered out; finished in 0.01s
Running unittests src/main.rs (target/debug/deps/rad-fd66f6d28e72845a)
running 0 tests
test result: ok. 0 passed; 0 failed; 0 ignored; 0 measured; 0 filtered out; finished in 0.00s
Running tests/commands.rs (target/debug/deps/commands-0468ef92476afba6)
running 91 tests
test framework_home ... ok
test git_push_and_fetch ... ok
test git_push_amend ... ok
test git_push_diverge ... ok
test rad_auth ... ok
test rad_auth_errors ... ok
test rad_block ... ok
test rad_checkout ... ok
test git_push_rollback ... ok
test git_tag ... ok
test rad_clone ... ok
test git_push_converge ... ok
test rad_clean ... ok
test rad_clone_all ... ok
test rad_clone_unknown ... ok
test rad_clone_directory ... ok
test rad_clone_connect ... ok
test rad_cob_log ... ok
test rad_cob_migrate ... ok
test rad_config ... ok
test rad_cob_show ... ok
test rad_diff ... ok
test rad_clone_partial_fail ... ok
test rad_id_collaboration ... ignored, slow
test rad_id ... ok
test rad_id_conflict ... ok
test rad_id_private ... ok
test rad_id_multi_delegate ... ok
test rad_id_threshold ... ok
test rad_id_unknown_field ... ok
test rad_id_update_delete_field ... ok
test rad_id_threshold_soft_fork ... ok
test rad_init ... ok
test rad_init_existing ... ok
test rad_init_no_git ... ok
test rad_init_no_seed ... ok
test rad_init_private ... ok
test rad_init_private_clone ... ok
test rad_inbox ... ok
test rad_init_private_no_seed ... ok
test rad_init_private_clone_seed ... ok
test rad_init_private_seed ... ok
test rad_fetch ... ok
test rad_fork ... ok
test rad_init_sync_not_connected ... ok
test rad_init_sync_preferred ... ok
test rad_init_with_existing_remote ... ok
test rad_inspect ... ok
test rad_issue ... ok
test rad_job ... ok
test rad_merge_after_update ... ok
test rad_merge_no_ff ... ok
test rad_merge_via_push ... ok
test rad_node_connect ... ok
test rad_patch ... ok
test rad_node ... ok
test rad_patch_ahead_behind ... ok
test rad_patch_change_base ... ok
test rad_patch_checkout ... ok
test rad_patch_checkout_revision ... ok
test rad_patch_checkout_force ... ok
test rad_patch_detached_head ... ok
test rad_patch_diff ... ok
test rad_patch_draft ... ok
test rad_init_sync_timeout ... ok
test rad_init_sync_and_clone ... ok
test rad_patch_edit ... ok
test rad_patch_fetch_2 ... ok
test rad_patch_merge_draft ... ok
test rad_patch_delete ... ok
test rad_patch_fetch_1 ... ok
test rad_patch_revert_merge ... ok
test rad_patch_update ... ok
test rad_publish ... ok
test rad_patch_open_explore ... ok
test rad_patch_via_push ... ok
test rad_review_by_hunk ... ok
test rad_seed_and_follow ... ok
test rad_self ... ok
test rad_remote ... ok
test rad_sync_without_node ... ok
test rad_unseed ... ok
test rad_push_and_pull_patches ... ok
test rad_sync ... ok
test test_clone_without_seeds ... ok
test rad_watch ... ok
test test_cob_deletion ... ok
test test_cob_replication ... ok
test rad_workflow ... ok
test rad_patch_pull_update ... ok
test test_replication_via_seed ... ok
test result: ok. 90 passed; 0 failed; 1 ignored; 0 measured; 0 filtered out; finished in 70.27s
Running unittests src/lib.rs (target/debug/deps/radicle_cli_test-c75e7668e114a8bb)
running 3 tests
test tests::test_parse ... ok
test tests::test_run ... ok
test tests::test_example_spaced_brackets ... ok
test result: ok. 3 passed; 0 failed; 0 ignored; 0 measured; 0 filtered out; finished in 0.00s
Running unittests src/lib.rs (target/debug/deps/radicle_cob-a9504084b903b806)
running 8 tests
test object::tests::test_serde ... ok
test tests::invalid_parse_refstr ... ok
test tests::parse_refstr ... ok
test tests::roundtrip ... ok
test type_name::test::valid_typenames ... ok
test tests::traverse_cobs ... ok
test tests::list_cobs ... ok
test tests::update_cob ... ok
test result: ok. 8 passed; 0 failed; 0 ignored; 0 measured; 0 filtered out; finished in 0.02s
Running unittests src/lib.rs (target/debug/deps/radicle_crdt-70166ac626eba3cd)
running 24 tests
test immutable::test::test_merge_equal ... ok
test immutable::test::test_merge_inequal - should panic ... ok
test lwwmap::tests::test_insert ... ok
test lwwmap::tests::test_insert_remove ... ok
test lwwmap::tests::test_is_empty ... ok
test lwwmap::tests::test_remove_insert ... ok
test lwwreg::tests::prop_semilattice ... ok
test lwwreg::tests::test_merge ... ok
test lwwreg::tests::test_set_get ... ok
test gmap::tests::prop_semilattice ... ok
test lwwset::tests::test_insert ... ok
test lwwset::tests::test_insert_remove ... ok
test lwwset::tests::test_remove_insert ... ok
test redactable::test::prop_invariants ... ok
test redactable::test::test_both_present ... ok
test redactable::test::test_redacted ... ok
test test::test_generator ... ok
test tests::prop_bool_laws ... ok
test tests::prop_option_laws ... ok
test tests::test_bool ... ok
test tests::test_option ... ok
test gset::tests::prop_semilattice ... ok
test lwwset::tests::prop_semilattice ... ok
test lwwmap::tests::prop_semilattice ... ok
test result: ok. 24 passed; 0 failed; 0 ignored; 0 measured; 0 filtered out; finished in 0.07s
Running unittests src/lib.rs (target/debug/deps/radicle_crypto-f7870af388ff2e5f)
running 12 tests
test ssh::fmt::test::test_fingerprint ... ok
test ssh::fmt::test::test_key ... ok
test ssh::keystore::tests::test_init_no_passphrase ... ok
test ssh::test::test_agent_encoding_remove ... ok
test ssh::test::test_agent_encoding_sign ... ok
test ssh::test::prop_encode_decode_sk ... ok
test tests::prop_encode_decode ... ok
test tests::prop_key_equality ... ok
test tests::test_e25519_dh ... ok
test tests::test_encode_decode ... ok
test ssh::keystore::tests::test_signer ... ok
test ssh::keystore::tests::test_init_passphrase ... ok
test result: ok. 12 passed; 0 failed; 0 ignored; 0 measured; 0 filtered out; finished in 0.85s
Running unittests src/lib.rs (target/debug/deps/radicle_dag-8f2b491dc1bd0d36)
running 20 tests
test tests::test_complex ... ok
test tests::test_contains ... ok
test tests::test_cycle ... ok
test tests::test_dependencies ... ok
test tests::test_diamond ... ok
test tests::test_fold_diamond ... ok
test tests::test_fold_multiple_roots ... ok
test tests::test_fold_reject ... ok
test tests::test_fold_sorting_1 ... ok
test tests::test_fold_sorting_2 ... ok
test tests::test_get ... ok
test tests::test_is_empty ... ok
test tests::test_len ... ok
test tests::test_merge_1 ... ok
test tests::test_merge_2 ... ok
test tests::test_prune_1 ... ok
test tests::test_prune_2 ... ok
test tests::test_prune_by_sorting ... ok
test tests::test_remove ... ok
test tests::test_siblings ... ok
test result: ok. 20 passed; 0 failed; 0 ignored; 0 measured; 0 filtered out; finished in 0.00s
Running unittests src/lib.rs (target/debug/deps/radicle_fetch-988e6f4705bdbbe9)
running 0 tests
test result: ok. 0 passed; 0 failed; 0 ignored; 0 measured; 0 filtered out; finished in 0.00s
Running unittests src/lib.rs (target/debug/deps/radicle_node-00c27261cefcc624)
running 112 tests
test deserializer::test::prop_decode_next ... ok
test deserializer::test::test_decode_next ... ok
test deserializer::test::test_unparsed ... ok
test control::tests::test_control_socket ... ok
test service::gossip::store::test::test_announced ... ok
test service::filter::test::test_parameters ... ok
test service::limiter::test::test_limitter_multi ... ok
test service::limiter::test::test_limitter_different_rates ... ok
test service::limiter::test::test_limitter_refill ... ok
test service::filter::test::test_sizes ... ok
test control::tests::test_seed_unseed ... ok
test service::message::tests::test_inventory_limit ... ok
test service::message::tests::test_ref_remote_limit ... ok
test service::message::tests::prop_refs_announcement_signing ... ok
test tests::e2e::missing_default_branch ... ok
test tests::e2e::missing_delegate_default_branch ... ok
test tests::e2e::test_background_foreground_fetch ... ok
test tests::e2e::test_catchup_on_refs_announcements ... ok
test tests::e2e::test_clone ... ok
test tests::e2e::test_dont_fetch_owned_refs ... ok
test service::message::tests::test_node_announcement_validate ... ok
test tests::e2e::test_connection_crossing ... FAILED
test tests::e2e::test_fetch_followed_remotes ... ok
test tests::e2e::test_fetch_preserve_owned_refs ... ok
test tests::e2e::test_concurrent_fetches ... ok
test tests::e2e::test_fetch_unseeded ... ok
test tests::e2e::test_inventory_sync_basic ... ok
test tests::e2e::test_fetch_up_to_date ... ok
test tests::e2e::test_large_fetch ... ok
test tests::e2e::test_migrated_clone ... ok
test tests::e2e::test_missing_remote ... ok
test tests::e2e::test_multiple_offline_inits ... ok
test tests::e2e::test_non_fastforward_sigrefs ... ok
test tests::e2e::test_outdated_delegate_sigrefs ... ok
test tests::e2e::test_outdated_sigrefs ... ok
test tests::e2e::test_replication ... ok
test tests::e2e::test_replication_invalid ... ok
test tests::e2e::test_inventory_sync_bridge ... ok
test tests::e2e::test_replication_ref_in_sigrefs ... ok
test tests::e2e::test_inventory_sync_ring ... ok
test tests::e2e::test_inventory_sync_star ... ok
test tests::test_announcement_rebroadcast ... ok
test tests::test_announcement_rebroadcast_duplicates ... ok
test tests::test_announcement_relay ... ok
test tests::test_announcement_rebroadcast_timestamp_filtered ... ok
test tests::test_connection_kept_alive ... ok
test tests::test_disconnecting_unresponsive_peer ... ok
test tests::test_fetch_missing_inventory_on_gossip ... ok
test tests::test_fetch_missing_inventory_on_schedule ... ok
test tests::test_inbound_connection ... ok
test tests::test_inventory_decode ... ok
test tests::test_init_and_seed ... ok
test tests::test_inventory_relay ... ok
test tests::test_inventory_relay_bad_timestamp ... ok
test tests::test_inventory_sync ... ok
test tests::test_maintain_connections ... ok
test tests::test_maintain_connections_failed_attempt ... ok
test tests::test_maintain_connections_transient ... ok
test tests::test_outbound_connection ... ok
test tests::test_persistent_peer_connect ... ok
test tests::test_inventory_pruning ... ok
test tests::test_persistent_peer_reconnect_success ... ok
test tests::test_persistent_peer_reconnect_attempt ... ok
test tests::test_ping_response ... ok
test tests::test_queued_fetch_from_ann_same_rid ... ok
test tests::test_queued_fetch_from_command_same_rid ... ok
test tests::test_queued_fetch_max_capacity ... ok
test tests::test_redundant_connect ... ok
test tests::test_refs_announcement_fetch_trusted_no_inventory ... ok
test tests::test_refs_announcement_followed ... ok
test tests::test_refs_announcement_no_subscribe ... ok
test tests::test_refs_announcement_offline ... ok
test tests::test_refs_announcement_relay_private ... ok
test tests::test_refs_announcement_relay_public ... ok
test tests::test_seed_repo_subscribe ... ok
test tests::test_seeding ... ok
test wire::frame::test::test_stream_id ... ok
test tests::test_refs_synced_event ... ok
test wire::message::tests::prop_addr ... ok
test wire::message::tests::prop_message_encode_decode ... ok
test wire::message::tests::prop_zero_bytes_encode_decode ... ok
test wire::message::tests::test_inv_ann_max_size ... ok
test wire::message::tests::test_node_ann_max_size ... ok
test wire::message::tests::test_pingpong_encode_max_size ... ok
test wire::message::tests::test_pingpong_encode_size_overflow ... ok
test wire::message::tests::test_refs_ann_max_size ... ok
test wire::protocol::test::test_inventory_ann_with_extension ... ok
test wire::protocol::test::test_pong_message_with_extension ... ok
test wire::tests::prop_filter ... ok
test wire::tests::prop_id ... ok
test wire::tests::prop_oid ... ok
test wire::tests::prop_pubkey ... ok
test wire::tests::prop_refs ... ok
test wire::tests::prop_signature ... ok
test wire::tests::prop_signed_refs ... ok
test wire::tests::prop_string ... ok
test wire::tests::prop_tuple ... ok
test wire::tests::prop_u16 ... ok
test wire::tests::prop_u32 ... ok
test wire::tests::prop_u64 ... ok
test wire::tests::prop_u8 ... ok
test wire::tests::prop_vec ... ok
test wire::tests::test_alias ... ok
test wire::tests::test_bounded_vec_limit ... ok
test wire::tests::test_filter_invalid ... ok
test wire::tests::test_string ... ok
test wire::varint::test::prop_encode_decode ... ok
test wire::varint::test::test_encode_overflow - should panic ... ok
test wire::varint::test::test_encoding ... ok
test tests::prop_inventory_exchange_dense ... ok
test wire::message::tests::prop_message_decoder ... ok
test tests::test_announcement_message_amplification ... ok
failures:
---- tests::e2e::test_connection_crossing stdout ----
1788819436 test: Node::init alice: z6MkpQTvJHbF5tKXMHLm5YiiaziAERLjotGyEkYy6kxpkc26
1788819436 test: Node::init bob: z6MkwHGsfSBGmmxNSS4JDgk5RPL4b1w3ePof75mLCobPr9RA
1788819436 tests::e2e::test_connection_crossing node: Opening policy database..
1788819436 tests::e2e::test_connection_crossing node: Migrating COBs cache..
1788819436 tests::e2e::test_connection_crossing node: Migration of COBs cache complete (version=2)..
1788819436 tests::e2e::test_connection_crossing node: Default seeding policy set to 'block (all)'
1788819436 tests::e2e::test_connection_crossing node: Initializing service (Test)..
1788819436 tests::e2e::test_connection_crossing node: Opening node database..
1788819436 tests::e2e::test_connection_crossing node: Address book is empty. Adding bootstrap nodes..
1788819436 tests::e2e::test_connection_crossing node: 0 nodes added to address book
1788819436 tests::e2e::test_connection_crossing service: Init @1788819436132
1788819436 tests::e2e::test_connection_crossing service: Empty refs database, populating from storage..
1788819436 tests::e2e::test_connection_crossing service: Not enough available peers to connect to (available=0, wanted=8)
1788819436 z6MkpQTvJHbF5tKXMHLm5YiiaziAERLjotGyEkYy6kxpkc26 <service> node: Listening on 0.0.0.0:45929..
1788819436 tests::e2e::test_connection_crossing node: Binding control socket /tmp/.tmplpDsdL/OSAdQInB/node/control.sock..
1788819436 z6MkpQTvJHbF5tKXMHLm5YiiaziAERLjotGyEkYy6kxpkc26 <runtime> node: Running node z6MkpQTvJHbF5tKXMHLm5YiiaziAERLjotGyEkYy6kxpkc26 in /tmp/.tmplpDsdL/OSAdQInB..
1788819436 tests::e2e::test_connection_crossing node: Opening policy database..
1788819436 z6MkpQTvJHbF5tKXMHLm5YiiaziAERLjotGyEkYy6kxpkc26 <control> control: Control thread listening on socket..
1788819436 z6MkpQTvJHbF5tKXMHLm5YiiaziAERLjotGyEkYy6kxpkc26 <signals> node: Signal notifications channel error: receiving on an empty and disconnected channel
1788819436 z6MkpQTvJHbF5tKXMHLm5YiiaziAERLjotGyEkYy6kxpkc26 <service> service: Received command QueryState(..)
1788819436 tests::e2e::test_connection_crossing node: Migrating COBs cache..
1788819436 tests::e2e::test_connection_crossing node: Migration of COBs cache complete (version=2)..
1788819436 tests::e2e::test_connection_crossing node: Default seeding policy set to 'block (all)'
1788819436 tests::e2e::test_connection_crossing node: Initializing service (Test)..
1788819436 tests::e2e::test_connection_crossing node: Opening node database..
1788819436 tests::e2e::test_connection_crossing node: Address book is empty. Adding bootstrap nodes..
1788819436 tests::e2e::test_connection_crossing node: 0 nodes added to address book
1788819436 tests::e2e::test_connection_crossing service: Init @1788819436169
1788819436 tests::e2e::test_connection_crossing service: Empty refs database, populating from storage..
1788819436 tests::e2e::test_connection_crossing service: Not enough available peers to connect to (available=0, wanted=8)
1788819436 z6MkwHGsfSBGmmxNSS4JDgk5RPL4b1w3ePof75mLCobPr9RA <service> node: Listening on 0.0.0.0:45469..
1788819436 tests::e2e::test_connection_crossing node: Binding control socket /tmp/.tmplpDsdL/ViyDopDa/node/control.sock..
1788819436 z6MkwHGsfSBGmmxNSS4JDgk5RPL4b1w3ePof75mLCobPr9RA <runtime> node: Running node z6MkwHGsfSBGmmxNSS4JDgk5RPL4b1w3ePof75mLCobPr9RA in /tmp/.tmplpDsdL/ViyDopDa..
1788819436 test: Preferred peer is z6MkwHGsfSBGmmxNSS4JDgk5RPL4b1w3ePof75mLCobPr9RA
1788819436 z6MkwHGsfSBGmmxNSS4JDgk5RPL4b1w3ePof75mLCobPr9RA <control> control: Control thread listening on socket..
1788819436 z6MkwHGsfSBGmmxNSS4JDgk5RPL4b1w3ePof75mLCobPr9RA <signals> node: Signal notifications channel error: receiving on an empty and disconnected channel
1788819436 z6MkpQTvJHbF5tKXMHLm5YiiaziAERLjotGyEkYy6kxpkc26 <service> service: Received command QueryState(..)
1788819436 z6MkwHGsfSBGmmxNSS4JDgk5RPL4b1w3ePof75mLCobPr9RA <service> service: Received command QueryState(..)
1788819436 z6MkwHGsfSBGmmxNSS4JDgk5RPL4b1w3ePof75mLCobPr9RA <service> service: Received command QueryState(..)
1788819436 z6MkpQTvJHbF5tKXMHLm5YiiaziAERLjotGyEkYy6kxpkc26 <service> service: Received command Connect(z6MkwHGsfSBGmmxNSS4JDgk5RPL4b1w3ePof75mLCobPr9RA, 0.0.0.0:45469, ConnectOptions { persistent: false, timeout: 30s })
1788819436 z6MkpQTvJHbF5tKXMHLm5YiiaziAERLjotGyEkYy6kxpkc26 <service> service: Connecting to z6MkwHGsfSBGmmxNSS4JDgk5RPL4b1w3ePof75mLCobPr9RA (0.0.0.0:45469)..
1788819436 z6MkpQTvJHbF5tKXMHLm5YiiaziAERLjotGyEkYy6kxpkc26 <service> service: Attempted connection to z6MkwHGsfSBGmmxNSS4JDgk5RPL4b1w3ePof75mLCobPr9RA (0.0.0.0:45469)
1788819436 z6MkpQTvJHbF5tKXMHLm5YiiaziAERLjotGyEkYy6kxpkc26 <service> wire: Registering outbound transport for z6MkwHGsfSBGmmxNSS4JDgk5RPL4b1w3ePof75mLCobPr9RA (fd=63)..
1788819436 z6MkpQTvJHbF5tKXMHLm5YiiaziAERLjotGyEkYy6kxpkc26 <service> wire: Outbound peer resource registered for z6MkwHGsfSBGmmxNSS4JDgk5RPL4b1w3ePof75mLCobPr9RA with id=2 (fd=63)
1788819436 z6MkwHGsfSBGmmxNSS4JDgk5RPL4b1w3ePof75mLCobPr9RA <service> wire: Inbound connection from 127.0.0.1:58096 (fd=91)..
1788819436 z6MkwHGsfSBGmmxNSS4JDgk5RPL4b1w3ePof75mLCobPr9RA <service> wire: Accepted inbound connection from 127.0.0.1:58096 (fd=91)..
1788819436 z6MkwHGsfSBGmmxNSS4JDgk5RPL4b1w3ePof75mLCobPr9RA <service> wire: Inbound peer resource registered with id=2 (fd=91)
1788819436 z6MkpQTvJHbF5tKXMHLm5YiiaziAERLjotGyEkYy6kxpkc26 <service> wire: Session established with z6MkwHGsfSBGmmxNSS4JDgk5RPL4b1w3ePof75mLCobPr9RA (id=2) (fd=63) (outbound)
1788819436 z6MkpQTvJHbF5tKXMHLm5YiiaziAERLjotGyEkYy6kxpkc26 <service> service: Connected to z6MkwHGsfSBGmmxNSS4JDgk5RPL4b1w3ePof75mLCobPr9RA (0.0.0.0:45469) (Outbound)
1788819436 z6MkpQTvJHbF5tKXMHLm5YiiaziAERLjotGyEkYy6kxpkc26 <service> service: Subscribing to messages since timestamp 1788733036207..
1788819436 z6MkwHGsfSBGmmxNSS4JDgk5RPL4b1w3ePof75mLCobPr9RA <service> wire: Session established with z6MkpQTvJHbF5tKXMHLm5YiiaziAERLjotGyEkYy6kxpkc26 (id=2) (fd=91) (inbound)
1788819436 z6MkwHGsfSBGmmxNSS4JDgk5RPL4b1w3ePof75mLCobPr9RA <service> service: Connected to z6MkpQTvJHbF5tKXMHLm5YiiaziAERLjotGyEkYy6kxpkc26 (127.0.0.1:58096) (Inbound)
1788819436 z6MkwHGsfSBGmmxNSS4JDgk5RPL4b1w3ePof75mLCobPr9RA <service> service: Subscribing to messages since timestamp 1788733036208..
1788819436 z6MkwHGsfSBGmmxNSS4JDgk5RPL4b1w3ePof75mLCobPr9RA <service> service: Received command Connect(z6MkpQTvJHbF5tKXMHLm5YiiaziAERLjotGyEkYy6kxpkc26, 0.0.0.0:45929, ConnectOptions { persistent: false, timeout: 30s })
1788819436 z6MkwHGsfSBGmmxNSS4JDgk5RPL4b1w3ePof75mLCobPr9RA <service> service: Connecting to z6MkpQTvJHbF5tKXMHLm5YiiaziAERLjotGyEkYy6kxpkc26 (0.0.0.0:45929)..
1788819436 z6MkwHGsfSBGmmxNSS4JDgk5RPL4b1w3ePof75mLCobPr9RA <service> service: Attempted connection to peer z6MkpQTvJHbF5tKXMHLm5YiiaziAERLjotGyEkYy6kxpkc26 which already has a session
1788819436 z6MkpQTvJHbF5tKXMHLm5YiiaziAERLjotGyEkYy6kxpkc26 <service> service: Received node announcement of z6MkwHGsfSBGmmxNSS4JDgk5RPL4b1w3ePof75mLCobPr9RA with 0 address(es) from z6MkwHGsfSBGmmxNSS4JDgk5RPL4b1w3ePof75mLCobPr9RA (t=1788819436169)
1788819436 z6MkwHGsfSBGmmxNSS4JDgk5RPL4b1w3ePof75mLCobPr9RA <service> service: Received node announcement of z6MkpQTvJHbF5tKXMHLm5YiiaziAERLjotGyEkYy6kxpkc26 with 0 address(es) from z6MkpQTvJHbF5tKXMHLm5YiiaziAERLjotGyEkYy6kxpkc26 (t=1788819436132)
1788819436 z6MkpQTvJHbF5tKXMHLm5YiiaziAERLjotGyEkYy6kxpkc26 <service> service: Stored announcement from z6MkwHGsfSBGmmxNSS4JDgk5RPL4b1w3ePof75mLCobPr9RA to be broadcast in 0 millisecond(s) (t=1788819436169)
1788819436 z6MkwHGsfSBGmmxNSS4JDgk5RPL4b1w3ePof75mLCobPr9RA <service> service: Stored announcement from z6MkpQTvJHbF5tKXMHLm5YiiaziAERLjotGyEkYy6kxpkc26 to be broadcast in 0 millisecond(s) (t=1788819436132)
1788819436 z6MkpQTvJHbF5tKXMHLm5YiiaziAERLjotGyEkYy6kxpkc26 <service> service: Address store entry for node z6MkwHGsfSBGmmxNSS4JDgk5RPL4b1w3ePof75mLCobPr9RA updated at 1788819436169
1788819436 z6MkpQTvJHbF5tKXMHLm5YiiaziAERLjotGyEkYy6kxpkc26 <service> service: Received inventory announcement of z6MkwHGsfSBGmmxNSS4JDgk5RPL4b1w3ePof75mLCobPr9RA with 0 item(s) from z6MkwHGsfSBGmmxNSS4JDgk5RPL4b1w3ePof75mLCobPr9RA (t=1788819436170)
1788819436 z6MkwHGsfSBGmmxNSS4JDgk5RPL4b1w3ePof75mLCobPr9RA <service> service: Address store entry for node z6MkpQTvJHbF5tKXMHLm5YiiaziAERLjotGyEkYy6kxpkc26 updated at 1788819436132
1788819436 z6MkwHGsfSBGmmxNSS4JDgk5RPL4b1w3ePof75mLCobPr9RA <service> service: Received inventory announcement of z6MkpQTvJHbF5tKXMHLm5YiiaziAERLjotGyEkYy6kxpkc26 with 0 item(s) from z6MkpQTvJHbF5tKXMHLm5YiiaziAERLjotGyEkYy6kxpkc26 (t=1788819436133)
1788819436 z6MkpQTvJHbF5tKXMHLm5YiiaziAERLjotGyEkYy6kxpkc26 <service> service: Stored announcement from z6MkwHGsfSBGmmxNSS4JDgk5RPL4b1w3ePof75mLCobPr9RA to be broadcast in 0 millisecond(s) (t=1788819436170)
1788819436 z6MkpQTvJHbF5tKXMHLm5YiiaziAERLjotGyEkYy6kxpkc26 <service> service: Received subscription filter from z6MkwHGsfSBGmmxNSS4JDgk5RPL4b1w3ePof75mLCobPr9RA
1788819436 z6MkwHGsfSBGmmxNSS4JDgk5RPL4b1w3ePof75mLCobPr9RA <service> service: Stored announcement from z6MkpQTvJHbF5tKXMHLm5YiiaziAERLjotGyEkYy6kxpkc26 to be broadcast in 0 millisecond(s) (t=1788819436133)
1788819436 z6MkwHGsfSBGmmxNSS4JDgk5RPL4b1w3ePof75mLCobPr9RA <service> service: Received subscription filter from z6MkpQTvJHbF5tKXMHLm5YiiaziAERLjotGyEkYy6kxpkc26
1788819437 z6MkpQTvJHbF5tKXMHLm5YiiaziAERLjotGyEkYy6kxpkc26 <service> service: Received command QueryState(..)
1788819437 z6MkwHGsfSBGmmxNSS4JDgk5RPL4b1w3ePof75mLCobPr9RA <service> service: Received command QueryState(..)
1788819437 z6MkpQTvJHbF5tKXMHLm5YiiaziAERLjotGyEkYy6kxpkc26 <service> service: Received command QueryState(..)
1788819437 test: Ok([Session { nid: PublicKey(z6MkwHGsfSBGmmxNSS4JDgk5RPL4b1w3ePof75mLCobPr9RA), link: Outbound, addr: Address(NetAddr { host: Ip(0.0.0.0), port: 45469 }), state: Connected { since: LocalTime { millis: 1788819436207 }, ping: None, fetching: {}, latencies: [], stable: false } }])
1788819437 z6MkwHGsfSBGmmxNSS4JDgk5RPL4b1w3ePof75mLCobPr9RA <service> service: Received command QueryState(..)
1788819437 test: Ok([Session { nid: PublicKey(z6MkpQTvJHbF5tKXMHLm5YiiaziAERLjotGyEkYy6kxpkc26), link: Inbound, addr: Address(NetAddr { host: Ip(127.0.0.1), port: 58096 }), state: Connected { since: LocalTime { millis: 1788819436208 }, ping: None, fetching: {}, latencies: [], stable: false } }])
thread 'tests::e2e::test_connection_crossing' panicked at radicle-node/src/tests/e2e.rs:859:9:
assertion `left == right` failed
left: Outbound
right: Inbound
note: run with `RUST_BACKTRACE=1` environment variable to display a backtrace
1788819437 test: Node z6MkwHGsfSBGmmxNSS4JDgk5RPL4b1w3ePof75mLCobPr9RA shutting down..
1788819437 z6MkwHGsfSBGmmxNSS4JDgk5RPL4b1w3ePof75mLCobPr9RA <control> control: Received `{"command":"shutdown"}` on control socket
1788819437 z6MkwHGsfSBGmmxNSS4JDgk5RPL4b1w3ePof75mLCobPr9RA <control> control: Shutdown requested..
1788819437 z6MkpQTvJHbF5tKXMHLm5YiiaziAERLjotGyEkYy6kxpkc26 <service> wire: Disconnecting peer with id=2: connection reset
1788819437 z6MkpQTvJHbF5tKXMHLm5YiiaziAERLjotGyEkYy6kxpkc26 <service> wire: Transport handover for disconnecting peer with id=2 (fd=63)
1788819437 z6MkpQTvJHbF5tKXMHLm5YiiaziAERLjotGyEkYy6kxpkc26 <service> service: Disconnected from z6MkwHGsfSBGmmxNSS4JDgk5RPL4b1w3ePof75mLCobPr9RA (connection reset)
1788819437 z6MkpQTvJHbF5tKXMHLm5YiiaziAERLjotGyEkYy6kxpkc26 <service> service: Dropping peer z6MkwHGsfSBGmmxNSS4JDgk5RPL4b1w3ePof75mLCobPr9RA..
1788819437 z6MkpQTvJHbF5tKXMHLm5YiiaziAERLjotGyEkYy6kxpkc26 <service> service: Not enough available peers to connect to (available=0, wanted=8)
1788819437 z6MkwHGsfSBGmmxNSS4JDgk5RPL4b1w3ePof75mLCobPr9RA <runtime> pool: Worker pool shutting down..
1788819437 z6MkwHGsfSBGmmxNSS4JDgk5RPL4b1w3ePof75mLCobPr9RA <runtime> node: Node shutdown completed for z6MkwHGsfSBGmmxNSS4JDgk5RPL4b1w3ePof75mLCobPr9RA
1788819437 test: Node z6MkpQTvJHbF5tKXMHLm5YiiaziAERLjotGyEkYy6kxpkc26 shutting down..
1788819437 z6MkpQTvJHbF5tKXMHLm5YiiaziAERLjotGyEkYy6kxpkc26 <control> control: Received `{"command":"shutdown"}` on control socket
1788819437 z6MkpQTvJHbF5tKXMHLm5YiiaziAERLjotGyEkYy6kxpkc26 <control> control: Shutdown requested..
1788819437 z6MkpQTvJHbF5tKXMHLm5YiiaziAERLjotGyEkYy6kxpkc26 <runtime> pool: Worker pool shutting down..
1788819437 z6MkpQTvJHbF5tKXMHLm5YiiaziAERLjotGyEkYy6kxpkc26 <runtime> node: Node shutdown completed for z6MkpQTvJHbF5tKXMHLm5YiiaziAERLjotGyEkYy6kxpkc26
failures:
tests::e2e::test_connection_crossing
test result: FAILED. 111 passed; 1 failed; 0 ignored; 0 measured; 0 filtered out; finished in 16.92s
error: test failed, to rerun pass `-p radicle-node --lib`
Running unittests src/main.rs (target/debug/deps/radicle_node-deee5ab26cc81867)
running 0 tests
test result: ok. 0 passed; 0 failed; 0 ignored; 0 measured; 0 filtered out; finished in 0.00s
Running unittests src/lib.rs (target/debug/deps/radicle_remote_helper-d733048d86f2895e)
running 0 tests
test result: ok. 0 passed; 0 failed; 0 ignored; 0 measured; 0 filtered out; finished in 0.00s
Running unittests src/git-remote-rad.rs (target/debug/deps/git_remote_rad-51ce52ac5cdd425a)
running 0 tests
test result: ok. 0 passed; 0 failed; 0 ignored; 0 measured; 0 filtered out; finished in 0.00s
Running unittests src/lib.rs (target/debug/deps/radicle_signals-ec0de5227c6b2b1f)
running 0 tests
test result: ok. 0 passed; 0 failed; 0 ignored; 0 measured; 0 filtered out; finished in 0.00s
Running unittests src/lib.rs (target/debug/deps/radicle_ssh-7e6f25b29f53bfd5)
running 0 tests
test result: ok. 0 passed; 0 failed; 0 ignored; 0 measured; 0 filtered out; finished in 0.00s
Running unittests src/lib.rs (target/debug/deps/radicle_systemd-47b9b3f175363f9b)
running 0 tests
test result: ok. 0 passed; 0 failed; 0 ignored; 0 measured; 0 filtered out; finished in 0.00s
Running unittests src/lib.rs (target/debug/deps/radicle_term-c502da8dd01f6601)
running 20 tests
test ansi::tests::colors_disabled ... ok
test cell::test::test_width ... ok
test ansi::tests::colors_enabled ... ok
test element::test::test_width ... ok
test element::test::test_truncate ... ok
test table::test::test_table ... ok
test ansi::tests::wrapping ... ok
test table::test::test_table_border ... ok
test table::test::test_table_truncate ... ok
test table::test::test_table_border_maximized ... ok
test table::test::test_table_border_truncated ... ok
test table::test::test_table_unicode ... ok
test table::test::test_table_unicode_truncate ... ok
test table::test::test_truncate ... ok
test textarea::test::test_wrapping ... ok
test textarea::test::test_wrapping_fenced_block ... ok
test textarea::test::test_wrapping_code_block ... ok
test vstack::test::test_vstack ... ok
test textarea::test::test_wrapping_paragraphs ... ok
test vstack::test::test_vstack_maximize ... ok
test result: ok. 20 passed; 0 failed; 0 ignored; 0 measured; 0 filtered out; finished in 0.00s
Running unittests src/rad-agent.rs (target/debug/deps/rad_agent-503cc08ef97bb21c)
running 0 tests
test result: ok. 0 passed; 0 failed; 0 ignored; 0 measured; 0 filtered out; finished in 0.00s
Running unittests src/rad-cli-demo.rs (target/debug/deps/rad_cli_demo-0b8f863a583b4d22)
running 0 tests
test result: ok. 0 passed; 0 failed; 0 ignored; 0 measured; 0 filtered out; finished in 0.00s
Running unittests src/rad-init.rs (target/debug/deps/rad_init-be8c15aeca4d439b)
running 0 tests
test result: ok. 0 passed; 0 failed; 0 ignored; 0 measured; 0 filtered out; finished in 0.00s
Running unittests src/rad-merge.rs (target/debug/deps/rad_merge-72bf62e00aaf0c9f)
running 0 tests
test result: ok. 0 passed; 0 failed; 0 ignored; 0 measured; 0 filtered out; finished in 0.00s
Running unittests src/rad-push.rs (target/debug/deps/rad_push-b1e19d12e08e5d12)
running 0 tests
test result: ok. 0 passed; 0 failed; 0 ignored; 0 measured; 0 filtered out; finished in 0.00s
Running unittests src/rad-self.rs (target/debug/deps/rad_self-7933f269fe3b6ea1)
running 0 tests
test result: ok. 0 passed; 0 failed; 0 ignored; 0 measured; 0 filtered out; finished in 0.00s
Running unittests src/rad-set-canonical-refs.rs (target/debug/deps/rad_set_canonical_refs-2753876c6820f141)
running 0 tests
test result: ok. 0 passed; 0 failed; 0 ignored; 0 measured; 0 filtered out; finished in 0.00s
Doc-tests radicle
running 2 tests
test radicle/src/git.rs - git::parse_ref_namespaced (line 449) ... FAILED
test radicle/src/git.rs - git::parse_ref (line 476) ... FAILED
failures:
---- radicle/src/git.rs - git::parse_ref_namespaced (line 449) stdout ----
error[E0425]: cannot find value `refs` in this scope
--> radicle/src/git.rs:450:1
|
3 | refs/namespaces/z6MkvUJtYD9dHDJfpevWRT98mzDDpdAtmUjwyDSkyqksUr7C/refs/heads/main
| ^^^^ not found in this scope
error[E0425]: cannot find value `namespaces` in this scope
--> radicle/src/git.rs:450:6
|
3 | refs/namespaces/z6MkvUJtYD9dHDJfpevWRT98mzDDpdAtmUjwyDSkyqksUr7C/refs/heads/main
| ^^^^^^^^^^ not found in this scope
error[E0425]: cannot find value `z6MkvUJtYD9dHDJfpevWRT98mzDDpdAtmUjwyDSkyqksUr7C` in this scope
--> radicle/src/git.rs:450:17
|
3 | refs/namespaces/z6MkvUJtYD9dHDJfpevWRT98mzDDpdAtmUjwyDSkyqksUr7C/refs/heads/main
| ^^^^^^^^^^^^^^^^^^^^^^^^^^^^^^^^^^^^^^^^^^^^^^^^ not found in this scope
error[E0425]: cannot find value `refs` in this scope
--> radicle/src/git.rs:450:66
|
3 | refs/namespaces/z6MkvUJtYD9dHDJfpevWRT98mzDDpdAtmUjwyDSkyqksUr7C/refs/heads/main
| ^^^^ not found in this scope
error[E0425]: cannot find value `heads` in this scope
--> radicle/src/git.rs:450:71
|
3 | refs/namespaces/z6MkvUJtYD9dHDJfpevWRT98mzDDpdAtmUjwyDSkyqksUr7C/refs/heads/main
| ^^^^^ not found in this scope
error: aborting due to 5 previous errors
For more information about this error, try `rustc --explain E0425`.
Couldn't compile the test.
---- radicle/src/git.rs - git::parse_ref (line 476) stdout ----
error[E0425]: cannot find value `refs` in this scope
--> radicle/src/git.rs:477:1
|
3 | refs/namespaces/z6MkvUJtYD9dHDJfpevWRT98mzDDpdAtmUjwyDSkyqksUr7C/refs/heads/main
| ^^^^ not found in this scope
error[E0425]: cannot find value `namespaces` in this scope
--> radicle/src/git.rs:477:6
|
3 | refs/namespaces/z6MkvUJtYD9dHDJfpevWRT98mzDDpdAtmUjwyDSkyqksUr7C/refs/heads/main
| ^^^^^^^^^^ not found in this scope
error[E0425]: cannot find value `z6MkvUJtYD9dHDJfpevWRT98mzDDpdAtmUjwyDSkyqksUr7C` in this scope
--> radicle/src/git.rs:477:17
|
3 | refs/namespaces/z6MkvUJtYD9dHDJfpevWRT98mzDDpdAtmUjwyDSkyqksUr7C/refs/heads/main
| ^^^^^^^^^^^^^^^^^^^^^^^^^^^^^^^^^^^^^^^^^^^^^^^^ not found in this scope
error[E0425]: cannot find value `refs` in this scope
--> radicle/src/git.rs:477:66
|
3 | refs/namespaces/z6MkvUJtYD9dHDJfpevWRT98mzDDpdAtmUjwyDSkyqksUr7C/refs/heads/main
| ^^^^ not found in this scope
error[E0425]: cannot find value `heads` in this scope
--> radicle/src/git.rs:477:71
|
3 | refs/namespaces/z6MkvUJtYD9dHDJfpevWRT98mzDDpdAtmUjwyDSkyqksUr7C/refs/heads/main
| ^^^^^ not found in this scope
error: aborting due to 5 previous errors
For more information about this error, try `rustc --explain E0425`.
Couldn't compile the test.
failures:
radicle/src/git.rs - git::parse_ref (line 476)
radicle/src/git.rs - git::parse_ref_namespaced (line 449)
test result: FAILED. 0 passed; 2 failed; 0 ignored; 0 measured; 0 filtered out; finished in 0.05s
error: doctest failed, to rerun pass `-p radicle --doc`
Doc-tests radicle_cli
running 0 tests
test result: ok. 0 passed; 0 failed; 0 ignored; 0 measured; 0 filtered out; finished in 0.00s
Doc-tests radicle_cli_test
running 0 tests
test result: ok. 0 passed; 0 failed; 0 ignored; 0 measured; 0 filtered out; finished in 0.00s
Doc-tests radicle_cob
running 1 test
test radicle-cob/src/backend/git/stable.rs - backend::git::stable::with_advanced_timestamp (line 56) ... ignored
test result: ok. 0 passed; 0 failed; 1 ignored; 0 measured; 0 filtered out; finished in 0.00s
Doc-tests radicle_crdt
running 0 tests
test result: ok. 0 passed; 0 failed; 0 ignored; 0 measured; 0 filtered out; finished in 0.00s
Doc-tests radicle_crypto
running 0 tests
test result: ok. 0 passed; 0 failed; 0 ignored; 0 measured; 0 filtered out; finished in 0.00s
Doc-tests radicle_dag
running 0 tests
test result: ok. 0 passed; 0 failed; 0 ignored; 0 measured; 0 filtered out; finished in 0.00s
Doc-tests radicle_fetch
running 0 tests
test result: ok. 0 passed; 0 failed; 0 ignored; 0 measured; 0 filtered out; finished in 0.00s
Doc-tests radicle_node
running 6 tests
test radicle-node/src/bounded.rs - bounded::BoundedVec<T,N>::truncate (line 50) ... ok
test radicle-node/src/bounded.rs - bounded::BoundedVec<T,N>::max (line 96) ... ok
test radicle-node/src/bounded.rs - bounded::BoundedVec<T,N>::push (line 122) ... ok
test radicle-node/src/bounded.rs - bounded::BoundedVec<T,N>::collect_from (line 30) ... ok
test radicle-node/src/bounded.rs - bounded::BoundedVec<T,N>::with_capacity (line 66) ... ok
test radicle-node/src/bounded.rs - bounded::BoundedVec<T,N>::unbound (line 149) ... ok
test result: ok. 6 passed; 0 failed; 0 ignored; 0 measured; 0 filtered out; finished in 0.44s
Doc-tests radicle_remote_helper
running 0 tests
test result: ok. 0 passed; 0 failed; 0 ignored; 0 measured; 0 filtered out; finished in 0.00s
Doc-tests radicle_signals
running 0 tests
test result: ok. 0 passed; 0 failed; 0 ignored; 0 measured; 0 filtered out; finished in 0.00s
Doc-tests radicle_ssh
running 0 tests
test result: ok. 0 passed; 0 failed; 0 ignored; 0 measured; 0 filtered out; finished in 0.00s
Doc-tests radicle_systemd
running 0 tests
test result: ok. 0 passed; 0 failed; 0 ignored; 0 measured; 0 filtered out; finished in 0.00s
Doc-tests radicle_term
running 1 test
test radicle-term/src/table.rs - table (line 4) ... ok
test result: ok. 1 passed; 0 failed; 0 ignored; 0 measured; 0 filtered out; finished in 0.32s
error: 2 targets failed:
`-p radicle-node --lib`
`-p radicle --doc`
Exit code: 101
{
"response": "finished",
"result": "failure"
}