rad:z3gqcJUoA1n9HaHKufZs5FCSGazv5 heartwood3419821106e274c96f56948a05d2f51f28f5a6c7
{
"request": "trigger",
"version": 1,
"event_type": "patch",
"repository": {
"id": "rad:z3gqcJUoA1n9HaHKufZs5FCSGazv5",
"name": "heartwood",
"description": "Radicle Heartwood Protocol & Stack",
"private": false,
"default_branch": "master",
"delegates": [
"did:key:z6MksFqXN3Yhqk8pTJdUGLwATkRfQvwZXPqR2qMEhbS9wzpT",
"did:key:z6MkireRatUThvd3qzfKht1S44wpm4FEWSSa4PRMTSQZ3voM",
"did:key:z6MkkPvBfjP4bQmco5Dm7UGsX2ruDBieEHi8n9DVJWX5sTEz"
]
},
"action": "Updated",
"patch": {
"id": "75725f8b8a26a50d63a25dea3ff7cd3dc786f8d6",
"author": {
"id": "did:key:z6MkkPvBfjP4bQmco5Dm7UGsX2ruDBieEHi8n9DVJWX5sTEz",
"alias": null
},
"title": "Release 1.10.3",
"state": {
"status": "merged",
"conflicts": []
},
"before": "3fc92f83fe089263c470b328414d923227cf0e4a",
"after": "3419821106e274c96f56948a05d2f51f28f5a6c7",
"commits": [
"3419821106e274c96f56948a05d2f51f28f5a6c7"
],
"target": "7e1cb406bb935c3de008d2171e8961f57b4336ea",
"labels": [],
"assignees": [],
"revisions": [
{
"id": "75725f8b8a26a50d63a25dea3ff7cd3dc786f8d6",
"author": {
"id": "did:key:z6MkkPvBfjP4bQmco5Dm7UGsX2ruDBieEHi8n9DVJWX5sTEz",
"alias": null
},
"description": "",
"base": "d285eccb23f3986bfa88fc1af033e6dcb0dc3a65",
"oid": "d649435848ae9475258b95d33a430c60d69e7438",
"timestamp": 1788801129
},
{
"id": "5c3bbcbcf5231d7c700e244143789fbdd319c288",
"author": {
"id": "did:key:z6MkkPvBfjP4bQmco5Dm7UGsX2ruDBieEHi8n9DVJWX5sTEz",
"alias": null
},
"description": "Fix typo.",
"base": "d285eccb23f3986bfa88fc1af033e6dcb0dc3a65",
"oid": "ea91fd5b61c938b19bb91d322edd4fc8527c7f90",
"timestamp": 1788802592
},
{
"id": "9bcff175c6e00aeaa62cf3b3060bdad5da8c9ff0",
"author": {
"id": "did:key:z6MkkPvBfjP4bQmco5Dm7UGsX2ruDBieEHi8n9DVJWX5sTEz",
"alias": null
},
"description": "Fix MSRV hiccup.",
"base": "3fc92f83fe089263c470b328414d923227cf0e4a",
"oid": "427548e31dbd62bd27ac2e5e7e8bd1c0f0269069",
"timestamp": 1788808488
},
{
"id": "f51da35f2189e0b705ab8dad977fdd8608ac3183",
"author": {
"id": "did:key:z6MkkPvBfjP4bQmco5Dm7UGsX2ruDBieEHi8n9DVJWX5sTEz",
"alias": null
},
"description": "",
"base": "3fc92f83fe089263c470b328414d923227cf0e4a",
"oid": "3419821106e274c96f56948a05d2f51f28f5a6c7",
"timestamp": 1788856671
}
]
}
}
{
"response": "triggered",
"run_id": {
"id": "ac61a839-2b26-41ac-b74b-bab0513cff29"
},
"info_url": "https://cci.rad.levitte.org//ac61a839-2b26-41ac-b74b-bab0513cff29.html"
}
Started at: 2026-09-09 07:07:28.721440+02:00
Commands:
$ rad clone rad:z3gqcJUoA1n9HaHKufZs5FCSGazv5 .
✓ Creating checkout in ./...
✓ Remote cloudhead@z6MksFqXN3Yhqk8pTJdUGLwATkRfQvwZXPqR2qMEhbS9wzpT added
✓ Remote-tracking branch cloudhead@z6MksFqXN3Yhqk8pTJdUGLwATkRfQvwZXPqR2qMEhbS9wzpT/master created for z6MksFqXN3Yhqk8pTJdUGLwATkRfQvwZXPqR2qMEhbS9wzpT
✓ Remote fintohaps@z6MkireRatUThvd3qzfKht1S44wpm4FEWSSa4PRMTSQZ3voM added
✓ Remote-tracking branch fintohaps@z6MkireRatUThvd3qzfKht1S44wpm4FEWSSa4PRMTSQZ3voM/master created for z6MkireRatUThvd3qzfKht1S44wpm4FEWSSa4PRMTSQZ3voM
✓ Remote lorenz@z6MkkPvBfjP4bQmco5Dm7UGsX2ruDBieEHi8n9DVJWX5sTEz added
✓ Remote-tracking branch lorenz@z6MkkPvBfjP4bQmco5Dm7UGsX2ruDBieEHi8n9DVJWX5sTEz/master created for z6MkkPvBfjP4bQmco5Dm7UGsX2ruDBieEHi8n9DVJWX5sTEz
✓ Repository successfully cloned under /opt/radcis/ci.rad.levitte.org/cci/state/ac61a839-2b26-41ac-b74b-bab0513cff29/w/
╭────────────────────────────────────╮
│ heartwood │
│ Radicle Heartwood Protocol & Stack │
│ 189 issues · 39 patches │
╰────────────────────────────────────╯
Run `cd ./.` to go to the repository directory.
Exit code: 0
$ rad patch checkout 75725f8b8a26a50d63a25dea3ff7cd3dc786f8d6
✓ Switched to branch patch/75725f8 at revision f51da35
✓ Branch patch/75725f8 setup to track rad/patches/75725f8b8a26a50d63a25dea3ff7cd3dc786f8d6
Exit code: 0
$ git config advice.detachedHead false
Exit code: 0
$ git checkout 3419821106e274c96f56948a05d2f51f28f5a6c7
HEAD is now at 34198211 Release 1.10.3
Exit code: 0
$ rad patch show 75725f8b8a26a50d63a25dea3ff7cd3dc786f8d6 -p
╭──────────────────────────────────────────────────────────────────────────────╮
│ Title Release 1.10.3 │
│ Patch 75725f8b8a26a50d63a25dea3ff7cd3dc786f8d6 │
│ Author lorenz z6MkkPv…WX5sTEz │
│ Head 3419821106e274c96f56948a05d2f51f28f5a6c7 │
│ Base 3fc92f83fe089263c470b328414d923227cf0e4a │
│ Target master │
│ Branches patch/75725f8 │
│ Commits ahead 0, behind 1 │
│ Status merged │
├──────────────────────────────────────────────────────────────────────────────┤
│ 3419821 Release 1.10.3 │
├──────────────────────────────────────────────────────────────────────────────┤
│ ● Revision 75725f8 @ d285ecc..d649435 by lorenz z6MkkPv…WX5sTEz 1 day ago │
│ ↑ Revision 5c3bbcb @ d285ecc..ea91fd5 by lorenz z6MkkPv…WX5sTEz 1 day ago │
│ ↑ Revision 9bcff17 @ 3fc92f8..427548e by lorenz z6MkkPv…WX5sTEz 1 day ago │
│ ↑ Revision f51da35 @ 3fc92f8..3419821 by lorenz z6MkkPv…WX5sTEz 20 hours ago │
│ └─ ✓ merged by fintohaps z6Mkire…SQZ3voM │
╰──────────────────────────────────────────────────────────────────────────────╯
commit 3419821106e274c96f56948a05d2f51f28f5a6c7
Author: Lorenz Leutgeb <lorenz.leutgeb@radicle.dev>
Date: Mon Sep 7 18:56:03 2026 +0200
Release 1.10.3
diff --git a/CHANGELOG.md b/CHANGELOG.md
index e1d1a5c729..76f0731c3d 100644
--- a/CHANGELOG.md
+++ b/CHANGELOG.md
@@ -5,6 +5,35 @@ All notable changes to this project will be documented in this file.
The format is based on [Keep a Changelog](https://keepachangelog.com/en/1.1.0/),
and this project adheres to [Semantic Versioning](https://semver.org/spec/v2.0.0.html).
+## 1.10.3 - 2026-09-07
+
+### Fixes
+
+- Repositories where the founder, i.e., the delegate of the initial version of
+ the identity document, is not a delegate anymore, could not be cloned. To
+ remedy, the namespace of the founder is now always fetched (just like the
+ namespaces of all current delegates are also always fetched).
+- Serialization and deserialization of canonical symbolic references (to and
+ from JSON) was erroneously implemented under ordering assumptions that
+ conflicted with the canonical JSON encoding used. The affected code was
+ rewritten to not require the assumption and is now more resilient.
+- Matches of reference names against raw canonical reference rules were reported
+ in the wrong order. They should have been reported in descending specificity,
+ but were reported in lexicographic order. Matching on raw rules was removed.
+ It is now only possible to match against a validated set of canonical
+ reference rules.
+
+### Improvements
+
+- If the environment variable `SSH_AUTH_SOCK` is empty, this is not treated as
+ a path to the socket to use for communication with an SSH Agent anymore.
+- The configuration value `preferredSeeds` is not populated by default anymore.
+- The Git remote helper will now report the symbolic reference `HEAD` even for
+ user namespaces, according to the canonical references of the repository.
+- Assumptions regarding the presence of the identity document payload
+ `xyz.radicle.project` were greatly relaxed. This is in preparation of future
+ changes to the schema of the identity document.
+
## 1.10.2 - 2026-08-26
### Improvements
Exit code: 0
shell: 'export RUSTDOCFLAGS=''-D warnings'' cargo --version rustc --version cargo fmt --check cargo clippy --all-targets --workspace -- --deny warnings cargo build --all-targets --workspace cargo doc --workspace --no-deps --all-features cargo test --workspace --no-fail-fast '
Commands:
$ podman run --name ac61a839-2b26-41ac-b74b-bab0513cff29 -v /opt/radcis/ci.rad.levitte.org/cci/state/ac61a839-2b26-41ac-b74b-bab0513cff29/s:/ac61a839-2b26-41ac-b74b-bab0513cff29/s:ro -v /opt/radcis/ci.rad.levitte.org/cci/state/ac61a839-2b26-41ac-b74b-bab0513cff29/w:/ac61a839-2b26-41ac-b74b-bab0513cff29/w -w /ac61a839-2b26-41ac-b74b-bab0513cff29/w -v /opt/radcis/ci.rad.levitte.org/.radicle:/${id}/.radicle:ro -e RAD_HOME=/${id}/.radicle rust:trixie bash /ac61a839-2b26-41ac-b74b-bab0513cff29/s/script.sh
+ export 'RUSTDOCFLAGS=-D warnings'
+ RUSTDOCFLAGS='-D warnings'
+ cargo --version
info: syncing channel updates for '1.98.0-x86_64-unknown-linux-gnu'
info: latest update on 2026-08-20, rust version 1.98.0 (88d9e12ae 2026-08-18)
info: downloading component 'cargo'
info: downloading component 'clippy'
info: downloading component 'rust-docs'
info: downloading component 'rust-src'
info: downloading component 'rust-std'
info: downloading component 'rustc'
info: downloading component 'rustfmt'
info: installing component 'cargo'
info: installing component 'clippy'
info: installing component 'rust-docs'
info: installing component 'rust-src'
info: installing component 'rust-std'
info: installing component 'rustc'
info: installing component 'rustfmt'
cargo 1.98.0 (797e8a9bc 2026-08-05)
+ rustc --version
rustc 1.98.0 (88d9e12ae 2026-08-18)
+ cargo fmt --check
+ cargo clippy --all-targets --workspace -- --deny warnings
Updating crates.io index
Downloading crates ...
Downloaded cipher v0.4.4
Downloaded clap_complete v4.6.0
Downloaded clap_derive v4.6.0
Downloaded addr2line v0.25.1
Downloaded clap v4.6.0
Downloaded clap_builder v4.6.0
Downloaded gix-sec v0.14.0
Downloaded chrono v0.4.44
Downloaded quick-error v1.2.3
Downloaded qcheck-macros v1.0.0
Downloaded gix-error v0.2.3
Downloaded rustc-demangle v0.1.27
Downloaded rustc_version v0.4.1
Downloaded rand v0.8.5
Downloaded quote v1.0.45
Downloaded gix-protocol v0.61.0
Downloaded gix-object v0.60.0
Downloaded getrandom v0.2.17
Downloaded gix-hashtable v0.15.0
Downloaded fluent-uri v0.3.2
Downloaded gix-credentials v0.38.0
Downloaded either v1.15.0
Downloaded cyphernet v0.5.4
Downloaded ed25519 v1.5.3
Downloaded fnv v1.0.7
Downloaded gix-date v0.15.3
Downloaded gix-path v0.12.0
Downloaded curve25519-dalek-derive v0.1.1
Downloaded der v0.7.10
Downloaded data-encoding-macro-internal v0.1.17
Downloaded ec25519 v0.1.0
Downloaded crossterm v0.29.0
Downloaded gix-negotiate v0.31.0
Downloaded document-features v0.2.12
Downloaded escargot v0.5.15
Downloaded gix-revision v0.45.0
Downloaded erased-serde v0.4.10
Downloaded colorchoice v1.0.5
Downloaded dyn-clone v1.0.20
Downloaded diff v0.1.13
Downloaded convert_case v0.10.0
Downloaded ecdsa v0.16.9
Downloaded generic-array v0.14.7
Downloaded gix-refspec v0.41.0
Downloaded gix-config-value v0.18.0
Downloaded regex-syntax v0.8.10
Downloaded errno v0.3.14
Downloaded faster-hex v0.10.0
Downloaded clap_lex v1.1.0
Downloaded const-str v0.4.3
Downloaded ctr v0.9.2
Downloaded env_filter v1.0.0
Downloaded getrandom v0.3.4
Downloaded ed25519 v2.2.3
Downloaded find-msvc-tools v0.1.9
Downloaded fastrand v2.3.0
Downloaded ghash v0.5.1
Downloaded rfc6979 v0.4.0
Downloaded ssh-encoding v0.2.0
Downloaded gix-glob v0.26.0
Downloaded rand_xorshift v0.4.0
Downloaded gix-lock v23.0.0
Downloaded gix-hash v0.25.0
Downloaded ff v0.13.1
Downloaded cypheraddr v0.4.1
Downloaded crypto-common v0.1.7
Downloaded data-encoding-macro v0.1.19
Downloaded gix-prompt v0.15.0
Downloaded stable_deref_trait v1.2.1
Downloaded rand_chacha v0.3.1
Downloaded cpufeatures v0.2.17
Downloaded gix-revwalk v0.31.0
Downloaded env_logger v0.11.9
Downloaded gix-actor v0.41.0
Downloaded spki v0.7.3
Downloaded serde_fmt v1.1.0
Downloaded fast-glob v0.3.3
Downloaded gix-chunk v0.7.1
Downloaded elliptic-curve v0.13.8
Downloaded ref-cast-impl v1.0.25
Downloaded colored v2.2.0
Downloaded data-encoding v2.10.0
Downloaded gix-shallow v0.12.0
Downloaded serde_spanned v1.0.4
Downloaded gix-command v0.9.0
Downloaded nonempty v0.9.0
Downloaded bytecount v0.6.9
Downloaded rand_core v0.6.4
Downloaded dunce v1.0.5
Downloaded gix-packetline v0.21.5
Downloaded emojis v0.6.4
Downloaded derive_more v2.1.1
Downloaded strsim v0.11.1
Downloaded gix-commitgraph v0.37.0
Downloaded num v0.4.3
Downloaded form_urlencoded v1.2.2
Downloaded same-file v1.0.6
Downloaded signature v1.6.4
Downloaded rs-release v0.1.11
Downloaded socks5-client v0.4.3
Downloaded crc32fast v1.5.0
Downloaded email_address v0.2.9
Downloaded gix-ref v0.63.0
Downloaded sec1 v0.7.3
Downloaded signal-hook-registry v1.4.8
Downloaded synstructure v0.13.2
Downloaded heapless v0.8.0
Downloaded num-complex v0.4.6
Downloaded litrs v1.0.0
Downloaded signal-hook-mio v0.2.5
Downloaded siphasher v1.0.2
Downloaded snapbox-macros v1.1.0
Downloaded secrecy v0.10.3
Downloaded gix-odb v0.80.0
Downloaded console v0.16.3
Downloaded fraction v0.15.3
Downloaded equivalent v1.0.2
Downloaded subtle v2.6.1
Downloaded ref-cast v1.0.25
Downloaded tinyvec_macros v0.1.1
Downloaded referencing v0.30.0
Downloaded serde_derive_internals v0.29.1
Downloaded thiserror-impl v1.0.69
Downloaded icu_locale_core v2.1.1
Downloaded chacha20poly1305 v0.10.1
Downloaded fancy-regex v0.14.0
Downloaded getrandom v0.4.3
Downloaded gix-diff v0.63.0
Downloaded test-log v0.2.19
Downloaded unicode-display-width v0.3.0
Downloaded cyphergraphy v0.3.1
Downloaded gix-validate v0.11.1
Downloaded outref v0.5.2
Downloaded digest v0.10.7
Downloaded gix-quote v0.7.1
Downloaded pkg-config v0.3.32
Downloaded salsa20 v0.10.2
Downloaded displaydoc v0.2.5
Downloaded cbc v0.1.2
Downloaded gix-fs v0.21.1
Downloaded ssh-cipher v0.2.0
Downloaded value-bag-serde1 v1.12.0
Downloaded scopeguard v1.2.0
Downloaded utf8parse v0.2.2
Downloaded crossbeam-channel v0.5.15
Downloaded vsimd v0.8.0
Downloaded pkcs8 v0.10.2
Downloaded siphasher v0.3.11
Downloaded sval_dynamic v2.17.0
Downloaded sval_fmt v2.17.0
Downloaded percent-encoding v2.3.2
Downloaded bit-set v0.8.0
Downloaded yoke-derive v0.8.1
Downloaded idna_adapter v1.2.1
Downloaded semver v1.0.27
Downloaded unit-prefix v0.5.2
Downloaded yoke v0.8.1
Downloaded pem-rfc7468 v0.7.0
Downloaded parking_lot v0.12.5
Downloaded const-oid v0.9.6
Downloaded crossbeam-utils v0.8.21
Downloaded timeago v0.4.2
Downloaded crypto-bigint v0.5.5
Downloaded gix-features v0.48.0
Downloaded heck v0.5.0
Downloaded anstyle-query v1.1.5
Downloaded block-buffer v0.10.4
Downloaded keccak v0.1.6
Downloaded tree-sitter-html v0.23.2
Downloaded aead v0.5.2
Downloaded amplify_syn v2.0.1
Downloaded toml_writer v1.0.7+spec-1.1.0
Downloaded anstream v0.6.21
Downloaded derive_more-impl v2.1.1
Downloaded tree-sitter-json v0.24.8
Downloaded match-lookup v0.1.2
Downloaded scrypt v0.11.0
Downloaded flate2 v1.1.9
Downloaded sha1 v0.10.6
Downloaded shell-words v1.1.1
Downloaded signature v2.2.0
Downloaded sval_ref v2.17.0
Downloaded sval_serde v2.17.0
Downloaded test-log-macros v0.2.19
Downloaded gix-trace v0.1.21
Downloaded multibase v0.9.2
Downloaded pastey v0.2.1
Downloaded byteorder v1.5.0
Downloaded num-traits v0.2.19
Downloaded pin-project-lite v0.2.17
Downloaded sem_safe v0.2.1
Downloaded streaming-iterator v0.1.9
Downloaded thiserror v2.0.18
Downloaded base16ct v0.2.0
Downloaded gix-pack v0.70.0
Downloaded polyval v0.6.2
Downloaded universal-hash v0.5.1
Downloaded cfg-if v1.0.4
Downloaded thiserror v1.0.69
Downloaded ryu v1.0.23
Downloaded noise-framework v0.4.1
Downloaded snapbox v1.2.2
Downloaded hex-literal v1.1.0
Downloaded ed25519-dalek v2.2.0
Downloaded inout v0.1.4
Downloaded memmap2 v0.9.10
Downloaded typeid v1.0.3
Downloaded schemars_derive v1.2.1
Downloaded structured-logger v1.0.5
Downloaded thiserror-impl v2.0.18
Downloaded sha2 v0.10.9
Downloaded tracing-log v0.2.0
Downloaded gix-transport v0.57.0
Downloaded miniz_oxide v0.8.9
Downloaded zerotrie v0.2.3
Downloaded utf8_iter v1.0.4
Downloaded phf_shared v0.11.3
Downloaded rand_chacha v0.9.0
Downloaded rusty-fork v0.3.1
Downloaded shlex v1.3.0
Downloaded sval_nested v2.17.0
Downloaded zeroize v1.9.0
Downloaded anstyle v1.0.14
Downloaded wait-timeout v0.2.1
Downloaded num-cmp v0.1.0
Downloaded matchers v0.2.0
Downloaded normalize-line-endings v0.3.0
Downloaded base64 v0.21.7
Downloaded serde-untagged v0.1.9
Downloaded simd-adler32 v0.3.8
Downloaded potential_utf v0.1.4
Downloaded prodash v31.0.0
Downloaded unarray v0.1.4
Downloaded walkdir v2.5.0
Downloaded zmij v1.0.21
Downloaded anstream v1.0.0
Downloaded anstyle-parse v0.2.7
Downloaded backtrace v0.3.76
Downloaded gix-tempfile v23.0.0
Downloaded gix-traverse v0.57.0
Downloaded litemap v0.8.1
Downloaded poly1305 v0.8.0
Downloaded tracing-core v0.1.36
Downloaded lock_api v0.4.14
Downloaded sqlite v0.37.0
Downloaded sqlite3-sys v0.18.0
Downloaded sval_buffer v2.17.0
Downloaded sval_json v2.17.0
Downloaded value-bag v1.12.0
Downloaded jobserver v0.1.34
Downloaded zerofrom v0.1.6
Downloaded bcrypt-pbkdf v0.10.0
Downloaded gix-utils v0.3.2
Downloaded phf v0.11.3
Downloaded spin v0.9.9
Downloaded indexmap v2.13.0
Downloaded tree-sitter-toml-ng v0.6.0
Downloaded base32 v0.4.0
Downloaded chacha20 v0.9.1
Downloaded maybe-async v0.2.10
Downloaded is_terminal_polyfill v1.70.2
Downloaded opaque-debug v0.3.1
Downloaded pkcs1 v0.7.5
Downloaded tree-sitter-language v0.1.7
Downloaded adler2 v2.0.1
Downloaded rand_core v0.9.5
Downloaded rustversion v1.0.22
Downloaded num-rational v0.4.2
Downloaded ssh-agent-lib v0.6.0
Downloaded zerofrom-derive v0.1.6
Downloaded nu-ansi-term v0.50.3
Downloaded zerovec-derive v0.11.2
Downloaded borrow-or-share v0.2.4
Downloaded bytesize v2.3.1
Downloaded hash32 v0.3.1
Downloaded blowfish v0.9.1
Downloaded uuid-simd v0.8.0
Downloaded bytes v1.11.1
Downloaded gix-url v0.36.0
Downloaded primeorder v0.13.6
Downloaded unicode-ident v1.0.24
Downloaded base-x v0.2.11
Downloaded value-bag-sval2 v1.12.0
Downloaded icu_properties v2.1.2
Downloaded qcheck v1.0.0
Downloaded lazy_static v1.5.0
Downloaded parking_lot_core v0.9.12
Downloaded anyhow v1.0.102
Downloaded anstyle-parse v1.0.0
Downloaded autocfg v1.5.0
Downloaded lexopt v0.3.2
Downloaded smallvec v1.15.1
Downloaded socket2 v0.5.10
Downloaded iana-time-zone v0.1.65
Downloaded systemd-journal-logger v2.2.2
Downloaded ascii v1.1.0
Downloaded base64 v0.22.1
Downloaded group v0.13.0
Downloaded serde_core v1.0.228
Downloaded icu_normalizer_data v2.1.1
Downloaded tempfile v3.27.0
Downloaded url v2.5.8
Downloaded inquire v0.9.4
Downloaded mio v1.1.1
Downloaded proc-macro2 v1.0.106
Downloaded base64ct v1.8.3
Downloaded num-iter v0.1.45
Downloaded human-panic v2.0.6
Downloaded serde_derive v1.0.228
Downloaded signal-hook v0.3.18
Downloaded humantime v2.3.0
Downloaded toml_datetime v0.7.5+spec-1.1.0
Downloaded bit-vec v0.8.0
Downloaded git2 v0.21.0
Downloaded num-integer v0.1.46
Downloaded uuid v1.22.0
Downloaded unicode-normalization v0.1.25
Downloaded similar v3.1.1
Downloaded ahash v0.8.12
Downloaded version_check v0.9.5
Downloaded typenum v1.20.1
Downloaded tree-sitter v0.24.7
Downloaded tree-sitter-go v0.23.4
Downloaded unicode-segmentation v1.12.0
Downloaded yansi v1.0.1
Downloaded signals_receipts v0.2.5
Downloaded thread_local v1.1.9
Downloaded writeable v0.6.2
Downloaded base256emoji v1.0.2
Downloaded aes v0.8.4
Downloaded itoa v1.0.17
Downloaded p521 v0.13.3
Downloaded block-padding v0.3.3
Downloaded tinystr v0.8.2
Downloaded portable-atomic v1.13.1
Downloaded pbkdf2 v0.12.2
Downloaded jsonschema v0.30.0
Downloaded zerovec v0.11.5
Downloaded gimli v0.32.3
Downloaded ppv-lite86 v0.2.21
Downloaded p384 v0.13.1
Downloaded p256 v0.13.2
Downloaded amplify_num v0.5.3
Downloaded tree-sitter-python v0.23.6
Downloaded indicatif v0.18.4
Downloaded nonempty v0.12.0
Downloaded hmac v0.12.1
Downloaded amplify v4.9.0
Downloaded zlib-rs v0.6.5
Downloaded zerocopy v0.8.42
Downloaded bitflags v2.11.0
Downloaded vcpkg v0.2.15
Downloaded tracing-subscriber v0.3.23
Downloaded curve25519-dalek v4.1.3
Downloaded tree-sitter-highlight v0.24.7
Downloaded sharded-slab v0.1.7
Downloaded toml v0.9.12+spec-1.1.0
Downloaded tree-sitter-c v0.23.4
Downloaded once_cell v1.21.4
Downloaded tree-sitter-rust v0.23.3
Downloaded bstr v1.12.1
Downloaded tinyvec v1.11.0
Downloaded bloomy v1.2.0
Downloaded rsa v0.9.10
Downloaded tree-sitter-md v0.3.2
Downloaded amplify_derive v4.0.1
Downloaded tree-sitter-bash v0.23.3
Downloaded icu_provider v2.1.1
Downloaded tree-sitter-ruby v0.23.1
Downloaded sval v2.17.0
Downloaded log v0.4.29
Downloaded arc-swap v1.9.1
Downloaded schemars v1.2.1
Downloaded icu_normalizer v2.1.1
Downloaded tree-sitter-css v0.23.2
Downloaded serde v1.0.228
Downloaded pretty_assertions v1.4.1
Downloaded jiff v0.2.23
Downloaded libc v0.2.183
Downloaded tree-sitter-typescript v0.23.2
Downloaded libz-sys v1.1.25
Downloaded icu_collections v2.1.1
Downloaded rand v0.9.2
Downloaded ssh-key v0.6.7
Downloaded jiff-static v0.2.23
Downloaded cc v1.2.57
Downloaded memchr v2.8.0
Downloaded regex v1.12.3
Downloaded libgit2-sys v0.18.4+1.9.3
Downloaded num-bigint v0.4.6
Downloaded icu_properties_data v2.1.2
Downloaded libm v0.2.16
Downloaded linux-raw-sys v0.12.1
Downloaded hashbrown v0.16.1
Downloaded num-bigint-dig v0.8.6
Downloaded serde_json v1.0.149
Downloaded itertools v0.14.0
Downloaded aes-gcm v0.10.3
Downloaded idna v1.1.0
Downloaded aho-corasick v1.1.4
Downloaded regex-automata v0.4.14
Downloaded proptest v1.10.0
Downloaded sysinfo v0.37.2
Downloaded syn v1.0.109
Downloaded syn v2.0.117
Downloaded unicode-width v0.2.2
Downloaded rustix v1.1.4
Downloaded object v0.37.3
Downloaded tracing v0.1.44
Downloaded sha1-checked v0.10.0
Downloaded sha3 v0.10.8
Downloaded tokio v1.50.0
Downloaded sqlite3-src v0.7.0
Compiling libc v0.2.183
Compiling proc-macro2 v1.0.106
Compiling unicode-ident v1.0.24
Compiling quote v1.0.45
Compiling serde_core v1.0.228
Checking cfg-if v1.0.4
Compiling serde v1.0.228
Compiling version_check v0.9.5
Compiling generic-array v0.14.7
Compiling syn v2.0.117
Checking typenum v1.20.1
Checking getrandom v0.2.17
Checking rand_core v0.6.4
Checking memchr v2.8.0
Compiling jobserver v0.1.34
Compiling shlex v1.3.0
Compiling find-msvc-tools v0.1.9
Compiling cc v1.2.57
Checking subtle v2.6.1
Checking const-oid v0.9.6
Checking smallvec v1.15.1
Checking regex-syntax v0.8.10
Checking aho-corasick v1.1.4
Checking cpufeatures v0.2.17
Compiling thiserror v2.0.18
Compiling parking_lot_core v0.9.12
Checking fastrand v2.3.0
Checking regex-automata v0.4.14
Checking scopeguard v1.2.0
Checking lock_api v0.4.14
Checking stable_deref_trait v1.2.1
Checking bitflags v2.11.0
Checking parking_lot v0.12.5
Compiling typeid v1.0.3
Compiling erased-serde v0.4.10
Checking gix-trace v0.1.21
Checking itoa v1.0.17
Checking tinyvec_macros v0.1.1
Checking tinyvec v1.11.0
Checking serde_fmt v1.1.0
Checking hashbrown v0.16.1
Checking unicode-normalization v0.1.25
Checking value-bag-serde1 v1.12.0
Checking byteorder v1.5.0
Checking value-bag v1.12.0
Checking gix-utils v0.3.2
Compiling serde_derive v1.0.228
Compiling thiserror-impl v2.0.18
Checking log v0.4.29
Checking bstr v1.12.1
Compiling crc32fast v1.5.0
Checking same-file v1.0.6
Checking walkdir v2.5.0
Checking prodash v31.0.0
Checking gix-validate v0.11.1
Checking zlib-rs v0.6.5
Compiling heapless v0.8.0
Checking gix-path v0.12.0
Compiling getrandom v0.4.3
Compiling autocfg v1.5.0
Compiling pkg-config v0.3.32
Compiling libm v0.2.16
Compiling num-traits v0.2.19
Checking hash32 v0.3.1
Compiling rustix v1.1.4
Checking gix-features v0.48.0
Checking linux-raw-sys v0.12.1
Checking faster-hex v0.10.0
Compiling zerocopy v0.8.42
Compiling zmij v1.0.21
Checking zeroize v1.9.0
Checking crypto-common v0.1.7
Checking block-buffer v0.10.4
Checking equivalent v1.0.2
Checking digest v0.10.7
Compiling serde_json v1.0.149
Checking sha1 v0.10.6
Checking indexmap v2.13.0
Checking sha1-checked v0.10.0
Checking gix-hash v0.25.0
Checking once_cell v1.21.4
Compiling ref-cast v1.0.25
Checking block-padding v0.3.3
Compiling ref-cast-impl v1.0.25
Checking inout v0.1.4
Checking sha2 v0.10.9
Compiling vcpkg v0.2.15
Checking dyn-clone v1.0.20
Checking cipher v0.4.4
Checking tempfile v3.27.0
Compiling libz-sys v1.1.25
Compiling serde_derive_internals v0.29.1
Checking der v0.7.10
Compiling libgit2-sys v0.18.4+1.9.3
Checking ppv-lite86 v0.2.21
Checking spin v0.9.9
Checking lazy_static v1.5.0
Compiling syn v1.0.109
Checking rand_chacha v0.3.1
Compiling schemars_derive v1.2.1
Checking rand v0.8.5
Compiling tree-sitter-language v0.1.7
Checking hmac v0.12.1
Checking universal-hash v0.5.1
Checking num-integer v0.1.46
Checking opaque-debug v0.3.1
Checking spki v0.7.3
Checking signature v2.2.0
Checking ff v0.13.1
Checking base16ct v0.2.0
Checking sec1 v0.7.3
Checking schemars v1.2.1
Checking group v0.13.0
Checking crypto-bigint v0.5.5
Compiling data-encoding v2.10.0
Compiling data-encoding-macro-internal v0.1.17
Checking elliptic-curve v0.13.8
Compiling amplify_syn v2.0.1
Checking num-iter v0.1.45
Checking aead v0.5.2
Compiling match-lookup v0.1.2
Checking const-str v0.4.3
Compiling semver v1.0.27
Checking signature v1.6.4
Checking ed25519 v1.5.3
Compiling rustc_version v0.4.1
Compiling amplify_derive v4.0.1
Checking data-encoding-macro v0.1.19
Checking base256emoji v1.0.2
Checking poly1305 v0.8.0
Checking rfc6979 v0.4.0
Checking qcheck v1.0.0
Checking chacha20 v0.9.1
Checking gix-error v0.2.3
Checking base-x v0.2.11
Checking ascii v1.1.0
Checking amplify_num v0.5.3
Checking multibase v0.9.2
Checking ecdsa v0.16.9
Compiling curve25519-dalek v4.1.3
Checking ec25519 v0.1.0
Checking primeorder v0.13.6
Checking amplify v4.9.0
Checking polyval v0.6.2
Checking base64ct v1.8.3
Compiling num-bigint-dig v0.8.6
Checking ghash v0.5.1
Checking pem-rfc7468 v0.7.0
Checking cyphergraphy v0.3.1
Checking pkcs8 v0.10.2
Checking pbkdf2 v0.12.2
Checking ctr v0.9.2
Checking aes v0.8.4
Checking radicle-git-ref-format v0.2.0 (/ac61a839-2b26-41ac-b74b-bab0513cff29/w/crates/radicle-git-ref-format)
Compiling sqlite3-src v0.7.0
Compiling curve25519-dalek-derive v0.1.1
Compiling synstructure v0.13.2
Checking keccak v0.1.6
Checking sha3 v0.10.8
Checking aes-gcm v0.10.3
Checking pkcs1 v0.7.5
Checking ssh-encoding v0.2.0
Checking ed25519 v2.2.3
Checking blowfish v0.9.1
Checking cbc v0.1.2
Checking percent-encoding v2.3.2
Checking base32 v0.4.0
Checking rsa v0.9.10
Checking cypheraddr v0.4.1
Checking ssh-cipher v0.2.0
Checking bcrypt-pbkdf v0.10.0
Checking ed25519-dalek v2.2.0
Compiling zerofrom-derive v0.1.6
Checking p256 v0.13.2
Checking p521 v0.13.3
Checking p384 v0.13.1
Checking chacha20poly1305 v0.10.1
Checking noise-framework v0.4.1
Checking zerofrom v0.1.6
Checking ssh-key v0.6.7
Checking socks5-client v0.4.3
Compiling yoke-derive v0.8.1
Checking secrecy v0.10.3
Checking ssh-agent-lib v0.6.0
Checking yoke v0.8.1
Checking cyphernet v0.5.4
Checking nonempty v0.9.0
Checking utf8parse v0.2.2
Checking anstyle-query v1.1.5
Checking jiff v0.2.23
Compiling zerovec-derive v0.11.2
Checking zerovec v0.11.5
Checking radicle-localtime v0.1.0 (/ac61a839-2b26-41ac-b74b-bab0513cff29/w/crates/radicle-localtime)
Compiling displaydoc v0.2.5
Checking errno v0.3.14
Checking colorchoice v1.0.5
Checking base64 v0.21.7
Checking is_terminal_polyfill v1.70.2
Checking gix-date v0.15.3
Checking anstyle v1.0.14
Checking gix-hashtable v0.15.0
Checking gix-actor v0.41.0
Checking siphasher v1.0.2
Checking gix-object v0.60.0
Checking radicle-dag v0.10.0 (/ac61a839-2b26-41ac-b74b-bab0513cff29/w/crates/radicle-dag)
Checking memmap2 v0.9.10
Checking nonempty v0.12.0
Checking tinystr v0.8.2
Checking gix-chunk v0.7.1
Compiling radicle v0.25.1 (/ac61a839-2b26-41ac-b74b-bab0513cff29/w/crates/radicle)
Checking litemap v0.8.1
Checking writeable v0.6.2
Checking icu_locale_core v2.1.1
Checking gix-commitgraph v0.37.0
Checking zerotrie v0.2.3
Checking potential_utf v0.1.4
Checking anstyle-parse v1.0.0
Checking serde-untagged v0.1.9
Checking bytesize v2.3.1
Compiling icu_properties_data v2.1.2
Checking dunce v1.0.5
Compiling icu_normalizer_data v2.1.1
Checking fast-glob v0.3.3
Checking anstream v1.0.0
Checking icu_collections v2.1.1
Checking icu_provider v2.1.1
Checking gix-revwalk v0.31.0
Checking gix-fs v0.21.1
Checking mio v1.1.1
Checking sem_safe v0.2.1
Checking simd-adler32 v0.3.8
Checking adler2 v2.0.1
Checking signals_receipts v0.2.5
Checking miniz_oxide v0.8.9
Checking gix-tempfile v23.0.0
Checking gix-quote v0.7.1
Checking icu_properties v2.1.2
Checking icu_normalizer v2.1.1
Checking iana-time-zone v0.1.65
Compiling unicode-segmentation v1.12.0
Compiling signal-hook v0.3.18
Checking shell-words v1.1.1
Checking either v1.15.0
Checking gix-command v0.9.0
Checking idna_adapter v1.2.1
Compiling convert_case v0.10.0
Checking chrono v0.4.44
Checking radicle-signals v0.12.1 (/ac61a839-2b26-41ac-b74b-bab0513cff29/w/crates/radicle-signals)
Checking signal-hook-registry v1.4.8
Checking colored v2.2.0
Compiling getrandom v0.3.4
Compiling object v0.37.3
Compiling rustversion v1.0.22
Checking utf8_iter v1.0.4
Checking idna v1.1.0
Compiling derive_more-impl v2.1.1
Checking gix-lock v23.0.0
Checking gix-url v0.36.0
Checking gix-config-value v0.18.0
Checking gix-sec v0.14.0
Checking unicode-width v0.2.2
Checking gimli v0.32.3
Compiling litrs v1.0.0
Compiling thiserror v1.0.69
Compiling portable-atomic v1.13.1
Compiling document-features v0.2.12
Checking addr2line v0.25.1
Checking gix-prompt v0.15.0
Checking derive_more v2.1.1
Checking signal-hook-mio v0.2.5
Checking radicle-log v0.2.0 (/ac61a839-2b26-41ac-b74b-bab0513cff29/w/crates/radicle-log)
Checking gix-revision v0.45.0
Checking gix-traverse v0.57.0
Checking gix-diff v0.63.0
Checking anstyle-parse v0.2.7
Checking gix-packetline v0.21.5
Checking gix-glob v0.26.0
Compiling thiserror-impl v1.0.69
Checking rustc-demangle v0.1.27
Checking backtrace v0.3.76
Checking gix-refspec v0.41.0
Checking gix-transport v0.57.0
Checking anstream v0.6.21
Checking gix-pack v0.70.0
Checking arc-swap v1.9.1
Checking crossterm v0.29.0
Checking gix-credentials v0.38.0
Checking console v0.16.3
Checking gix-ref v0.63.0
Checking gix-shallow v0.12.0
Checking gix-negotiate v0.31.0
Checking form_urlencoded v1.2.2
Checking regex v1.12.3
Compiling maybe-async v0.2.10
Compiling tree-sitter v0.24.7
Checking unit-prefix v0.5.2
Checking indicatif v0.18.4
Checking gix-protocol v0.61.0
Checking url v2.5.8
Checking gix-odb v0.80.0
Checking inquire v0.9.4
Checking unicode-display-width v0.3.0
Checking uuid v1.22.0
Checking bytes v1.11.1
Checking snapbox-macros v1.1.0
Checking salsa20 v0.10.2
Checking siphasher v0.3.11
Checking strsim v0.11.1
Checking streaming-iterator v0.1.9
Checking normalize-line-endings v0.3.0
Compiling heck v0.5.0
Checking clap_lex v1.1.0
Checking similar v3.1.1
Compiling crossbeam-utils v0.8.21
Checking clap_builder v4.6.0
Checking snapbox v1.2.2
Compiling clap_derive v4.6.0
Checking bloomy v1.2.0
Checking scrypt v0.11.0
Checking systemd-journal-logger v2.2.2
Compiling tree-sitter-python v0.23.6
Compiling tree-sitter-ruby v0.23.1
Checking sqlite3-sys v0.18.0
Checking sqlite v0.37.0
Compiling tree-sitter-css v0.23.2
Checking radicle-crypto v0.19.0 (/ac61a839-2b26-41ac-b74b-bab0513cff29/w/crates/radicle-crypto)
Compiling tree-sitter-go v0.23.4
Compiling tree-sitter-html v0.23.2
Compiling tree-sitter-c v0.23.4
Compiling tree-sitter-json v0.24.8
Compiling tree-sitter-rust v0.23.3
Compiling tree-sitter-md v0.3.2
Compiling tree-sitter-typescript v0.23.2
Compiling tree-sitter-toml-ng v0.6.0
Compiling tree-sitter-bash v0.23.3
Checking toml_datetime v0.7.5+spec-1.1.0
Checking serde_spanned v1.0.4
Compiling anyhow v1.0.102
Checking pin-project-lite v0.2.17
Checking toml_writer v1.0.7+spec-1.1.0
Checking bit-vec v0.8.0
Checking toml v0.9.12+spec-1.1.0
Checking bit-set v0.8.0
Checking tokio v1.50.0
Checking clap v4.6.0
Checking rand_core v0.9.5
Checking sysinfo v0.37.2
Compiling radicle-cli v0.23.0 (/ac61a839-2b26-41ac-b74b-bab0513cff29/w/crates/radicle-cli)
Checking yansi v1.0.1
Checking diff v0.1.13
Compiling radicle-node v0.21.1 (/ac61a839-2b26-41ac-b74b-bab0513cff29/w/crates/radicle-node)
Checking pretty_assertions v1.4.1
Checking human-panic v2.0.6
Checking crossbeam-channel v0.5.15
Checking clap_complete v4.6.0
Checking structured-logger v1.0.5
Checking radicle-systemd v0.13.0 (/ac61a839-2b26-41ac-b74b-bab0513cff29/w/crates/radicle-systemd)
Checking tree-sitter-highlight v0.24.7
Checking itertools v0.14.0
Checking socket2 v0.5.10
Checking timeago v0.4.2
Checking humantime v2.3.0
Checking lexopt v0.3.2
Compiling escargot v0.5.15
Checking rs-release v0.1.11
Checking wait-timeout v0.2.1
Checking fnv v1.0.7
Checking quick-error v1.2.3
Checking rusty-fork v0.3.1
Checking rand v0.9.2
Checking rand_chacha v0.9.0
Checking rand_xorshift v0.4.0
Compiling qcheck-macros v1.0.0
Checking num-bigint v0.4.6
Compiling ahash v0.8.12
Checking unarray v0.1.4
Checking proptest v1.10.0
Checking num-complex v0.4.6
Checking env_filter v1.0.0
Checking borrow-or-share v0.2.4
Checking fluent-uri v0.3.2
Checking num-rational v0.4.2
Checking env_logger v0.11.9
Checking num v0.4.3
Checking flate2 v1.1.9
Checking phf_shared v0.11.3
Compiling test-log-macros v0.2.19
Checking hex-literal v1.1.0
Checking vsimd v0.8.0
Checking outref v0.5.2
Compiling radicle-remote-helper v0.18.1 (/ac61a839-2b26-41ac-b74b-bab0513cff29/w/crates/radicle-remote-helper)
Checking uuid-simd v0.8.0
Checking test-log v0.2.19
Checking phf v0.11.3
Checking referencing v0.30.0
Checking fraction v0.15.3
Checking fancy-regex v0.14.0
Checking email_address v0.2.9
Checking num-cmp v0.1.0
Checking bytecount v0.6.9
Checking base64 v0.22.1
Checking emojis v0.6.4
Compiling pastey v0.2.1
Checking jsonschema v0.30.0
Checking radicle-windows v0.1.0 (/ac61a839-2b26-41ac-b74b-bab0513cff29/w/crates/radicle-windows)
Checking git2 v0.21.0
Checking radicle-oid v0.2.2 (/ac61a839-2b26-41ac-b74b-bab0513cff29/w/crates/radicle-oid)
Checking radicle-git-metadata v0.2.1 (/ac61a839-2b26-41ac-b74b-bab0513cff29/w/crates/radicle-git-metadata)
Checking radicle-term v0.19.1 (/ac61a839-2b26-41ac-b74b-bab0513cff29/w/crates/radicle-term)
Checking radicle-core v0.4.1 (/ac61a839-2b26-41ac-b74b-bab0513cff29/w/crates/radicle-core)
Checking radicle-cob v0.21.1 (/ac61a839-2b26-41ac-b74b-bab0513cff29/w/crates/radicle-cob)
Checking radicle-surf v0.29.0 (/ac61a839-2b26-41ac-b74b-bab0513cff29/w/crates/radicle-surf)
Checking radicle-cli-test v0.14.1 (/ac61a839-2b26-41ac-b74b-bab0513cff29/w/crates/radicle-cli-test)
Checking radicle-fetch v0.21.1 (/ac61a839-2b26-41ac-b74b-bab0513cff29/w/crates/radicle-fetch)
Checking radicle-schemars v0.9.1 (/ac61a839-2b26-41ac-b74b-bab0513cff29/w/crates/radicle-schemars)
Checking radicle-protocol v0.9.1 (/ac61a839-2b26-41ac-b74b-bab0513cff29/w/crates/radicle-protocol)
Finished `dev` profile [unoptimized + debuginfo] target(s) in 42.88s
+ cargo build --all-targets --workspace
Compiling libc v0.2.183
Compiling cfg-if v1.0.4
Compiling serde_core v1.0.228
Compiling typenum v1.20.1
Compiling memchr v2.8.0
Compiling shlex v1.3.0
Compiling getrandom v0.2.17
Compiling jobserver v0.1.34
Compiling rand_core v0.6.4
Compiling subtle v2.6.1
Compiling cc v1.2.57
Compiling const-oid v0.9.6
Compiling smallvec v1.15.1
Compiling regex-syntax v0.8.10
Compiling aho-corasick v1.1.4
Compiling serde v1.0.228
Compiling zeroize v1.9.0
Compiling cpufeatures v0.2.17
Compiling thiserror v2.0.18
Compiling generic-array v0.14.7
Compiling fastrand v2.3.0
Compiling regex-automata v0.4.14
Compiling crypto-common v0.1.7
Compiling block-buffer v0.10.4
Compiling digest v0.10.7
Compiling scopeguard v1.2.0
Compiling parking_lot_core v0.9.12
Compiling lock_api v0.4.14
Compiling parking_lot v0.12.5
Compiling stable_deref_trait v1.2.1
Compiling bitflags v2.11.0
Compiling typeid v1.0.3
Compiling erased-serde v0.4.10
Compiling tinyvec_macros v0.1.1
Compiling itoa v1.0.17
Compiling gix-trace v0.1.21
Compiling tinyvec v1.11.0
Compiling serde_fmt v1.1.0
Compiling hashbrown v0.16.1
Compiling unicode-normalization v0.1.25
Compiling value-bag-serde1 v1.12.0
Compiling byteorder v1.5.0
Compiling value-bag v1.12.0
Compiling crc32fast v1.5.0
Compiling gix-utils v0.3.2
Compiling same-file v1.0.6
Compiling log v0.4.29
Compiling walkdir v2.5.0
Compiling prodash v31.0.0
Compiling bstr v1.12.1
Compiling zlib-rs v0.6.5
Compiling gix-validate v0.11.1
Compiling gix-path v0.12.0
Compiling hash32 v0.3.1
Compiling heapless v0.8.0
Compiling getrandom v0.4.3
Compiling libm v0.2.16
Compiling linux-raw-sys v0.12.1
Compiling rustix v1.1.4
Compiling num-traits v0.2.19
Compiling faster-hex v0.10.0
Compiling sha1 v0.10.6
Compiling zerocopy v0.8.42
Compiling sha1-checked v0.10.0
Compiling gix-features v0.48.0
Compiling equivalent v1.0.2
Compiling gix-hash v0.25.0
Compiling indexmap v2.13.0
Compiling zmij v1.0.21
Compiling once_cell v1.21.4
Compiling serde_json v1.0.149
Compiling block-padding v0.3.3
Compiling ref-cast v1.0.25
Compiling inout v0.1.4
Compiling sha2 v0.10.9
Compiling dyn-clone v1.0.20
Compiling libz-sys v1.1.25
Compiling cipher v0.4.4
Compiling tempfile v3.27.0
Compiling libgit2-sys v0.18.4+1.9.3
Compiling der v0.7.10
Compiling spin v0.9.9
Compiling ppv-lite86 v0.2.21
Compiling lazy_static v1.5.0
Compiling schemars v1.2.1
Compiling rand_chacha v0.3.1
Compiling rand v0.8.5
Compiling num-integer v0.1.46
Compiling hmac v0.12.1
Compiling universal-hash v0.5.1
Compiling opaque-debug v0.3.1
Compiling spki v0.7.3
Compiling signature v2.2.0
Compiling ff v0.13.1
Compiling base16ct v0.2.0
Compiling sec1 v0.7.3
Compiling group v0.13.0
Compiling crypto-bigint v0.5.5
Compiling num-iter v0.1.45
Compiling aead v0.5.2
Compiling signature v1.6.4
Compiling const-str v0.4.3
Compiling data-encoding v2.10.0
Compiling data-encoding-macro v0.1.19
Compiling base256emoji v1.0.2
Compiling ed25519 v1.5.3
Compiling elliptic-curve v0.13.8
Compiling poly1305 v0.8.0
Compiling rfc6979 v0.4.0
Compiling qcheck v1.0.0
Compiling chacha20 v0.9.1
Compiling gix-error v0.2.3
Compiling base-x v0.2.11
Compiling ascii v1.1.0
Compiling amplify_num v0.5.3
Compiling multibase v0.9.2
Compiling primeorder v0.13.6
Compiling ecdsa v0.16.9
Compiling ec25519 v0.1.0
Compiling polyval v0.6.2
Compiling base64ct v1.8.3
Compiling amplify v4.9.0
Compiling pem-rfc7468 v0.7.0
Compiling cyphergraphy v0.3.1
Compiling ghash v0.5.1
Compiling pkcs8 v0.10.2
Compiling pbkdf2 v0.12.2
Compiling aes v0.8.4
Compiling ctr v0.9.2
Compiling sqlite3-src v0.7.0
Compiling radicle-git-ref-format v0.2.0 (/ac61a839-2b26-41ac-b74b-bab0513cff29/w/crates/radicle-git-ref-format)
Compiling keccak v0.1.6
Compiling curve25519-dalek v4.1.3
Compiling sha3 v0.10.8
Compiling aes-gcm v0.10.3
Compiling pkcs1 v0.7.5
Compiling num-bigint-dig v0.8.6
Compiling ssh-encoding v0.2.0
Compiling ed25519 v2.2.3
Compiling blowfish v0.9.1
Compiling cbc v0.1.2
Compiling percent-encoding v2.3.2
Compiling base32 v0.4.0
Compiling cypheraddr v0.4.1
Compiling ssh-cipher v0.2.0
Compiling bcrypt-pbkdf v0.10.0
Compiling ed25519-dalek v2.2.0
Compiling rsa v0.9.10
Compiling p384 v0.13.1
Compiling p521 v0.13.3
Compiling p256 v0.13.2
Compiling chacha20poly1305 v0.10.1
Compiling ssh-key v0.6.7
Compiling noise-framework v0.4.1
Compiling zerofrom v0.1.6
Compiling socks5-client v0.4.3
Compiling secrecy v0.10.3
Compiling ssh-agent-lib v0.6.0
Compiling yoke v0.8.1
Compiling cyphernet v0.5.4
Compiling nonempty v0.9.0
Compiling utf8parse v0.2.2
Compiling anstyle-query v1.1.5
Compiling jiff v0.2.23
Compiling zerovec v0.11.5
Compiling radicle-localtime v0.1.0 (/ac61a839-2b26-41ac-b74b-bab0513cff29/w/crates/radicle-localtime)
Compiling errno v0.3.14
Compiling anstyle v1.0.14
Compiling base64 v0.21.7
Compiling colorchoice v1.0.5
Compiling is_terminal_polyfill v1.70.2
Compiling gix-hashtable v0.15.0
Compiling siphasher v1.0.2
Compiling tree-sitter-language v0.1.7
Compiling radicle-dag v0.10.0 (/ac61a839-2b26-41ac-b74b-bab0513cff29/w/crates/radicle-dag)
Compiling memmap2 v0.9.10
Compiling nonempty v0.12.0
Compiling tinystr v0.8.2
Compiling gix-chunk v0.7.1
Compiling litemap v0.8.1
Compiling gix-date v0.15.3
Compiling gix-actor v0.41.0
Compiling gix-object v0.60.0
Compiling radicle v0.25.1 (/ac61a839-2b26-41ac-b74b-bab0513cff29/w/crates/radicle)
Compiling writeable v0.6.2
Compiling gix-commitgraph v0.37.0
Compiling icu_locale_core v2.1.1
Compiling zerotrie v0.2.3
Compiling potential_utf v0.1.4
Compiling anstyle-parse v1.0.0
Compiling serde-untagged v0.1.9
Compiling bytesize v2.3.1
Compiling fast-glob v0.3.3
Compiling dunce v1.0.5
Compiling anstream v1.0.0
Compiling icu_collections v2.1.1
Compiling icu_provider v2.1.1
Compiling gix-revwalk v0.31.0
Compiling gix-fs v0.21.1
Compiling mio v1.1.1
Compiling sem_safe v0.2.1
Compiling adler2 v2.0.1
Compiling simd-adler32 v0.3.8
Compiling miniz_oxide v0.8.9
Compiling signals_receipts v0.2.5
Compiling gix-tempfile v23.0.0
Compiling icu_normalizer_data v2.1.1
Compiling icu_properties_data v2.1.2
Compiling gix-quote v0.7.1
Compiling unicode-segmentation v1.12.0
Compiling icu_properties v2.1.2
Compiling icu_normalizer v2.1.1
Compiling shell-words v1.1.1
Compiling either v1.15.0
Compiling iana-time-zone v0.1.65
Compiling chrono v0.4.44
Compiling idna_adapter v1.2.1
Compiling gix-command v0.9.0
Compiling convert_case v0.10.0
Compiling radicle-signals v0.12.1 (/ac61a839-2b26-41ac-b74b-bab0513cff29/w/crates/radicle-signals)
Compiling signal-hook-registry v1.4.8
Compiling colored v2.2.0
Compiling utf8_iter v1.0.4
Compiling idna v1.1.0
Compiling signal-hook v0.3.18
Compiling derive_more-impl v2.1.1
Compiling gix-lock v23.0.0
Compiling gix-url v0.36.0
Compiling gix-config-value v0.18.0
Compiling gix-sec v0.14.0
Compiling gimli v0.32.3
Compiling unicode-width v0.2.2
Compiling gix-prompt v0.15.0
Compiling derive_more v2.1.1
Compiling signal-hook-mio v0.2.5
Compiling radicle-log v0.2.0 (/ac61a839-2b26-41ac-b74b-bab0513cff29/w/crates/radicle-log)
Compiling getrandom v0.3.4
Compiling object v0.37.3
Compiling addr2line v0.25.1
Compiling gix-traverse v0.57.0
Compiling gix-revision v0.45.0
Compiling gix-diff v0.63.0
Compiling anstyle-parse v0.2.7
Compiling gix-glob v0.26.0
Compiling gix-packetline v0.21.5
Compiling rustc-demangle v0.1.27
Compiling backtrace v0.3.76
Compiling thiserror v1.0.69
Compiling gix-transport v0.57.0
Compiling sqlite3-sys v0.18.0
Compiling sqlite v0.37.0
Compiling radicle-crypto v0.19.0 (/ac61a839-2b26-41ac-b74b-bab0513cff29/w/crates/radicle-crypto)
Compiling gix-refspec v0.41.0
Compiling anstream v0.6.21
Compiling gix-pack v0.70.0
Compiling arc-swap v1.9.1
Compiling crossterm v0.29.0
Compiling gix-credentials v0.38.0
Compiling portable-atomic v1.13.1
Compiling console v0.16.3
Compiling gix-ref v0.63.0
Compiling gix-shallow v0.12.0
Compiling gix-negotiate v0.31.0
Compiling form_urlencoded v1.2.2
Compiling regex v1.12.3
Compiling tree-sitter v0.24.7
Compiling unit-prefix v0.5.2
Compiling indicatif v0.18.4
Compiling gix-protocol v0.61.0
Compiling url v2.5.8
Compiling gix-odb v0.80.0
Compiling inquire v0.9.4
Compiling unicode-display-width v0.3.0
Compiling uuid v1.22.0
Compiling bytes v1.11.1
Compiling snapbox-macros v1.1.0
Compiling salsa20 v0.10.2
Compiling strsim v0.11.1
Compiling normalize-line-endings v0.3.0
Compiling similar v3.1.1
Compiling siphasher v0.3.11
Compiling clap_lex v1.1.0
Compiling streaming-iterator v0.1.9
Compiling snapbox v1.2.2
Compiling clap_builder v4.6.0
Compiling bloomy v1.2.0
Compiling scrypt v0.11.0
Compiling systemd-journal-logger v2.2.2
Compiling tree-sitter-md v0.3.2
Compiling tree-sitter-c v0.23.4
Compiling tree-sitter-bash v0.23.3
Compiling tree-sitter-ruby v0.23.1
Compiling tree-sitter-html v0.23.2
Compiling tree-sitter-toml-ng v0.6.0
Compiling tree-sitter-typescript v0.23.2
Compiling tree-sitter-json v0.24.8
Compiling tree-sitter-rust v0.23.3
Compiling tree-sitter-css v0.23.2
Compiling tree-sitter-go v0.23.4
Compiling tree-sitter-python v0.23.6
Compiling serde_spanned v1.0.4
Compiling toml_datetime v0.7.5+spec-1.1.0
Compiling pin-project-lite v0.2.17
Compiling toml_writer v1.0.7+spec-1.1.0
Compiling bit-vec v0.8.0
Compiling toml v0.9.12+spec-1.1.0
Compiling bit-set v0.8.0
Compiling tokio v1.50.0
Compiling clap v4.6.0
Compiling crossbeam-utils v0.8.21
Compiling rand_core v0.9.5
Compiling sysinfo v0.37.2
Compiling radicle-cli v0.23.0 (/ac61a839-2b26-41ac-b74b-bab0513cff29/w/crates/radicle-cli)
Compiling yansi v1.0.1
Compiling diff v0.1.13
Compiling git2 v0.21.0
Compiling radicle-node v0.21.1 (/ac61a839-2b26-41ac-b74b-bab0513cff29/w/crates/radicle-node)
Compiling pretty_assertions v1.4.1
Compiling human-panic v2.0.6
Compiling crossbeam-channel v0.5.15
Compiling clap_complete v4.6.0
Compiling structured-logger v1.0.5
Compiling anyhow v1.0.102
Compiling radicle-systemd v0.13.0 (/ac61a839-2b26-41ac-b74b-bab0513cff29/w/crates/radicle-systemd)
Compiling tree-sitter-highlight v0.24.7
Compiling itertools v0.14.0
Compiling socket2 v0.5.10
Compiling radicle-oid v0.2.2 (/ac61a839-2b26-41ac-b74b-bab0513cff29/w/crates/radicle-oid)
Compiling radicle-git-metadata v0.2.1 (/ac61a839-2b26-41ac-b74b-bab0513cff29/w/crates/radicle-git-metadata)
Compiling radicle-cob v0.21.1 (/ac61a839-2b26-41ac-b74b-bab0513cff29/w/crates/radicle-cob)
Compiling radicle-core v0.4.1 (/ac61a839-2b26-41ac-b74b-bab0513cff29/w/crates/radicle-core)
Compiling radicle-surf v0.29.0 (/ac61a839-2b26-41ac-b74b-bab0513cff29/w/crates/radicle-surf)
Compiling radicle-term v0.19.1 (/ac61a839-2b26-41ac-b74b-bab0513cff29/w/crates/radicle-term)
Compiling rs-release v0.1.11
Compiling lexopt v0.3.2
Compiling timeago v0.4.2
Compiling humantime v2.3.0
Compiling wait-timeout v0.2.1
Compiling quick-error v1.2.3
Compiling fnv v1.0.7
Compiling rusty-fork v0.3.1
Compiling escargot v0.5.15
Compiling rand_chacha v0.9.0
Compiling rand_xorshift v0.4.0
Compiling rand v0.9.2
Compiling num-bigint v0.4.6
Compiling unarray v0.1.4
Compiling proptest v1.10.0
Compiling num-complex v0.4.6
Compiling num-rational v0.4.2
Compiling env_filter v1.0.0
Compiling borrow-or-share v0.2.4
Compiling fluent-uri v0.3.2
Compiling env_logger v0.11.9
Compiling num v0.4.3
Compiling ahash v0.8.12
Compiling radicle-cli-test v0.14.1 (/ac61a839-2b26-41ac-b74b-bab0513cff29/w/crates/radicle-cli-test)
Compiling flate2 v1.1.9
Compiling phf_shared v0.11.3
Compiling hex-literal v1.1.0
Compiling radicle-remote-helper v0.18.1 (/ac61a839-2b26-41ac-b74b-bab0513cff29/w/crates/radicle-remote-helper)
Compiling vsimd v0.8.0
Compiling outref v0.5.2
Compiling test-log v0.2.19
Compiling phf v0.11.3
Compiling uuid-simd v0.8.0
Compiling referencing v0.30.0
Compiling fraction v0.15.3
Compiling fancy-regex v0.14.0
Compiling email_address v0.2.9
Compiling bytecount v0.6.9
Compiling num-cmp v0.1.0
Compiling base64 v0.22.1
Compiling emojis v0.6.4
Compiling jsonschema v0.30.0
Compiling radicle-fetch v0.21.1 (/ac61a839-2b26-41ac-b74b-bab0513cff29/w/crates/radicle-fetch)
Compiling radicle-protocol v0.9.1 (/ac61a839-2b26-41ac-b74b-bab0513cff29/w/crates/radicle-protocol)
Compiling radicle-schemars v0.9.1 (/ac61a839-2b26-41ac-b74b-bab0513cff29/w/crates/radicle-schemars)
Compiling radicle-windows v0.1.0 (/ac61a839-2b26-41ac-b74b-bab0513cff29/w/crates/radicle-windows)
Finished `dev` profile [unoptimized + debuginfo] target(s) in 1m 02s
+ cargo doc --workspace --no-deps --all-features
Downloading crates ...
Downloaded dhat v0.3.3
Downloaded mintex v0.1.4
Downloaded minicbor v0.13.2
Downloaded rustc-hash v1.1.0
Downloaded thousands v0.2.0
Checking regex-automata v0.4.14
Compiling num-traits v0.2.19
Compiling syn v1.0.109
Checking once_cell v1.21.4
Checking tempfile v3.27.0
Compiling minicbor v0.13.2
Checking num-integer v0.1.46
Checking num-iter v0.1.45
Checking num-bigint-dig v0.8.6
Checking radicle-git-metadata v0.2.1 (/ac61a839-2b26-41ac-b74b-bab0513cff29/w/crates/radicle-git-metadata)
Checking rusty-fork v0.3.1
Checking radicle-localtime v0.1.0 (/ac61a839-2b26-41ac-b74b-bab0513cff29/w/crates/radicle-localtime)
Compiling amplify_syn v2.0.1
Checking rsa v0.9.10
Checking bstr v1.12.1
Checking ssh-key v0.6.7
Checking gix-validate v0.11.1
Checking gix-error v0.2.3
Compiling amplify_derive v4.0.1
Checking gix-path v0.12.0
Checking radicle-git-ref-format v0.2.0 (/ac61a839-2b26-41ac-b74b-bab0513cff29/w/crates/radicle-git-ref-format)
Checking gix-features v0.48.0
Checking gix-hash v0.25.0
Checking gix-date v0.15.3
Checking radicle-oid v0.2.2 (/ac61a839-2b26-41ac-b74b-bab0513cff29/w/crates/radicle-oid)
Checking gix-actor v0.41.0
Checking ssh-agent-lib v0.6.0
Checking gix-hashtable v0.15.0
Checking proptest v1.10.0
Checking gix-object v0.60.0
Checking gix-chunk v0.7.1
Checking radicle-dag v0.10.0 (/ac61a839-2b26-41ac-b74b-bab0513cff29/w/crates/radicle-dag)
Checking gix-commitgraph v0.37.0
Checking gix-fs v0.21.1
Checking gix-revwalk v0.31.0
Checking gix-tempfile v23.0.0
Checking amplify v4.9.0
Checking gix-quote v0.7.1
Checking miniz_oxide v0.8.9
Checking gix-command v0.9.0
Checking chrono v0.4.44
Checking radicle-signals v0.12.1 (/ac61a839-2b26-41ac-b74b-bab0513cff29/w/crates/radicle-signals)
Checking cyphergraphy v0.3.1
Checking gix-lock v23.0.0
Checking gix-url v0.36.0
Checking cypheraddr v0.4.1
Checking noise-framework v0.4.1
Checking gix-config-value v0.18.0
Checking socks5-client v0.4.3
Checking idna v1.1.0
Checking cyphernet v0.5.4
Checking gix-prompt v0.15.0
Checking radicle-crypto v0.19.0 (/ac61a839-2b26-41ac-b74b-bab0513cff29/w/crates/radicle-crypto)
Checking backtrace v0.3.76
Checking inquire v0.9.4
Checking gix-traverse v0.57.0
Checking radicle-core v0.4.1 (/ac61a839-2b26-41ac-b74b-bab0513cff29/w/crates/radicle-core)
Checking radicle-cob v0.21.1 (/ac61a839-2b26-41ac-b74b-bab0513cff29/w/crates/radicle-cob)
Checking gix-revision v0.45.0
Checking gix-diff v0.63.0
Checking gix-glob v0.26.0
Checking gix-packetline v0.21.5
Checking regex v1.12.3
Checking url v2.5.8
Checking gix-transport v0.57.0
Checking radicle v0.25.1 (/ac61a839-2b26-41ac-b74b-bab0513cff29/w/crates/radicle)
Checking tree-sitter v0.24.7
Checking gix-refspec v0.41.0
Checking gix-pack v0.70.0
Checking gix-credentials v0.38.0
Checking radicle-log v0.2.0 (/ac61a839-2b26-41ac-b74b-bab0513cff29/w/crates/radicle-log)
Checking gix-ref v0.63.0
Checking gix-shallow v0.12.0
Checking gix-negotiate v0.31.0
Checking radicle-term v0.19.1 (/ac61a839-2b26-41ac-b74b-bab0513cff29/w/crates/radicle-term)
Checking gix-protocol v0.61.0
Checking uuid v1.22.0
Checking gix-odb v0.80.0
Checking human-panic v2.0.6
Checking tree-sitter-toml-ng v0.6.0
Checking radicle-surf v0.29.0 (/ac61a839-2b26-41ac-b74b-bab0513cff29/w/crates/radicle-surf)
Checking tree-sitter-highlight v0.24.7
Checking rustc-hash v1.1.0
Checking mintex v0.1.4
Compiling radicle-node v0.21.1 (/ac61a839-2b26-41ac-b74b-bab0513cff29/w/crates/radicle-node)
Checking thousands v0.2.0
Checking dhat v0.3.3
Checking radicle-systemd v0.13.0 (/ac61a839-2b26-41ac-b74b-bab0513cff29/w/crates/radicle-systemd)
Documenting radicle-cli-test v0.14.1 (/ac61a839-2b26-41ac-b74b-bab0513cff29/w/crates/radicle-cli-test)
Documenting radicle-systemd v0.13.0 (/ac61a839-2b26-41ac-b74b-bab0513cff29/w/crates/radicle-systemd)
Documenting radicle-surf v0.29.0 (/ac61a839-2b26-41ac-b74b-bab0513cff29/w/crates/radicle-surf)
Documenting radicle v0.25.1 (/ac61a839-2b26-41ac-b74b-bab0513cff29/w/crates/radicle)
Documenting radicle-term v0.19.1 (/ac61a839-2b26-41ac-b74b-bab0513cff29/w/crates/radicle-term)
Documenting radicle-core v0.4.1 (/ac61a839-2b26-41ac-b74b-bab0513cff29/w/crates/radicle-core)
Documenting radicle-cob v0.21.1 (/ac61a839-2b26-41ac-b74b-bab0513cff29/w/crates/radicle-cob)
Documenting radicle-log v0.2.0 (/ac61a839-2b26-41ac-b74b-bab0513cff29/w/crates/radicle-log)
Documenting radicle-crypto v0.19.0 (/ac61a839-2b26-41ac-b74b-bab0513cff29/w/crates/radicle-crypto)
Documenting radicle-signals v0.12.1 (/ac61a839-2b26-41ac-b74b-bab0513cff29/w/crates/radicle-signals)
Documenting radicle-oid v0.2.2 (/ac61a839-2b26-41ac-b74b-bab0513cff29/w/crates/radicle-oid)
Documenting radicle-git-ref-format v0.2.0 (/ac61a839-2b26-41ac-b74b-bab0513cff29/w/crates/radicle-git-ref-format)
Documenting radicle-git-metadata v0.2.1 (/ac61a839-2b26-41ac-b74b-bab0513cff29/w/crates/radicle-git-metadata)
Documenting radicle-localtime v0.1.0 (/ac61a839-2b26-41ac-b74b-bab0513cff29/w/crates/radicle-localtime)
Documenting radicle-dag v0.10.0 (/ac61a839-2b26-41ac-b74b-bab0513cff29/w/crates/radicle-dag)
Checking radicle-fetch v0.21.1 (/ac61a839-2b26-41ac-b74b-bab0513cff29/w/crates/radicle-fetch)
Checking radicle-cli v0.23.0 (/ac61a839-2b26-41ac-b74b-bab0513cff29/w/crates/radicle-cli)
Documenting radicle-cli v0.23.0 (/ac61a839-2b26-41ac-b74b-bab0513cff29/w/crates/radicle-cli)
Documenting radicle-schemars v0.9.1 (/ac61a839-2b26-41ac-b74b-bab0513cff29/w/crates/radicle-schemars)
Checking radicle-protocol v0.9.1 (/ac61a839-2b26-41ac-b74b-bab0513cff29/w/crates/radicle-protocol)
Documenting radicle-node v0.21.1 (/ac61a839-2b26-41ac-b74b-bab0513cff29/w/crates/radicle-node)
Documenting radicle-protocol v0.9.1 (/ac61a839-2b26-41ac-b74b-bab0513cff29/w/crates/radicle-protocol)
Documenting radicle-fetch v0.21.1 (/ac61a839-2b26-41ac-b74b-bab0513cff29/w/crates/radicle-fetch)
Documenting radicle-windows v0.1.0 (/ac61a839-2b26-41ac-b74b-bab0513cff29/w/crates/radicle-windows)
Documenting radicle-remote-helper v0.18.1 (/ac61a839-2b26-41ac-b74b-bab0513cff29/w/crates/radicle-remote-helper)
Finished `dev` profile [unoptimized + debuginfo] target(s) in 11.39s
Generated /ac61a839-2b26-41ac-b74b-bab0513cff29/w/target/doc/radicle/index.html and 22 other files
+ cargo test --workspace --no-fail-fast
Finished `test` profile [unoptimized + debuginfo] target(s) in 0.18s
Running unittests src/lib.rs (target/debug/deps/radicle-e47768bfcd5fead6)
running 402 tests
test canonical::formatter::test::ascii_control_characters ... ok
test canonical::formatter::test::securesystemslib_asserts ... ok
test canonical::formatter::test::ordered_nested_object ... ok
test cob::cache::migrations::_2::tests::test_patch_json_deserialization ... ok
test cob::cache::tests::test_check_version ... ok
test cob::cache::tests::test_migrate_to ... ok
test cob::common::test::test_title ... ok
test cob::common::test::test_color ... ok
test cob::common::test::test_emojis ... ok
test cob::cache::migrations::_2::tests::test_migration_2 ... ok
test cob::identity::test::accepted_sibling_causes_rejection ... ok
test cob::identity::test::accept_rejects_sibling_accept ... ok
test cob::identity::test::cannot_redact_previously_accepted_revision ... ok
test cob::identity::test::authorization_based_on_parent_not_current ... ok
test cob::identity::test::concurrent_accept_before_redact_converge ... ok
test cob::identity::test::concurrent_redact_and_accept_converge ... ok
test cob::identity::test::evaluates_queued_children ... ok
test cob::identity::test::cascading_rejections ... ok
test cob::identity::test::evaluation_skips_sibling_accept_in_old_history ... ok
test cob::identity::test::evaluation_strips_author_accept_for_sibling_creation ... ok
test cob::identity::test::prop_json_eq_str ... ok
test cob::identity::test::has_accepted_active_sibling_returns_true_when_sibling_accepted ... ok
test cob::identity::test::evaluates_queued_children_with_new_delegate ... ok
test cob::identity::test::redact_parent_cascades ... ok
test cob::identity::test::reject_concurrent ... ok
test cob::identity::test::remove_delegate_concurrent ... ok
test cob::identity::test::test_identity_redact_revision ... ok
test cob::identity::test::terminal_states_concurrent ... ok
test cob::identity::test::test_identity_updates ... ok
test cob::identity::test::test_identity_cannot_redact_terminal_states ... ok
test cob::identity::test::test_identity_update_rejected ... ok
test cob::identity::test::test_valid_identity ... ok
test cob::identity::test::test_identity_updates_concurrent ... ok
test cob::issue::cache::tests::test_counts ... ok
test cob::issue::cache::tests::test_get ... ok
test cob::issue::cache::tests::test_is_empty ... ok
test cob::issue::cache::tests::test_list ... ok
test cob::issue::cache::tests::test_list_by_status ... ok
test cob::issue::cache::tests::test_remove ... ok
test cob::identity::test::update_rejects_second_sibling_proposal ... ok
test cob::identity::test::test_identity_updates_concurrent_outdated ... ok
test cob::issue::test::test_embeds ... ok
test cob::issue::test::test_embeds_edit ... ok
test cob::issue::test::test_invalid_actions ... ok
test cob::issue::test::test_invalid_cob ... ok
test cob::issue::test::test_invalid_tx ... ok
test cob::issue::test::test_invalid_tx_reference ... ok
test cob::issue::test::test_concurrency ... ok
test cob::issue::test::test_issue_all ... ok
test cob::issue::test::test_issue_comment ... ok
test cob::issue::test::test_issue_create_and_assign ... ok
test cob::issue::test::test_issue_comment_redact ... ok
test cob::issue::test::test_issue_create_and_change_state ... ok
test cob::issue::test::test_issue_create_and_get ... ok
test cob::issue::test::test_issue_create_and_reassign ... ok
test cob::issue::test::test_issue_edit ... ok
test cob::issue::test::test_issue_create_and_unassign ... ok
test cob::issue::test::test_issue_edit_description ... ok
test cob::issue::test::test_issue_multilines ... ok
test cob::issue::test::test_issue_label ... ok
test cob::issue::test::test_issue_state_serde ... ok
test cob::issue::test::test_ordering ... ok
test cob::patch::actions::test::test_review_edit ... ok
test cob::issue::test::test_issue_react ... ok
test cob::issue::test::test_issue_reply ... ok
test cob::patch::cache::tests::test_get ... ok
test cob::patch::cache::tests::test_is_empty ... ok
test cob::patch::cache::tests::test_list ... ok
test cob::patch::cache::tests::test_counts ... ok
test cob::patch::cache::tests::test_remove ... ok
test cob::patch::encoding::review::test::test_review_deserialize_summary_migration_null_summary ... ok
test cob::patch::encoding::review::test::test_review_deserialize_summary_migration_with_summary ... ok
test cob::patch::encoding::review::test::test_review_deserialize_summary_migration_without_summary ... ok
test cob::patch::encoding::review::test::test_review_deserialize_summary_v2 ... ok
test cob::patch::encoding::review::test::test_review_summary ... ok
test cob::patch::test::test_json ... ok
test cob::patch::test::test_json_serialisation_target ... ok
test cob::patch::test::test_json_serialization ... ok
test cob::patch::test::test_merge_target_resolution ... ok
test cob::patch::cache::tests::test_list_by_status ... ok
test cob::patch::test::test_patch_create_and_get ... ok
test cob::patch::test::test_patch_discussion ... ok
test cob::patch::test::test_patch_merge_authorization_ref_formats ... ok
test cob::patch::test::test_patch_merge_custom_destination_authorized ... ok
test cob::patch::test::test_patch_merge_custom_destination_unauthorized ... ok
test cob::patch::test::test_patch_merge ... ok
test cob::patch::test::test_patch_redact ... ok
test cob::patch::test::test_patch_review ... ok
test cob::patch::test::test_patch_review_comment ... ok
test cob::patch::test::test_patch_review_duplicate ... ok
test cob::patch::test::test_patch_review_edit ... ok
test cob::patch::test::test_patch_review_edit_comment ... ok
test cob::patch::test::test_patch_review_remove_summary ... ok
test cob::patch::test::test_patch_review_revision_redact ... ok
test cob::patch::test::test_reactions_json_serialization ... ok
test cob::patch::test::test_revision_edit_redact ... ok
test cob::patch::test::test_revision_reaction ... ok
test cob::patch::test::test_revision_review_merge_redacted ... ok
test cob::patch::test::test_target_branch ... ok
test cob::stream::tests::test_all_from ... ok
test cob::stream::tests::test_all_from_until ... ok
test cob::stream::tests::test_all_until ... ok
test cob::stream::tests::test_from_until ... ok
test cob::stream::tests::test_regression_from_until ... ok
test cob::thread::tests::prop_ordering ... ok
test cob::thread::tests::resolve_and_unresolve_multiple_comments_in_one_operation ... ok
test cob::thread::tests::test_comment_edit_missing ... ok
test cob::thread::tests::test_comment_edit_redacted ... ok
test cob::thread::tests::test_comment_redact_missing ... ok
test cob::thread::tests::test_duplicate_comments ... ok
test cob::thread::tests::test_edit_comment ... ok
test cob::thread::tests::test_redact_comment ... ok
test cob::thread::tests::test_timeline ... ok
test git::canonical::protect::tests::refs_rad ... ok
test git::canonical::protect::tests::refs_rad_id ... ok
test git::canonical::protect::tests::refs_radieschen ... ok
test git::canonical::quorum::test::merge_base_commutative ... ok
test git::canonical::quorum::test::test_merge_bases ... ok
test git::canonical::rules::test::canonical ... ok
test git::canonical::rules::test::deserialization ... ok
test git::canonical::rules::test::deserialize_extensions ... ok
test git::canonical::rules::test::matches_exactly_curly_braces ... ok
test git::canonical::rules::test::matches_expands_globs_appropriately ... ok
test git::canonical::rules::test::most_specific_match_ignores_lexicographic_order ... ok
test git::canonical::rules::test::ordering ... ok
test git::canonical::rules::test::property::identity ... ok
test git::canonical::rules::test::property::prefix ... ok
test git::canonical::rules::test::property::prefix_negative ... ok
test git::canonical::rules::test::property::suffix ... ok
test git::canonical::rules::test::property::suffix_negative ... ok
test git::canonical::rules::test::property::trailing_asterisk_partial_component ... ok
test git::canonical::rules::test::roundtrip ... ok
test git::canonical::rules::test::rule_validate_failures ... ok
test git::canonical::rules::test::rule_validate_success ... ok
test git::canonical::rules::test::special_branches ... ok
test git::canonical::symbolic::test::canonical_roundtrip ... ok
test git::canonical::symbolic::test::deserialize_infinite ... ok
test git::canonical::symbolic::test::deserialize_order ... ok
test git::canonical::symbolic::test::deserialize_valid ... ok
test git::canonical::symbolic::test::infinite_multi ... ok
test git::canonical::symbolic::test::infinite_single ... ok
test git::canonical::symbolic::test::raw_is_freely_mutable ... ok
test git::canonical::symbolic::test::reclassification_combine ... ok
test git::canonical::symbolic::test::reclassification_combine_reverse ... ok
test git::canonical::symbolic::test::reclassification_diamond ... ok
test git::canonical::symbolic::test::reclassification_order_invariant ... ok
test git::canonical::symbolic::test::reclassification_reverse_chain ... ok
test git::canonical::symbolic::test::resolve_two_hop_chain ... ok
test git::canonical::symbolic::test::target_classification ... ok
test git::canonical::symbolic::test::target_classification_symbolic ... ok
test git::canonical::symbolic::test::target_reclassification ... ok
test git::canonical::symbolic::test::target_reclassification_commutative ... ok
test git::canonical::tests::test_commit_quorum_fork_of_a_fork ... ok
test git::canonical::tests::test_commit_quorum_forked_merge_commits ... ok
test git::canonical::tests::test_commit_quorum_groups ... ok
test git::canonical::tests::test_commit_quorum_linear ... ok
test git::canonical::tests::test_commit_quorum_merges ... ok
test git::canonical::tests::test_commit_quorum_single ... ok
test git::canonical::tests::test_commit_quorum_three_way_fork ... ok
test git::canonical::tests::test_commit_quorum_two_way_fork ... ok
test git::canonical::tests::test_quorum_different_types ... ok
test cob::patch::test::test_patch_update ... ok
test git::canonical::tests::test_tag_quorum ... ok
test identity::crefs::tests::invalid_clash ... ok
test identity::crefs::tests::invalid_clash_asterisk_name ... ok
test identity::crefs::tests::invalid_dangling ... ok
test identity::crefs::tests::omit_symbolic ... ok
test identity::crefs::tests::valid ... ok
test identity::crefs::tests::valid_asterisk_target ... ok
test identity::did::test::test_did_encode_decode ... ok
test identity::did::test::test_did_vectors ... ok
test identity::doc::test::default_branch_clash ... ok
test identity::doc::test::default_branch_without_project ... ok
test identity::doc::test::encode_preserves_symbolic_chain ... ok
test identity::doc::test::prop_encode_decode ... ok
test git::canonical::tests::test_quorum_properties ... ok
test identity::doc::test::test_canonical_doc ... ok
test identity::doc::test::test_duplicate_dids ... ok
test identity::doc::test::test_future_version_error ... ok
test identity::doc::test::test_is_valid_version ... ok
test identity::doc::test::test_canonical_example ... ok
test identity::doc::test::test_not_found ... ok
test identity::doc::test::test_parse_version ... ok
test identity::doc::test::test_visibility_json ... ok
test identity::doc::update::test::test_can_update_crefs ... ok
test identity::doc::update::test::test_cannot_include_default_branch_rule ... ok
test identity::doc::update::test::test_default_branch_rule_exists_after_verification ... ok
test identity::project::test::test_project_name ... ok
test node::address::store::test::skip_invalid_address_type ... ok
test node::address::store::test::skip_mismatched_address_type ... ok
test node::address::store::test::test_alias ... ok
test identity::doc::test::test_max_delegates ... ok
test node::address::store::test::test_disconnected ... ok
test node::address::store::test::test_disconnected_ban ... ok
test node::address::store::test::test_entries ... ok
test node::address::store::test::test_entries_skips_unparsable_address ... ok
test node::address::store::test::test_get_none ... ok
test node::address::store::test::test_insert_and_get ... ok
test node::address::store::test::test_insert_and_remove ... ok
test node::address::store::test::test_insert_and_update ... ok
test node::address::store::test::test_insert_duplicate ... ok
test node::address::store::test::test_node_aliases ... ok
test node::address::store::test::test_remove_nothing ... ok
test node::command::test::command_result ... ok
test node::config::test::deserialize_migrating_scope ... ok
test node::config::test::fetch_level_min ... ok
test node::config::test::onion_absent ... ok
test node::config::test::onion_null ... ok
test node::config::test::partial ... ok
test node::config::test::regression_ipv6_address_brackets ... ok
test node::config::test::regression_ipv6_address_no_brackets ... ok
test node::config::test::serialize_migrating_scope ... ok
test node::config::test::user_agent_custom ... ok
test node::config::test::user_agent_default ... ok
test node::config::test::user_agent_default_explicit ... ok
test node::config::test::user_agent_opt_out ... ok
test node::db::config::test::database_config_valid_combinations ... ok
test node::db::config::test::invalid ... ok
test node::db::test::migration_8::all_ipv6_formatted_dns_addresses_are_retyped ... ok
test node::db::test::migration_8::dns_address_starting_with_bracket_but_missing_closing_bracket_colon_is_unaffected ... ok
test node::db::test::migration_8::dns_address_with_bracket_not_at_start_is_unaffected ... ok
test node::db::test::migration_8::ipv4_address_is_unaffected ... ok
test node::db::test::migration_8::ipv6_formatted_dns_address_is_deleted_when_correct_ipv6_row_already_exists ... ok
test node::db::test::migration_8::ipv6_formatted_dns_address_is_retyped_to_ipv6 ... ok
test node::db::test::migration_8::migration_applies_to_all_nodes ... ok
test node::db::test::migration_8::plain_dns_hostname_without_brackets_is_unaffected ... ok
test node::db::test::migration_8::retype_preserves_address_metadata ... ok
test node::db::test::migration_9::bracketed_non_ipv6_garbage_is_deleted ... ok
test node::db::test::migration_9::dns_row_is_unaffected_even_when_inner_part_has_no_colon ... ok
test node::db::test::migration_9::empty_brackets_ipv6_row_is_deleted ... ok
test node::db::test::migration_9::full_ipv6_address_is_kept ... ok
test node::db::test::migration_9::ipv4_row_is_unaffected ... ok
test node::db::test::migration_9::loopback_address_is_kept ... ok
test node::db::test::migration_9::unspecified_address_is_kept ... ok
test node::db::test::test_version ... ok
test node::features::test::test_operations ... ok
test node::notifications::store::test::test_branch_notifications ... ok
test node::notifications::store::test::test_clear ... ok
test node::notifications::store::test::test_cob_notifications ... ok
test node::notifications::store::test::test_counts_by_repo ... ok
test node::notifications::store::test::test_duplicate_notifications ... ok
test node::notifications::store::test::test_notification_status ... ok
test node::policy::store::test::test_follow_and_unfollow_node ... ok
test node::policy::store::test::test_node_aliases ... ok
test node::policy::store::test::test_node_policies ... ok
test node::policy::store::test::test_node_policy ... ok
test node::policy::store::test::test_repo_policies ... ok
test node::policy::store::test::test_repo_policy ... ok
test node::policy::store::test::test_seed_and_unseed_repo ... ok
test node::policy::store::test::test_update_alias ... ok
test node::policy::store::test::test_update_scope ... ok
test node::refs::store::test::test_count ... ok
test node::refs::store::test::test_set_and_delete ... ok
test node::refs::store::test::test_set_and_get ... ok
test node::address::store::test::test_empty ... ok
test node::routing::test::test_count ... ok
test node::routing::test::test_insert_and_get ... ok
test node::routing::test::test_entries ... ok
test node::routing::test::test_insert_and_remove ... ok
test node::routing::test::test_insert_and_get_resources ... ok
test node::routing::test::test_insert_duplicate ... ok
test node::routing::test::test_len ... ok
test node::routing::test::test_insert_existing_updated_time ... ok
test node::routing::test::test_remove_many ... ok
test node::routing::test::test_remove_redundant ... ok
test node::routing::test::test_update_existing_multi ... ok
test node::sync::announce::test::all_synced_nodes_are_preferred_seeds ... ok
test node::sync::announce::test::announcer_adapts_target_to_reach ... ok
test node::sync::announce::test::announcer_preferred_seeds_or_replica_factor ... ok
test node::sync::announce::test::announcer_reached_max_replication_target ... ok
test node::routing::test::test_prune ... ok
test node::sync::announce::test::announcer_reached_min_replication_target ... ok
test node::sync::announce::test::announcer_synced_with_unknown_node ... ok
test node::sync::announce::test::announcer_reached_preferred_seeds ... ok
test node::sync::announce::test::announcer_with_replication_factor_zero_and_preferred_seeds ... ok
test node::sync::announce::test::announcer_timed_out ... ok
test node::sync::announce::test::construct_node_appears_in_multiple_input_sets ... ok
test node::sync::announce::test::construct_only_preferred_seeds_provided ... ok
test node::sync::announce::test::cannot_construct_announcer ... ok
test node::sync::announce::test::invariant_progress_should_match_state ... ok
test node::sync::announce::test::local_node_in_multiple_sets ... ok
test node::sync::announce::test::local_node_in_preferred_seeds ... ok
test node::sync::announce::test::local_node_in_synced_set ... ok
test node::sync::announce::test::local_node_in_unsynced_set ... ok
test node::sync::announce::test::local_node_only_in_all_sets_results_in_no_seeds_error ... ok
test node::sync::announce::test::preferred_seeds_already_synced ... ok
test node::sync::announce::test::synced_with_local_node_is_ignored ... ok
test node::sync::announce::test::synced_with_same_node_multiple_times ... ok
test node::sync::announce::test::timed_out_after_reaching_success ... ok
test node::sync::fetch::test::all_nodes_are_candidates ... ok
test node::sync::fetch::test::could_not_reach_target ... ok
test node::sync::fetch::test::all_nodes_are_fetchable ... ok
test node::sync::fetch::test::ignores_duplicates_and_local_node ... ok
test node::sync::fetch::test::preferred_seeds_target_returned_over_replicas ... ok
test node::sync::fetch::test::reaches_target_of_max_replicas ... ok
test node::sync::fetch::test::reaches_target_of_preferred_seeds ... ok
test node::sync::fetch::test::reaches_target_of_replicas ... ok
test node::sync::test::replicas_constrain_to ... ok
test node::sync::test::ensure_replicas_construction ... ok
test node::test::test_alias ... ok
test node::test::test_address ... ok
test node::test::test_user_agent ... ok
test node::timestamp::tests::test_timestamp_max ... ok
test node::test::test_command_result ... ok
test profile::test::canonicalize_home ... ok
test profile::test::test_config ... ok
test rad::tests::test_checkout ... ok
test rad::tests::test_fork ... ok
test rad::tests::test_init ... ok
test profile::config::test::schema ... ok
test storage::git::tests::test_references_of ... ok
test storage::git::transport::local::url::test::test_url_parse ... ok
test storage::git::transport::local::url::test::test_url_to_string ... ok
test storage::git::transport::remote::url::test::test_url_parse ... ok
test storage::git::tests::test_sign_refs ... ok
test storage::refs::sigrefs::git::properties::idempotent_write ... ok
test cob::identity::test::property::prop_invariants ... ok
test cob::patch::cache::tests::test_find_by_revision ... ok
test storage::refs::sigrefs::git::properties::initial_commit_roundtrip ... ok
test storage::refs::sigrefs::read::test::commit_reader::identity_root_error ... ok
test storage::refs::sigrefs::read::test::commit_reader::missing_commit ... ok
test storage::refs::sigrefs::read::test::commit_reader::read_ok ... ok
test storage::refs::sigrefs::read::test::commit_reader::too_many_parents ... ok
test storage::refs::sigrefs::read::test::commit_reader::tree_error ... ok
test storage::refs::sigrefs::read::test::identity_root_reader::doc_blob_error ... ok
test storage::refs::sigrefs::read::test::identity_root_reader::missing_identity ... ok
test storage::refs::sigrefs::read::test::identity_root_reader::read_ok_none ... ok
test storage::refs::sigrefs::read::test::identity_root_reader::read_ok_some ... ok
test storage::refs::sigrefs::read::test::resolve_tip::find_reference_error ... ok
test storage::refs::sigrefs::read::test::resolve_tip::missing_sigrefs ... ok
test storage::refs::sigrefs::read::test::resolve_tip::resolve_tip_ok ... ok
test storage::refs::sigrefs::read::test::signed_refs_reader::detect_parent::root_without_parent ... ok
test storage::refs::sigrefs::read::test::signed_refs_reader::detect_parent::root_without_root ... ok
test storage::refs::sigrefs::read::test::signed_refs_reader::downgrade::parent ... ok
test storage::refs::sigrefs::read::test::signed_refs_reader::downgrade::restore ... ok
test storage::refs::sigrefs::read::test::signed_refs_reader::downgrade::root ... ok
test storage::refs::sigrefs::read::test::signed_refs_reader::downgrade::root_with_parent ... ok
test storage::refs::sigrefs::read::test::signed_refs_reader::head_commit_error ... ok
test storage::refs::sigrefs::read::test::signed_refs_reader::head_verify_mismatched_identity_error ... ok
test storage::refs::sigrefs::read::test::signed_refs_reader::head_verify_signature_error ... ok
test storage::refs::sigrefs::read::test::signed_refs_reader::invalid_parent ... ok
test storage::refs::sigrefs::read::test::signed_refs_reader::read_ok_no_parent ... ok
test storage::refs::sigrefs::read::test::signed_refs_reader::read_ok_parent ... ok
test storage::refs::sigrefs::read::test::signed_refs_reader::read_ok_root ... ok
test storage::refs::sigrefs::read::test::signed_refs_reader::replay::alternating ... ok
test storage::refs::sigrefs::read::test::signed_refs_reader::replay::chain ... ok
test storage::refs::sigrefs::read::test::signed_refs_reader::replay::multiple ... ok
test storage::refs::sigrefs::read::test::signed_refs_reader::replay::root_at_head ... ok
test storage::refs::sigrefs::read::test::signed_refs_reader::single_commit ... ok
test storage::refs::sigrefs::read::test::signed_refs_reader::two_commits ... ok
test storage::refs::sigrefs::read::test::signed_refs_reader::walk_commit_error ... ok
test storage::refs::sigrefs::read::test::signed_refs_reader::walk_verify_error ... ok
test storage::refs::sigrefs::read::test::tree_reader::missing_both ... ok
test storage::refs::sigrefs::read::test::tree_reader::missing_refs ... ok
test storage::refs::sigrefs::read::test::tree_reader::missing_signature ... ok
test storage::refs::sigrefs::read::test::tree_reader::parse_refs_error ... ok
test storage::refs::sigrefs::read::test::tree_reader::parse_signature_error ... ok
test storage::refs::sigrefs::read::test::tree_reader::read_ok ... ok
test storage::refs::sigrefs::read::test::tree_reader::read_refs_error ... ok
test storage::refs::sigrefs::read::test::tree_reader::read_signature_error ... ok
test storage::refs::sigrefs::write::test::commit_writer::tree_error ... ok
test storage::refs::sigrefs::write::test::commit_writer::write_commit_error ... ok
test storage::refs::sigrefs::write::test::commit_writer::write_empty_refs ... ok
test storage::refs::sigrefs::write::test::commit_writer::write_root_ok ... ok
test storage::refs::sigrefs::write::test::commit_writer::write_with_parent_ok ... ok
test storage::refs::sigrefs::write::test::head_reader::no_head ... ok
test storage::refs::sigrefs::write::test::head_reader::read_ok ... ok
test storage::refs::sigrefs::write::test::head_reader::reference_error ... ok
test storage::refs::sigrefs::write::test::head_reader::refs_blob_error ... ok
test storage::refs::sigrefs::write::test::head_reader::refs_blob_missing ... ok
test storage::refs::sigrefs::write::test::head_reader::refs_parse_error ... ok
test storage::refs::sigrefs::write::test::head_reader::signature_blob_error ... ok
test storage::refs::sigrefs::write::test::head_reader::signature_blob_missing ... ok
test storage::refs::sigrefs::write::test::head_reader::signature_parse_error ... ok
test storage::refs::sigrefs::write::test::signed_refs_writer::commit_error ... ok
test storage::refs::sigrefs::write::test::signed_refs_writer::head_error ... ok
test storage::refs::sigrefs::write::test::signed_refs_writer::never_write_rad_sigrefs ... ok
test storage::refs::sigrefs::write::test::signed_refs_writer::reference_error ... ok
test storage::refs::sigrefs::write::test::signed_refs_writer::unchanged ... ok
test storage::refs::sigrefs::write::test::signed_refs_writer::unchanged_force_writes_new_commit ... ok
test storage::refs::sigrefs::write::test::signed_refs_writer::write_empty_refs ... ok
test storage::refs::sigrefs::write::test::signed_refs_writer::write_root_ok ... ok
test storage::refs::sigrefs::write::test::signed_refs_writer::write_with_parent_ok ... ok
test storage::refs::sigrefs::write::test::tree_writer::sign_error ... ok
test storage::refs::sigrefs::write::test::tree_writer::write_ok ... ok
test storage::refs::sigrefs::write::test::tree_writer::write_tree_error ... ok
test storage::refs::tests::prop_canonical_roundtrip ... ok
test storage::refs::sigrefs::property::idempotent ... ok
test storage::tests::test_storage ... ok
test test::assert::test::assert_with_message ... ok
test test::assert::test::test_assert_no_move ... ok
test test::assert::test::test_assert_panic_0 - should panic ... ok
test test::assert::test::test_assert_panic_1 - should panic ... ok
test test::assert::test::test_assert_panic_2 - should panic ... ok
test test::assert::test::test_assert_succeed ... ok
test test::assert::test::test_panic_message ... ok
test version::test::test_version ... ok
test web::test::description_only ... ok
test web::test::pinned_empty ... ok
test storage::refs::tests::test_rid_verification ... ok
test storage::refs::sigrefs::git::properties::chain_roundtrip ... ok
test storage::refs::sigrefs::property::roundtrip ... ok
test result: ok. 402 passed; 0 failed; 0 ignored; 0 measured; 0 filtered out; finished in 4.05s
Running unittests src/lib.rs (target/debug/deps/radicle_cli-e8faa9d4df84ef8e)
running 48 tests
test commands::block::args::test::should_not_parse ... ok
test commands::block::args::test::should_parse_nid ... ok
test commands::block::args::test::should_parse_rid ... ok
test commands::clone::args::test::should_parse_rid_non_urn ... ok
test commands::clone::args::test::should_parse_rid_urn ... ok
test commands::cob::args::test::should_allow_log_json_format ... ok
test commands::clone::args::test::should_parse_rid_url ... ok
test commands::cob::args::test::should_allow_show_json_format ... ok
test commands::cob::args::test::should_allow_log_pretty_format ... ok
test commands::cob::args::test::should_not_allow_show_pretty_format ... ok
test commands::fork::args::test::should_not_parse_rid_url ... ok
test commands::cob::args::test::should_not_allow_update_pretty_format ... ok
test commands::fork::args::test::should_parse_rid_non_urn ... ok
test commands::fork::args::test::should_parse_rid_urn ... ok
test commands::id::args::test::should_not_clobber_payload_args ... ok
test commands::id::args::test::should_not_parse_into_payload - should panic ... ok
test commands::cob::args::test::should_allow_update_json_format ... ok
test commands::id::args::test::should_parse_into_payload ... ok
test commands::id::args::test::should_not_parse_single_payload ... ok
test commands::id::args::test::should_not_parse_single_payloads ... ok
test commands::id::args::test::should_parse_multiple_payloads ... ok
test commands::id::args::test::should_parse_single_payload ... ok
test commands::init::args::test::should_not_parse_rid_url ... ok
test commands::inspect::test::test_tree ... ok
test commands::init::args::test::should_parse_rid_urn ... ok
test commands::init::args::test::should_parse_rid_non_urn ... ok
test commands::patch::review::builder::tests::test_review_comments_before ... ok
test commands::patch::review::builder::tests::test_review_comments_basic ... ok
test commands::patch::review::builder::tests::test_review_comments_multiline ... ok
test commands::patch::review::builder::tests::test_review_comments_split_hunk ... ok
test commands::publish::args::test::should_not_parse_rid_url ... ok
test commands::publish::args::test::should_parse_rid_urn ... ok
test commands::watch::args::test::should_parse_ref_str ... ok
test git::pretty_diff::test::test_pretty ... ignored
test git::ddiff::tests::diff_encode_decode_ddiff_hunk ... ok
test git::test::test_version_from_str ... ok
test commands::publish::args::test::should_parse_rid_non_urn ... ok
test git::test::test_version_ord ... ok
test terminal::args::test::should_not_parse ... ok
test git::unified_diff::test::test_diff_encode_decode_diff ... ok
test terminal::args::test::should_parse_nid ... ok
test terminal::args::test::should_parse_rid ... ok
test git::unified_diff::test::test_diff_content_encode_decode_content ... ok
test terminal::format::test::test_bytes ... ok
test terminal::format::test::test_strip_comments ... ok
test terminal::patch::test::test_edit_display_message ... ok
test terminal::patch::test::test_create_display_message ... ok
test terminal::patch::test::test_update_display_message ... ok
test result: ok. 47 passed; 0 failed; 1 ignored; 0 measured; 0 filtered out; finished in 0.01s
Running unittests src/main.rs (target/debug/deps/rad-e1560454338e8751)
running 0 tests
test result: ok. 0 passed; 0 failed; 0 ignored; 0 measured; 0 filtered out; finished in 0.00s
Running tests/commands.rs (target/debug/deps/commands-c25c35cfc2429612)
running 126 tests
test commands::checkout::rad_checkout ... ok
test commands::clone::rad_clone_bare ... ok
test commands::clone::rad_clone ... ok
test commands::clone::rad_clone_all ... ok
test commands::clone::rad_clone_scope ... ok
test commands::clone::rad_clone_directory ... ok
test commands::clone::rad_clone_unknown ... ok
test commands::clone::rad_clone_partial_fail ... ok
test commands::clone::rad_clone_connect ... ok
test commands::cob::rad_cob_multiset ... ok
test commands::clone::test_clone_without_seeds ... ok
test commands::cob::rad_cob_log ... ok
test commands::cob::rad_cob_operations ... ok
test commands::cob::rad_cob_migrate ... ok
test commands::cob::rad_cob_show ... ok
test commands::cob::rad_cob_update_identity ... ok
test commands::cob::rad_cob_update ... ok
test commands::cob::test_cob_deletion ... ok
test commands::cob::test_cob_replication ... ok
test commands::git::git_push_and_fetch ... FAILED
test commands::git::git_push_amend ... ok
test commands::git::git_push_canonical_lightweight_tags ... ok
test commands::git::git_push_diverge ... ok
test commands::git::git_push_force_with_lease ... ok
test commands::git::git_push_canonical ... ok
test commands::git::git_push_converge ... ok
test commands::id::rad_id_collaboration ... ignored, slow
test commands::git::git_push_rollback ... ok
test commands::id::rad_id ... ok
test commands::git::git_tag ... ok
test commands::id::rad_id_private ... ok
test commands::id::rad_id_conflict ... ok
test commands::id::rad_id_threshold_soft_fork ... ok
test commands::id::rad_id_unknown_field ... ok
test commands::id::rad_id_threshold ... ok
test commands::id::rad_id_update_delete_field ... ok
test commands::init::rad_init ... ignored, part of many other tests
test commands::id::rad_id_unauthorized_delegate ... ok
test commands::init::rad_init_detached_head ... ok
test commands::init::rad_init_bare ... ok
test commands::id::rad_id_multi_delegate ... ok
test commands::init::rad_init_no_git ... ok
test commands::init::rad_init_existing ... ok
test commands::init::rad_init_existing_bare ... ok
test commands::init::rad_init_no_seed ... ok
test commands::init::rad_init_private ... ok
test commands::init::rad_init_private_no_seed ... ok
test commands::init::rad_init_private_clone ... ok
test commands::inbox::rad_inbox ... ok
test commands::init::rad_init_private_clone_seed ... ok
test commands::init::rad_init_private_seed ... ok
test commands::init::rad_init_sync_not_connected ... ok
test commands::init::rad_init_sync_preferred ... ok
test commands::init::rad_init_with_existing_remote ... ok
test commands::init::rad_publish ... ok
test commands::issue::rad_issue ... ok
test commands::jj::rad_jj_bare ... ignored, the bare repository does not have a `rad` remote, and so it cannot determine the RID of the repository
test commands::jj::rad_jj_colocated_patch ... ok
test commands::issue::rad_issue_list ... ok
test commands::node::rad_node_connect ... ok
test commands::node::rad_node_connect_without_address ... ok
test commands::patch::rad_merge_after_update ... ok
test commands::patch::rad_merge_no_ff ... ok
test commands::node::rad_node ... ok
test commands::patch::rad_merge_via_push ... ok
test commands::patch::rad_patch ... ok
test commands::patch::rad_patch_ahead_behind ... ok
test commands::patch::rad_patch_change_base ... ok
test commands::patch::rad_patch_checkout ... ok
test commands::patch::rad_patch_checkout_revision ... ok
test commands::patch::rad_patch_checkout_force ... ok
test commands::init::rad_init_sync_timeout ... ok
test commands::patch::rad_patch_detached_head ... ok
test commands::init::rad_init_sync_and_clone ... ok
test commands::patch::rad_patch_diff ... ok
test commands::patch::rad_patch_draft ... ok
test commands::patch::rad_patch_edit ... ok
test commands::patch::rad_patch_fetch_2 ... ok
test commands::patch::rad_patch_magic_push ... ok
test commands::patch::rad_patch_fetch_1 ... ok
test commands::patch::rad_patch_merge_draft ... ok
test commands::patch::rad_patch_delete ... ok
test commands::patch::rad_patch_merge_into_canonical_ref_branch ... ok
test commands::patch::rad_patch_merge_wrong_branch ... ok
test commands::patch::rad_patch_merge_unauthorized_branch ... ok
test commands::patch::rad_patch_merge_on_first_push ... ok
test commands::patch::rad_patch_open_explore ... ok
test commands::patch::rad_patch_revert_merge ... ok
test commands::patch::rad_patch_revert_custom_branch ... ok
test commands::patch::rad_patch_update ... ok
test commands::patch::rad_patch_review_no_options ... ok
test commands::patch::rad_patch_via_push ... ok
test commands::policy::rad_block ... ok
test commands::patch::rad_review_by_hunk ... ok
test commands::policy::rad_seed_and_follow ... ok
test commands::policy::rad_seed_policy_allow_no_scope ... ok
test commands::policy::rad_seed_scope ... ok
test commands::policy::rad_unseed ... ok
test commands::policy::rad_seed_many ... ok
test commands::policy::rad_unseed_many ... ok
test commands::sigpipe::config ... ok
test commands::sigpipe::help ... ok
test commands::sigpipe::rad_self ... ok
test commands::patch::rad_push_and_pull_patches ... ok
test commands::remote::rad_remote ... ok
test commands::sync::rad_sync_without_node ... ok
test commands::sync::rad_sync ... ok
test commands::utility::framework_home ... ok
test commands::utility::rad_auth ... ok
test commands::utility::rad_auth_errors ... ok
test commands::patch::rad_patch_pull_update ... ok
test commands::utility::rad_clean ... ok
test commands::utility::rad_config ... ok
test commands::utility::rad_diff ... ok
test commands::utility::rad_help ... ok
test commands::utility::rad_inspect ... ok
test commands::utility::rad_key_mismatch ... ok
test commands::utility::rad_self ... ok
test commands::utility::rad_warn_ipv6 ... ok
test commands::utility::rad_warn_old_nodes ... ok
test commands::watch::rad_watch ... ok
test commands::sync::rad_fetch ... ok
test rad_remote ... ok
test commands::workflow::rad_workflow ... ok
test commands::sync::test_replication_via_seed ... ok
test commands::utility::rad_fork ... ok
failures:
---- commands::git::git_push_and_fetch stdout ----
1788930635 test: rad-init:6: `rad init --name heartwood --description Radicle Heartwood Protocol & Stack --no-confirm --public -v` @ /tmp/.tmpyzxzv7/alice/work
1788930636 test: rad-init:28: `rad init` @ /tmp/.tmpyzxzv7/alice/work
1788930636 test: rad-init:35: `rad ls` @ /tmp/.tmpyzxzv7/alice/work
1788930636 test: rad-init:46: `rad node inventory` @ /tmp/.tmpyzxzv7/alice/work
1788930636 commands::git::git_push_and_fetch node: Opening policy database..
1788930636 commands::git::git_push_and_fetch node: Default seeding policy set to 'block (all)'
1788930636 commands::git::git_push_and_fetch node: Initializing service (Test)..
1788930636 commands::git::git_push_and_fetch node: Opening node database..
1788930636 commands::git::git_push_and_fetch node: Address book is empty. Adding bootstrap nodes..
1788930636 commands::git::git_push_and_fetch node: 0 nodes added to address book
1788930636 commands::git::git_push_and_fetch service: Init @1788930636119
1788930636 commands::git::git_push_and_fetch service: Empty refs database, populating from storage..
1788930636 commands::git::git_push_and_fetch radicle_protocol::service: Migrating `rad/sigrefs` of rad:z42hL2jL4XNk6K8oHQaSWfMgCL7ji to force feature level parent.
1788930636 commands::git::git_push_and_fetch service: Saved local sync status for rad:z42hL2jL4XNk6K8oHQaSWfMgCL7ji..
1788930636 commands::git::git_push_and_fetch service: Adding refs announcement for rad:z42hL2jL4XNk6K8oHQaSWfMgCL7ji to historical gossip messages..
1788930636 commands::git::git_push_and_fetch service: Not enough available peers to connect to (available=0, wanted=8)
1788930636 commands::git::git_push_and_fetch reactor-controller: Initializing reactor thread…
1788930636 z6MknSLrJoTcukLrE435hVNQT4JUhbvWLX4kUzqkEStBU8Vi <service> reactor: Entering reactor event loop
1788930636 z6MknSLrJoTcukLrE435hVNQT4JUhbvWLX4kUzqkEStBU8Vi <service> node: Listening on 127.0.0.1:33187..
1788930636 commands::git::git_push_and_fetch node: Binding control socket /tmp/.tmpyzxzv7/alice/.radicle/node/control.sock..
1788930636 z6MknSLrJoTcukLrE435hVNQT4JUhbvWLX4kUzqkEStBU8Vi <runtime> node: Running node z6MknSLrJoTcukLrE435hVNQT4JUhbvWLX4kUzqkEStBU8Vi in /tmp/.tmpyzxzv7/alice/.radicle..
1788930636 commands::git::git_push_and_fetch node: Opening policy database..
1788930636 z6MknSLrJoTcukLrE435hVNQT4JUhbvWLX4kUzqkEStBU8Vi <control> control: Control thread listening on socket..
1788930636 z6MknSLrJoTcukLrE435hVNQT4JUhbvWLX4kUzqkEStBU8Vi <signals> node: Signal notifications channel error: receiving on a closed channel
1788930636 z6MknSLrJoTcukLrE435hVNQT4JUhbvWLX4kUzqkEStBU8Vi <service> service: Received command QueryState(..)
1788930636 commands::git::git_push_and_fetch node: Default seeding policy set to 'block (all)'
1788930636 commands::git::git_push_and_fetch node: Initializing service (Test)..
1788930636 commands::git::git_push_and_fetch node: Opening node database..
1788930636 commands::git::git_push_and_fetch node: Address book is empty. Adding bootstrap nodes..
1788930636 commands::git::git_push_and_fetch node: 0 nodes added to address book
1788930636 commands::git::git_push_and_fetch service: Init @1788930636133
1788930636 commands::git::git_push_and_fetch service: Empty refs database, populating from storage..
1788930636 commands::git::git_push_and_fetch service: Not enough available peers to connect to (available=0, wanted=8)
1788930636 commands::git::git_push_and_fetch reactor-controller: Initializing reactor thread…
1788930636 z6Mkt67GdsW7715MEfRuP4pSZxJRJh6kj6Y48WRqVv4N1tRk <service> reactor: Entering reactor event loop
1788930636 z6Mkt67GdsW7715MEfRuP4pSZxJRJh6kj6Y48WRqVv4N1tRk <service> node: Listening on 127.0.0.1:42013..
1788930636 commands::git::git_push_and_fetch node: Binding control socket /tmp/.tmpyzxzv7/bob/.radicle/node/control.sock..
1788930636 z6Mkt67GdsW7715MEfRuP4pSZxJRJh6kj6Y48WRqVv4N1tRk <runtime> node: Running node z6Mkt67GdsW7715MEfRuP4pSZxJRJh6kj6Y48WRqVv4N1tRk in /tmp/.tmpyzxzv7/bob/.radicle..
1788930636 z6Mkt67GdsW7715MEfRuP4pSZxJRJh6kj6Y48WRqVv4N1tRk <control> control: Control thread listening on socket..
1788930636 z6Mkt67GdsW7715MEfRuP4pSZxJRJh6kj6Y48WRqVv4N1tRk <signals> node: Signal notifications channel error: receiving on a closed channel
1788930636 z6Mkt67GdsW7715MEfRuP4pSZxJRJh6kj6Y48WRqVv4N1tRk <service> service: Received command QueryState(..)
1788930636 z6Mkt67GdsW7715MEfRuP4pSZxJRJh6kj6Y48WRqVv4N1tRk <service> service: Received command QueryState(..)
1788930636 z6Mkt67GdsW7715MEfRuP4pSZxJRJh6kj6Y48WRqVv4N1tRk <service> service: Received command Connect(z6MknSLrJoTcukLrE435hVNQT4JUhbvWLX4kUzqkEStBU8Vi, 127.0.0.1:33187, ConnectOptions { persistent: false, timeout: 30s })
1788930636 z6Mkt67GdsW7715MEfRuP4pSZxJRJh6kj6Y48WRqVv4N1tRk <service> service: Connecting to z6MknSLrJoTcukLrE435hVNQT4JUhbvWLX4kUzqkEStBU8Vi (127.0.0.1:33187)..
1788930636 z6Mkt67GdsW7715MEfRuP4pSZxJRJh6kj6Y48WRqVv4N1tRk <service> service: Attempted connection to z6MknSLrJoTcukLrE435hVNQT4JUhbvWLX4kUzqkEStBU8Vi (127.0.0.1:33187)
1788930636 z6MknSLrJoTcukLrE435hVNQT4JUhbvWLX4kUzqkEStBU8Vi <service> wire: Inbound connection from 127.0.0.1:40444..
1788930636 z6MknSLrJoTcukLrE435hVNQT4JUhbvWLX4kUzqkEStBU8Vi <service> wire: Accepted inbound connection from 127.0.0.1:40444..
1788930636 z6MknSLrJoTcukLrE435hVNQT4JUhbvWLX4kUzqkEStBU8Vi <service> reactor: Registering transport
1788930636 z6Mkt67GdsW7715MEfRuP4pSZxJRJh6kj6Y48WRqVv4N1tRk <service> wire: Registering outbound transport for z6MknSLrJoTcukLrE435hVNQT4JUhbvWLX4kUzqkEStBU8Vi..
1788930636 z6MknSLrJoTcukLrE435hVNQT4JUhbvWLX4kUzqkEStBU8Vi <service> wire: Inbound peer resource registered
1788930636 z6Mkt67GdsW7715MEfRuP4pSZxJRJh6kj6Y48WRqVv4N1tRk <service> reactor: Registering transport
1788930636 z6Mkt67GdsW7715MEfRuP4pSZxJRJh6kj6Y48WRqVv4N1tRk <service> wire: Outbound peer resource registered for z6MknSLrJoTcukLrE435hVNQT4JUhbvWLX4kUzqkEStBU8Vi
1788930636 z6Mkt67GdsW7715MEfRuP4pSZxJRJh6kj6Y48WRqVv4N1tRk <service> transport: Handshake with ProtocolArtifact { session: "<omitted>", state: "<omitted>" } is complete
1788930636 z6Mkt67GdsW7715MEfRuP4pSZxJRJh6kj6Y48WRqVv4N1tRk <service> wire: Session established with z6MknSLrJoTcukLrE435hVNQT4JUhbvWLX4kUzqkEStBU8Vi
1788930636 z6Mkt67GdsW7715MEfRuP4pSZxJRJh6kj6Y48WRqVv4N1tRk <service> service: Connected to z6MknSLrJoTcukLrE435hVNQT4JUhbvWLX4kUzqkEStBU8Vi (127.0.0.1:33187) (Outbound)
1788930636 z6MknSLrJoTcukLrE435hVNQT4JUhbvWLX4kUzqkEStBU8Vi <service> transport: Handshake with ProtocolArtifact { session: "<omitted>", state: "<omitted>" } is complete
1788930636 z6Mkt67GdsW7715MEfRuP4pSZxJRJh6kj6Y48WRqVv4N1tRk <service> service: Subscribing to messages since timestamp 1788844236149..
1788930636 z6MknSLrJoTcukLrE435hVNQT4JUhbvWLX4kUzqkEStBU8Vi <service> wire: Session established with z6Mkt67GdsW7715MEfRuP4pSZxJRJh6kj6Y48WRqVv4N1tRk
1788930636 z6MknSLrJoTcukLrE435hVNQT4JUhbvWLX4kUzqkEStBU8Vi <service> service: Connected to z6Mkt67GdsW7715MEfRuP4pSZxJRJh6kj6Y48WRqVv4N1tRk (127.0.0.1:40444) (Inbound)
1788930636 z6MknSLrJoTcukLrE435hVNQT4JUhbvWLX4kUzqkEStBU8Vi <service> service: Subscribing to messages since timestamp 1788844236149..
1788930636 z6MknSLrJoTcukLrE435hVNQT4JUhbvWLX4kUzqkEStBU8Vi <service> service: Received node announcement of z6Mkt67GdsW7715MEfRuP4pSZxJRJh6kj6Y48WRqVv4N1tRk with 0 address(es) from z6Mkt67GdsW7715MEfRuP4pSZxJRJh6kj6Y48WRqVv4N1tRk (t=1788930636133)
1788930636 z6Mkt67GdsW7715MEfRuP4pSZxJRJh6kj6Y48WRqVv4N1tRk <service> service: Received node announcement of z6MknSLrJoTcukLrE435hVNQT4JUhbvWLX4kUzqkEStBU8Vi with 0 address(es) from z6MknSLrJoTcukLrE435hVNQT4JUhbvWLX4kUzqkEStBU8Vi (t=1788930636119)
1788930636 z6MknSLrJoTcukLrE435hVNQT4JUhbvWLX4kUzqkEStBU8Vi <service> service: Stored announcement from z6Mkt67GdsW7715MEfRuP4pSZxJRJh6kj6Y48WRqVv4N1tRk to be broadcast in 0 millisecond(s) (t=1788930636133)
1788930636 z6Mkt67GdsW7715MEfRuP4pSZxJRJh6kj6Y48WRqVv4N1tRk <service> service: Stored announcement from z6MknSLrJoTcukLrE435hVNQT4JUhbvWLX4kUzqkEStBU8Vi to be broadcast in 0 millisecond(s) (t=1788930636119)
1788930636 z6MknSLrJoTcukLrE435hVNQT4JUhbvWLX4kUzqkEStBU8Vi <service> service: Address store entry for node z6Mkt67GdsW7715MEfRuP4pSZxJRJh6kj6Y48WRqVv4N1tRk updated at 1788930636133
1788930636 z6Mkt67GdsW7715MEfRuP4pSZxJRJh6kj6Y48WRqVv4N1tRk <service> service: Address store entry for node z6MknSLrJoTcukLrE435hVNQT4JUhbvWLX4kUzqkEStBU8Vi updated at 1788930636119
1788930636 z6Mkt67GdsW7715MEfRuP4pSZxJRJh6kj6Y48WRqVv4N1tRk <service> service: Received inventory announcement of z6MknSLrJoTcukLrE435hVNQT4JUhbvWLX4kUzqkEStBU8Vi with 1 item(s) from z6MknSLrJoTcukLrE435hVNQT4JUhbvWLX4kUzqkEStBU8Vi (t=1788930636121)
1788930636 z6MknSLrJoTcukLrE435hVNQT4JUhbvWLX4kUzqkEStBU8Vi <service> service: Received inventory announcement of z6Mkt67GdsW7715MEfRuP4pSZxJRJh6kj6Y48WRqVv4N1tRk with 0 item(s) from z6Mkt67GdsW7715MEfRuP4pSZxJRJh6kj6Y48WRqVv4N1tRk (t=1788930636134)
1788930636 z6MknSLrJoTcukLrE435hVNQT4JUhbvWLX4kUzqkEStBU8Vi <service> service: Stored announcement from z6Mkt67GdsW7715MEfRuP4pSZxJRJh6kj6Y48WRqVv4N1tRk to be broadcast in 0 millisecond(s) (t=1788930636134)
1788930636 z6Mkt67GdsW7715MEfRuP4pSZxJRJh6kj6Y48WRqVv4N1tRk <service> service: Stored announcement from z6MknSLrJoTcukLrE435hVNQT4JUhbvWLX4kUzqkEStBU8Vi to be broadcast in 0 millisecond(s) (t=1788930636121)
1788930636 z6MknSLrJoTcukLrE435hVNQT4JUhbvWLX4kUzqkEStBU8Vi <service> service: Received subscription filter from z6Mkt67GdsW7715MEfRuP4pSZxJRJh6kj6Y48WRqVv4N1tRk
1788930636 z6Mkt67GdsW7715MEfRuP4pSZxJRJh6kj6Y48WRqVv4N1tRk <service> service: Routing table updated for rad:z42hL2jL4XNk6K8oHQaSWfMgCL7ji with seed z6MknSLrJoTcukLrE435hVNQT4JUhbvWLX4kUzqkEStBU8Vi
1788930636 z6Mkt67GdsW7715MEfRuP4pSZxJRJh6kj6Y48WRqVv4N1tRk <service> service: Received subscription filter from z6MknSLrJoTcukLrE435hVNQT4JUhbvWLX4kUzqkEStBU8Vi
1788930636 test: Node z6MknSLrJoTcukLrE435hVNQT4JUhbvWLX4kUzqkEStBU8Vi has converged
1788930636 test: Node z6Mkt67GdsW7715MEfRuP4pSZxJRJh6kj6Y48WRqVv4N1tRk has converged
1788930636 test: rad-clone:5: `rad clone rad:z42hL2jL4XNk6K8oHQaSWfMgCL7ji` @ /tmp/.tmpyzxzv7/bob/work
1788930636 z6Mkt67GdsW7715MEfRuP4pSZxJRJh6kj6Y48WRqVv4N1tRk <control> control: Received `{"command":"status"}` on control socket
1788930636 z6Mkt67GdsW7715MEfRuP4pSZxJRJh6kj6Y48WRqVv4N1tRk <control> control: Received `{"command":"seed","rid":"rad:z42hL2jL4XNk6K8oHQaSWfMgCL7ji","scope":"followed"}` on control socket
1788930636 z6Mkt67GdsW7715MEfRuP4pSZxJRJh6kj6Y48WRqVv4N1tRk <service> service: Received command Seed(rad:z42hL2jL4XNk6K8oHQaSWfMgCL7ji, followed)
1788930636 z6Mkt67GdsW7715MEfRuP4pSZxJRJh6kj6Y48WRqVv4N1tRk <service> service: Sending subscription filter to z6MknSLrJoTcukLrE435hVNQT4JUhbvWLX4kUzqkEStBU8Vi
1788930636 z6MknSLrJoTcukLrE435hVNQT4JUhbvWLX4kUzqkEStBU8Vi <service> service: Received subscription filter from z6Mkt67GdsW7715MEfRuP4pSZxJRJh6kj6Y48WRqVv4N1tRk
1788930636 z6Mkt67GdsW7715MEfRuP4pSZxJRJh6kj6Y48WRqVv4N1tRk <control> control: Received `{"command":"seedsFor","rid":"rad:z42hL2jL4XNk6K8oHQaSWfMgCL7ji","namespaces":["z6Mkt67GdsW7715MEfRuP4pSZxJRJh6kj6Y48WRqVv4N1tRk"]}` on control socket
1788930636 z6Mkt67GdsW7715MEfRuP4pSZxJRJh6kj6Y48WRqVv4N1tRk <service> service: Received command Seeds(rad:z42hL2jL4XNk6K8oHQaSWfMgCL7ji)
1788930636 z6Mkt67GdsW7715MEfRuP4pSZxJRJh6kj6Y48WRqVv4N1tRk <service> service: Found 1 connected seed(s) and 0 disconnected seed(s) for rad:z42hL2jL4XNk6K8oHQaSWfMgCL7ji
1788930636 z6Mkt67GdsW7715MEfRuP4pSZxJRJh6kj6Y48WRqVv4N1tRk <control> control: Received `{"command":"session","nid":"z6MknSLrJoTcukLrE435hVNQT4JUhbvWLX4kUzqkEStBU8Vi"}` on control socket
1788930636 z6Mkt67GdsW7715MEfRuP4pSZxJRJh6kj6Y48WRqVv4N1tRk <service> service: Received command QueryState(..)
1788930636 z6Mkt67GdsW7715MEfRuP4pSZxJRJh6kj6Y48WRqVv4N1tRk <control> control: Received `{"command":"fetch","rid":"rad:z42hL2jL4XNk6K8oHQaSWfMgCL7ji","nid":"z6MknSLrJoTcukLrE435hVNQT4JUhbvWLX4kUzqkEStBU8Vi","timeout":{"secs":9,"nanos":0},"signedReferencesMinimumFeatureLevel":null}` on control socket
1788930636 z6Mkt67GdsW7715MEfRuP4pSZxJRJh6kj6Y48WRqVv4N1tRk <service> service: Received command Fetch(rad:z42hL2jL4XNk6K8oHQaSWfMgCL7ji, z6MknSLrJoTcukLrE435hVNQT4JUhbvWLX4kUzqkEStBU8Vi)
1788930636 z6Mkt67GdsW7715MEfRuP4pSZxJRJh6kj6Y48WRqVv4N1tRk <service> service: Starting fetch for rad:z42hL2jL4XNk6K8oHQaSWfMgCL7ji from z6MknSLrJoTcukLrE435hVNQT4JUhbvWLX4kUzqkEStBU8Vi
1788930636 z6Mkt67GdsW7715MEfRuP4pSZxJRJh6kj6Y48WRqVv4N1tRk <service> service: Fetch initiated for rad:z42hL2jL4XNk6K8oHQaSWfMgCL7ji with z6MknSLrJoTcukLrE435hVNQT4JUhbvWLX4kUzqkEStBU8Vi [outbound connected] (all remotes)..
1788930636 z6Mkt67GdsW7715MEfRuP4pSZxJRJh6kj6Y48WRqVv4N1tRk <service> wire: Opened new stream with id 12 for rad:z42hL2jL4XNk6K8oHQaSWfMgCL7ji and remote z6MknSLrJoTcukLrE435hVNQT4JUhbvWLX4kUzqkEStBU8Vi
1788930636 z6Mkt67GdsW7715MEfRuP4pSZxJRJh6kj6Y48WRqVv4N1tRk <worker#0> worker: Worker processing outgoing fetch for rad:z42hL2jL4XNk6K8oHQaSWfMgCL7ji
1788930636 z6MknSLrJoTcukLrE435hVNQT4JUhbvWLX4kUzqkEStBU8Vi <service> wire: Received `open` command for stream 12 from z6Mkt67GdsW7715MEfRuP4pSZxJRJh6kj6Y48WRqVv4N1tRk
1788930636 z6MknSLrJoTcukLrE435hVNQT4JUhbvWLX4kUzqkEStBU8Vi <worker#0> worker: Worker processing incoming fetch for z6Mkt67GdsW7715MEfRuP4pSZxJRJh6kj6Y48WRqVv4N1tRk on stream 12..
1788930636 z6Mkt67GdsW7715MEfRuP4pSZxJRJh6kj6Y48WRqVv4N1tRk <worker#0> worker: z6Mkt67GdsW7715MEfRuP4pSZxJRJh6kj6Y48WRqVv4N1tRk cloning from z6MknSLrJoTcukLrE435hVNQT4JUhbvWLX4kUzqkEStBU8Vi
1788930636 z6MknSLrJoTcukLrE435hVNQT4JUhbvWLX4kUzqkEStBU8Vi <worker#0> worker: Spawning upload-pack process for rad:z42hL2jL4XNk6K8oHQaSWfMgCL7ji on stream 12..
1788930636 z6Mkt67GdsW7715MEfRuP4pSZxJRJh6kj6Y48WRqVv4N1tRk <worker#0> radicle_fetch::state: Fetched rad/id (4ms)
1788930636 z6Mkt67GdsW7715MEfRuP4pSZxJRJh6kj6Y48WRqVv4N1tRk <worker#0> radicle_fetch::state: Fetched data for 1 remote(s) (9ms)
1788930636 z6Mkt67GdsW7715MEfRuP4pSZxJRJh6kj6Y48WRqVv4N1tRk <worker#0> radicle_fetch::state: Fetched data refs for 0 remotes (12ms)
1788930636 z6Mkt67GdsW7715MEfRuP4pSZxJRJh6kj6Y48WRqVv4N1tRk <worker#0> radicle_fetch::state: Sent done signal to remote z6MknSLrJoTcukLrE435hVNQT4JUhbvWLX4kUzqkEStBU8Vi
1788930636 z6Mkt67GdsW7715MEfRuP4pSZxJRJh6kj6Y48WRqVv4N1tRk <worker#0> radicle_fetch::state: Validated 1 remote(s) (12ms)
1788930636 z6MknSLrJoTcukLrE435hVNQT4JUhbvWLX4kUzqkEStBU8Vi <service> wire: Received `end-of-file` on stream 12 from z6Mkt67GdsW7715MEfRuP4pSZxJRJh6kj6Y48WRqVv4N1tRk
1788930636 z6MknSLrJoTcukLrE435hVNQT4JUhbvWLX4kUzqkEStBU8Vi <upload-pack> worker: Exiting upload-pack reader thread for rad:z42hL2jL4XNk6K8oHQaSWfMgCL7ji
1788930636 z6Mkt67GdsW7715MEfRuP4pSZxJRJh6kj6Y48WRqVv4N1tRk <worker#0> radicle_fetch::state: Applied updates (13ms)
1788930636 z6MknSLrJoTcukLrE435hVNQT4JUhbvWLX4kUzqkEStBU8Vi <worker#0> worker: Upload pack finished (15ms)
1788930636 z6MknSLrJoTcukLrE435hVNQT4JUhbvWLX4kUzqkEStBU8Vi <worker#0> worker: Upload process on stream 12 exited with result Ok(())
1788930636 z6Mkt67GdsW7715MEfRuP4pSZxJRJh6kj6Y48WRqVv4N1tRk <worker#0> radicle_fetch: Finished clone of rad:z42hL2jL4XNk6K8oHQaSWfMgCL7ji from z6MknSLrJoTcukLrE435hVNQT4JUhbvWLX4kUzqkEStBU8Vi (16ms)
1788930636 z6MknSLrJoTcukLrE435hVNQT4JUhbvWLX4kUzqkEStBU8Vi <service> wire: Stream 12 of z6Mkt67GdsW7715MEfRuP4pSZxJRJh6kj6Y48WRqVv4N1tRk closing with 0 byte(s) sent and 0 byte(s) received
1788930636 z6MknSLrJoTcukLrE435hVNQT4JUhbvWLX4kUzqkEStBU8Vi <service> wire: Peer z6Mkt67GdsW7715MEfRuP4pSZxJRJh6kj6Y48WRqVv4N1tRk fetched rad:z42hL2jL4XNk6K8oHQaSWfMgCL7ji from us successfully
1788930636 z6Mkt67GdsW7715MEfRuP4pSZxJRJh6kj6Y48WRqVv4N1tRk <service> wire: Received `close` command for stream 12 from z6MknSLrJoTcukLrE435hVNQT4JUhbvWLX4kUzqkEStBU8Vi
1788930636 z6Mkt67GdsW7715MEfRuP4pSZxJRJh6kj6Y48WRqVv4N1tRk <service> wire: Stream 12 of z6MknSLrJoTcukLrE435hVNQT4JUhbvWLX4kUzqkEStBU8Vi closed with 0 byte(s) sent and 0 byte(s) received
1788930636 z6Mkt67GdsW7715MEfRuP4pSZxJRJh6kj6Y48WRqVv4N1tRk <worker#0> storage: Obtained identity COB root commit '0656c217f917c3e06234771e9ecae53aba5e173e' via reference 'refs/rad/root' in namespace of founder 'did:key:z6MknSLrJoTcukLrE435hVNQT4JUhbvWLX4kUzqkEStBU8Vi' of identity document 'rad:z42hL2jL4XNk6K8oHQaSWfMgCL7ji'.
1788930636 z6Mkt67GdsW7715MEfRuP4pSZxJRJh6kj6Y48WRqVv4N1tRk <worker#0> cob: Loading object of type xyz.radicle.id at 0656c217f917c3e06234771e9ecae53aba5e173e.
1788930636 z6Mkt67GdsW7715MEfRuP4pSZxJRJh6kj6Y48WRqVv4N1tRk <worker#0> storage: Setting ref: refs/rad/id -> 0656c217f917c3e06234771e9ecae53aba5e173e
1788930636 z6Mkt67GdsW7715MEfRuP4pSZxJRJh6kj6Y48WRqVv4N1tRk <worker#0> cob: Loading object of type xyz.radicle.id at 0656c217f917c3e06234771e9ecae53aba5e173e.
1788930636 z6Mkt67GdsW7715MEfRuP4pSZxJRJh6kj6Y48WRqVv4N1tRk <service> service: Fetched rad:z42hL2jL4XNk6K8oHQaSWfMgCL7ji from z6MknSLrJoTcukLrE435hVNQT4JUhbvWLX4kUzqkEStBU8Vi successfully
1788930636 z6Mkt67GdsW7715MEfRuP4pSZxJRJh6kj6Y48WRqVv4N1tRk <service> service: Ref updated: * 0000000..0656c21 refs/namespaces/z6MknSLrJoTcukLrE435hVNQT4JUhbvWLX4kUzqkEStBU8Vi/refs/rad/id for rad:z42hL2jL4XNk6K8oHQaSWfMgCL7ji
1788930636 z6Mkt67GdsW7715MEfRuP4pSZxJRJh6kj6Y48WRqVv4N1tRk <service> service: Ref updated: * 0000000..55be805 refs/namespaces/z6MknSLrJoTcukLrE435hVNQT4JUhbvWLX4kUzqkEStBU8Vi/refs/rad/sigrefs for rad:z42hL2jL4XNk6K8oHQaSWfMgCL7ji
1788930636 z6Mkt67GdsW7715MEfRuP4pSZxJRJh6kj6Y48WRqVv4N1tRk <service> service: Ref updated: * 0000000..0656c21 refs/namespaces/z6MknSLrJoTcukLrE435hVNQT4JUhbvWLX4kUzqkEStBU8Vi/refs/cobs/xyz.radicle.id/0656c217f917c3e06234771e9ecae53aba5e173e for rad:z42hL2jL4XNk6K8oHQaSWfMgCL7ji
1788930636 z6Mkt67GdsW7715MEfRuP4pSZxJRJh6kj6Y48WRqVv4N1tRk <service> service: Ref updated: * 0000000..f2de534 refs/namespaces/z6MknSLrJoTcukLrE435hVNQT4JUhbvWLX4kUzqkEStBU8Vi/refs/heads/master for rad:z42hL2jL4XNk6K8oHQaSWfMgCL7ji
1788930636 z6Mkt67GdsW7715MEfRuP4pSZxJRJh6kj6Y48WRqVv4N1tRk <service> service: Ref updated: * 0000000..0656c21 refs/namespaces/z6MknSLrJoTcukLrE435hVNQT4JUhbvWLX4kUzqkEStBU8Vi/refs/rad/root for rad:z42hL2jL4XNk6K8oHQaSWfMgCL7ji
1788930636 z6Mkt67GdsW7715MEfRuP4pSZxJRJh6kj6Y48WRqVv4N1tRk <service> service: Updating and announcing inventory for cloned repository rad:z42hL2jL4XNk6K8oHQaSWfMgCL7ji..
1788930636 z6Mkt67GdsW7715MEfRuP4pSZxJRJh6kj6Y48WRqVv4N1tRk <service> service: Sending inventory announcement of z6Mkt67GdsW7715MEfRuP4pSZxJRJh6kj6Y48WRqVv4N1tRk with 1 item(s) to z6MknSLrJoTcukLrE435hVNQT4JUhbvWLX4kUzqkEStBU8Vi (t=1788930636293)
1788930636 z6Mkt67GdsW7715MEfRuP4pSZxJRJh6kj6Y48WRqVv4N1tRk <service> service: Sending refs announcement of z6Mkt67GdsW7715MEfRuP4pSZxJRJh6kj6Y48WRqVv4N1tRk for rad:z42hL2jL4XNk6K8oHQaSWfMgCL7ji with 1 remote(s) to z6MknSLrJoTcukLrE435hVNQT4JUhbvWLX4kUzqkEStBU8Vi (t=1788930636294)
1788930636 z6MknSLrJoTcukLrE435hVNQT4JUhbvWLX4kUzqkEStBU8Vi <service> service: Received inventory announcement of z6Mkt67GdsW7715MEfRuP4pSZxJRJh6kj6Y48WRqVv4N1tRk with 1 item(s) from z6Mkt67GdsW7715MEfRuP4pSZxJRJh6kj6Y48WRqVv4N1tRk (t=1788930636293)
1788930636 z6MknSLrJoTcukLrE435hVNQT4JUhbvWLX4kUzqkEStBU8Vi <service> service: Stored announcement from z6Mkt67GdsW7715MEfRuP4pSZxJRJh6kj6Y48WRqVv4N1tRk to be broadcast in 0 millisecond(s) (t=1788930636293)
1788930636 z6MknSLrJoTcukLrE435hVNQT4JUhbvWLX4kUzqkEStBU8Vi <service> service: Routing table updated for rad:z42hL2jL4XNk6K8oHQaSWfMgCL7ji with seed z6Mkt67GdsW7715MEfRuP4pSZxJRJh6kj6Y48WRqVv4N1tRk
1788930636 z6MknSLrJoTcukLrE435hVNQT4JUhbvWLX4kUzqkEStBU8Vi <service> service: Received refs announcement of z6Mkt67GdsW7715MEfRuP4pSZxJRJh6kj6Y48WRqVv4N1tRk for rad:z42hL2jL4XNk6K8oHQaSWfMgCL7ji with 1 remote(s) from z6Mkt67GdsW7715MEfRuP4pSZxJRJh6kj6Y48WRqVv4N1tRk (t=1788930636294)
1788930636 z6MknSLrJoTcukLrE435hVNQT4JUhbvWLX4kUzqkEStBU8Vi <service> service: Stored announcement from z6Mkt67GdsW7715MEfRuP4pSZxJRJh6kj6Y48WRqVv4N1tRk to be broadcast in 0 millisecond(s) (t=1788930636294)
1788930636 z6MknSLrJoTcukLrE435hVNQT4JUhbvWLX4kUzqkEStBU8Vi <service> service: Refs announcement of z6Mkt67GdsW7715MEfRuP4pSZxJRJh6kj6Y48WRqVv4N1tRk for rad:z42hL2jL4XNk6K8oHQaSWfMgCL7ji contains our own remote at 55be80540a7e9f10478fbc846913f2a6a19abe1d (t=1788930636294)
1788930636 z6MknSLrJoTcukLrE435hVNQT4JUhbvWLX4kUzqkEStBU8Vi <service> service: Updating sync status of z6Mkt67GdsW7715MEfRuP4pSZxJRJh6kj6Y48WRqVv4N1tRk for rad:z42hL2jL4XNk6K8oHQaSWfMgCL7ji to 55be80540a7e9f10478fbc846913f2a6a19abe1d
1788930636 z6MknSLrJoTcukLrE435hVNQT4JUhbvWLX4kUzqkEStBU8Vi <service> service: Skipping fetch for rad:z42hL2jL4XNk6K8oHQaSWfMgCL7ji, all refs are already in storage
1788930636 test: rad-clone:25: `cd /tmp/.tmpyzxzv7/bob/work/heartwood`..
1788930636 test: rad-clone:26: `ls ` @ /tmp/.tmpyzxzv7/bob/work/heartwood
1788930636 test: rad-clone:28: `cat README` @ /tmp/.tmpyzxzv7/bob/work/heartwood
1788930636 test: rad-clone:30: `git status` @ /tmp/.tmpyzxzv7/bob/work/heartwood
1788930636 test: rad-clone:40: `git branch --remotes` @ /tmp/.tmpyzxzv7/bob/work/heartwood
1788930636 test: rad-clone:49: `git remote -v` @ /tmp/.tmpyzxzv7/bob/work/heartwood
1788930636 test: rad-clone:59: `git log -n 1` @ /tmp/.tmpyzxzv7/bob/work/heartwood
1788930636 test: rad-clone:69: `rad ls --seeded` @ /tmp/.tmpyzxzv7/bob/work/heartwood
1788930636 test: git-push:2: `git checkout -b alice/1` @ /tmp/.tmpyzxzv7/alice/work
1788930636 test: git-push:3: `git commit -m Alice's commit --allow-empty -s` @ /tmp/.tmpyzxzv7/alice/work
1788930636 test: git-push:8: `git push rad HEAD:alice/1` @ /tmp/.tmpyzxzv7/alice/work
1788930636 test: git-push:16: `git commit --amend -m Alice's amended commit --allow-empty -s` @ /tmp/.tmpyzxzv7/alice/work
1788930636 test: git-push:19: `git push rad HEAD:alice/1` @ /tmp/.tmpyzxzv7/alice/work
1788930636 test: git-push:32: `git push -o no-sync rad +HEAD:alice/1` @ /tmp/.tmpyzxzv7/alice/work
1788930636 test: git-push:40: `git branch -r -vv` @ /tmp/.tmpyzxzv7/alice/work
1788930636 test: git-push:48: `git ls-remote rad://z42hL2jL4XNk6K8oHQaSWfMgCL7ji/z6MknSLrJoTcukLrE435hVNQT4JUhbvWLX4kUzqkEStBU8Vi refs/heads/*` @ /tmp/.tmpyzxzv7/alice/work
1788930636 test: git-push:56: `git ls-remote rad` @ /tmp/.tmpyzxzv7/alice/work
1788930636 test: git-push:62: `rad sync --announce` @ /tmp/.tmpyzxzv7/alice/work
1788930636 z6MknSLrJoTcukLrE435hVNQT4JUhbvWLX4kUzqkEStBU8Vi <control> control: Received `{"command":"status"}` on control socket
1788930636 z6MknSLrJoTcukLrE435hVNQT4JUhbvWLX4kUzqkEStBU8Vi <control> control: Received `{"command":"seedsFor","rid":"rad:z42hL2jL4XNk6K8oHQaSWfMgCL7ji","namespaces":["z6MknSLrJoTcukLrE435hVNQT4JUhbvWLX4kUzqkEStBU8Vi"]}` on control socket
1788930636 z6MknSLrJoTcukLrE435hVNQT4JUhbvWLX4kUzqkEStBU8Vi <service> service: Received command Seeds(rad:z42hL2jL4XNk6K8oHQaSWfMgCL7ji)
1788930636 z6MknSLrJoTcukLrE435hVNQT4JUhbvWLX4kUzqkEStBU8Vi <service> service: Found 1 connected seed(s) and 1 disconnected seed(s) for rad:z42hL2jL4XNk6K8oHQaSWfMgCL7ji
1788930636 z6MknSLrJoTcukLrE435hVNQT4JUhbvWLX4kUzqkEStBU8Vi <control> control: Received `{"command":"subscribe"}` on control socket
1788930636 z6MknSLrJoTcukLrE435hVNQT4JUhbvWLX4kUzqkEStBU8Vi <control> control: Received `{"command":"announceRefsFor","rid":"rad:z42hL2jL4XNk6K8oHQaSWfMgCL7ji","namespaces":["z6MknSLrJoTcukLrE435hVNQT4JUhbvWLX4kUzqkEStBU8Vi"]}` on control socket
1788930636 z6MknSLrJoTcukLrE435hVNQT4JUhbvWLX4kUzqkEStBU8Vi <service> service: Received command AnnounceRefs(rad:z42hL2jL4XNk6K8oHQaSWfMgCL7ji)
1788930636 z6MknSLrJoTcukLrE435hVNQT4JUhbvWLX4kUzqkEStBU8Vi <service> service: Announcing refs rad:z42hL2jL4XNk6K8oHQaSWfMgCL7ji/z6MknSLrJoTcukLrE435hVNQT4JUhbvWLX4kUzqkEStBU8Vi @ 16651be0b4e2f69fdafb27d29c12844578159d61 to peers (t=1788930636665)..
1788930636 z6MknSLrJoTcukLrE435hVNQT4JUhbvWLX4kUzqkEStBU8Vi <service> service: Saved local sync status for rad:z42hL2jL4XNk6K8oHQaSWfMgCL7ji..
1788930636 z6MknSLrJoTcukLrE435hVNQT4JUhbvWLX4kUzqkEStBU8Vi <service> service: Sending refs announcement of z6MknSLrJoTcukLrE435hVNQT4JUhbvWLX4kUzqkEStBU8Vi for rad:z42hL2jL4XNk6K8oHQaSWfMgCL7ji with 1 remote(s) to z6Mkt67GdsW7715MEfRuP4pSZxJRJh6kj6Y48WRqVv4N1tRk (t=1788930636665)
1788930636 z6Mkt67GdsW7715MEfRuP4pSZxJRJh6kj6Y48WRqVv4N1tRk <service> service: Received refs announcement of z6MknSLrJoTcukLrE435hVNQT4JUhbvWLX4kUzqkEStBU8Vi for rad:z42hL2jL4XNk6K8oHQaSWfMgCL7ji with 1 remote(s) from z6MknSLrJoTcukLrE435hVNQT4JUhbvWLX4kUzqkEStBU8Vi (t=1788930636665)
1788930636 z6Mkt67GdsW7715MEfRuP4pSZxJRJh6kj6Y48WRqVv4N1tRk <service> service: Stored announcement from z6MknSLrJoTcukLrE435hVNQT4JUhbvWLX4kUzqkEStBU8Vi to be broadcast in 0 millisecond(s) (t=1788930636665)
1788930636 z6Mkt67GdsW7715MEfRuP4pSZxJRJh6kj6Y48WRqVv4N1tRk <service> service: Starting fetch for rad:z42hL2jL4XNk6K8oHQaSWfMgCL7ji from z6MknSLrJoTcukLrE435hVNQT4JUhbvWLX4kUzqkEStBU8Vi
1788930636 z6Mkt67GdsW7715MEfRuP4pSZxJRJh6kj6Y48WRqVv4N1tRk <service> service: Fetch initiated for rad:z42hL2jL4XNk6K8oHQaSWfMgCL7ji with z6MknSLrJoTcukLrE435hVNQT4JUhbvWLX4kUzqkEStBU8Vi [outbound connected] (1 remote(s))..
1788930636 z6Mkt67GdsW7715MEfRuP4pSZxJRJh6kj6Y48WRqVv4N1tRk <service> wire: Opened new stream with id 20 for rad:z42hL2jL4XNk6K8oHQaSWfMgCL7ji and remote z6MknSLrJoTcukLrE435hVNQT4JUhbvWLX4kUzqkEStBU8Vi
1788930636 z6Mkt67GdsW7715MEfRuP4pSZxJRJh6kj6Y48WRqVv4N1tRk <worker#1> worker: Worker processing outgoing fetch for rad:z42hL2jL4XNk6K8oHQaSWfMgCL7ji
1788930636 z6Mkt67GdsW7715MEfRuP4pSZxJRJh6kj6Y48WRqVv4N1tRk <worker#1> worker: z6Mkt67GdsW7715MEfRuP4pSZxJRJh6kj6Y48WRqVv4N1tRk pulling from z6MknSLrJoTcukLrE435hVNQT4JUhbvWLX4kUzqkEStBU8Vi
1788930636 z6MknSLrJoTcukLrE435hVNQT4JUhbvWLX4kUzqkEStBU8Vi <service> wire: Received `open` command for stream 20 from z6Mkt67GdsW7715MEfRuP4pSZxJRJh6kj6Y48WRqVv4N1tRk
1788930636 z6MknSLrJoTcukLrE435hVNQT4JUhbvWLX4kUzqkEStBU8Vi <worker#1> worker: Worker processing incoming fetch for z6Mkt67GdsW7715MEfRuP4pSZxJRJh6kj6Y48WRqVv4N1tRk on stream 20..
1788930636 z6MknSLrJoTcukLrE435hVNQT4JUhbvWLX4kUzqkEStBU8Vi <worker#1> worker: Spawning upload-pack process for rad:z42hL2jL4XNk6K8oHQaSWfMgCL7ji on stream 20..
1788930636 z6Mkt67GdsW7715MEfRuP4pSZxJRJh6kj6Y48WRqVv4N1tRk <worker#1> radicle_fetch::state: Fetched rad/id (0ms)
1788930636 z6Mkt67GdsW7715MEfRuP4pSZxJRJh6kj6Y48WRqVv4N1tRk <worker#1> radicle_fetch::state: Fetched data for 1 remote(s) (7ms)
1788930636 z6Mkt67GdsW7715MEfRuP4pSZxJRJh6kj6Y48WRqVv4N1tRk <worker#1> radicle_fetch::state: Fetched data refs for 0 remotes (10ms)
1788930636 z6Mkt67GdsW7715MEfRuP4pSZxJRJh6kj6Y48WRqVv4N1tRk <worker#1> radicle_fetch::state: Sent done signal to remote z6MknSLrJoTcukLrE435hVNQT4JUhbvWLX4kUzqkEStBU8Vi
1788930636 z6MknSLrJoTcukLrE435hVNQT4JUhbvWLX4kUzqkEStBU8Vi <service> wire: Received `end-of-file` on stream 20 from z6Mkt67GdsW7715MEfRuP4pSZxJRJh6kj6Y48WRqVv4N1tRk
1788930636 z6MknSLrJoTcukLrE435hVNQT4JUhbvWLX4kUzqkEStBU8Vi <upload-pack> worker: Exiting upload-pack reader thread for rad:z42hL2jL4XNk6K8oHQaSWfMgCL7ji
1788930636 z6MknSLrJoTcukLrE435hVNQT4JUhbvWLX4kUzqkEStBU8Vi <worker#1> worker: Upload pack finished (15ms)
1788930636 z6MknSLrJoTcukLrE435hVNQT4JUhbvWLX4kUzqkEStBU8Vi <worker#1> worker: Upload process on stream 20 exited with result Ok(())
1788930636 z6MknSLrJoTcukLrE435hVNQT4JUhbvWLX4kUzqkEStBU8Vi <service> wire: Stream 20 of z6Mkt67GdsW7715MEfRuP4pSZxJRJh6kj6Y48WRqVv4N1tRk closing with 0 byte(s) sent and 0 byte(s) received
1788930636 z6MknSLrJoTcukLrE435hVNQT4JUhbvWLX4kUzqkEStBU8Vi <service> wire: Peer z6Mkt67GdsW7715MEfRuP4pSZxJRJh6kj6Y48WRqVv4N1tRk fetched rad:z42hL2jL4XNk6K8oHQaSWfMgCL7ji from us successfully
1788930636 z6Mkt67GdsW7715MEfRuP4pSZxJRJh6kj6Y48WRqVv4N1tRk <worker#1> radicle_fetch::state: Validated 1 remote(s) (11ms)
1788930636 z6Mkt67GdsW7715MEfRuP4pSZxJRJh6kj6Y48WRqVv4N1tRk <worker#1> radicle_fetch::state: Applied updates (11ms)
1788930636 z6Mkt67GdsW7715MEfRuP4pSZxJRJh6kj6Y48WRqVv4N1tRk <worker#1> radicle_fetch: Finished pull of rad:z42hL2jL4XNk6K8oHQaSWfMgCL7ji (19ms)
1788930636 z6Mkt67GdsW7715MEfRuP4pSZxJRJh6kj6Y48WRqVv4N1tRk <service> wire: Received `close` command for stream 20 from z6MknSLrJoTcukLrE435hVNQT4JUhbvWLX4kUzqkEStBU8Vi
1788930636 z6Mkt67GdsW7715MEfRuP4pSZxJRJh6kj6Y48WRqVv4N1tRk <service> wire: Stream 20 of z6MknSLrJoTcukLrE435hVNQT4JUhbvWLX4kUzqkEStBU8Vi closed with 0 byte(s) sent and 0 byte(s) received
1788930636 z6Mkt67GdsW7715MEfRuP4pSZxJRJh6kj6Y48WRqVv4N1tRk <worker#1> storage: Obtained identity COB root commit '0656c217f917c3e06234771e9ecae53aba5e173e' via reference 'refs/rad/root' in namespace of founder 'did:key:z6MknSLrJoTcukLrE435hVNQT4JUhbvWLX4kUzqkEStBU8Vi' of identity document 'rad:z42hL2jL4XNk6K8oHQaSWfMgCL7ji'.
1788930636 z6Mkt67GdsW7715MEfRuP4pSZxJRJh6kj6Y48WRqVv4N1tRk <worker#1> cob: Loading object of type xyz.radicle.id at 0656c217f917c3e06234771e9ecae53aba5e173e.
1788930636 z6Mkt67GdsW7715MEfRuP4pSZxJRJh6kj6Y48WRqVv4N1tRk <worker#1> storage: Setting ref: refs/rad/id -> 0656c217f917c3e06234771e9ecae53aba5e173e
1788930636 z6Mkt67GdsW7715MEfRuP4pSZxJRJh6kj6Y48WRqVv4N1tRk <worker#1> cob: Loading object of type xyz.radicle.id at 0656c217f917c3e06234771e9ecae53aba5e173e.
1788930636 z6Mkt67GdsW7715MEfRuP4pSZxJRJh6kj6Y48WRqVv4N1tRk <service> service: Fetched rad:z42hL2jL4XNk6K8oHQaSWfMgCL7ji from z6MknSLrJoTcukLrE435hVNQT4JUhbvWLX4kUzqkEStBU8Vi successfully
1788930636 z6Mkt67GdsW7715MEfRuP4pSZxJRJh6kj6Y48WRqVv4N1tRk <service> service: Ref updated: ~ 55be805..16651be refs/namespaces/z6MknSLrJoTcukLrE435hVNQT4JUhbvWLX4kUzqkEStBU8Vi/refs/rad/sigrefs for rad:z42hL2jL4XNk6K8oHQaSWfMgCL7ji
1788930636 z6Mkt67GdsW7715MEfRuP4pSZxJRJh6kj6Y48WRqVv4N1tRk <service> service: Ref updated: * 0000000..145e1e6 refs/namespaces/z6MknSLrJoTcukLrE435hVNQT4JUhbvWLX4kUzqkEStBU8Vi/refs/heads/alice/1 for rad:z42hL2jL4XNk6K8oHQaSWfMgCL7ji
1788930636 z6Mkt67GdsW7715MEfRuP4pSZxJRJh6kj6Y48WRqVv4N1tRk <service> service: Sending refs announcement of z6Mkt67GdsW7715MEfRuP4pSZxJRJh6kj6Y48WRqVv4N1tRk for rad:z42hL2jL4XNk6K8oHQaSWfMgCL7ji with 1 remote(s) to z6MknSLrJoTcukLrE435hVNQT4JUhbvWLX4kUzqkEStBU8Vi (t=1788930636692)
1788930636 z6MknSLrJoTcukLrE435hVNQT4JUhbvWLX4kUzqkEStBU8Vi <service> service: Received refs announcement of z6Mkt67GdsW7715MEfRuP4pSZxJRJh6kj6Y48WRqVv4N1tRk for rad:z42hL2jL4XNk6K8oHQaSWfMgCL7ji with 1 remote(s) from z6Mkt67GdsW7715MEfRuP4pSZxJRJh6kj6Y48WRqVv4N1tRk (t=1788930636692)
1788930636 z6MknSLrJoTcukLrE435hVNQT4JUhbvWLX4kUzqkEStBU8Vi <service> service: Stored announcement from z6Mkt67GdsW7715MEfRuP4pSZxJRJh6kj6Y48WRqVv4N1tRk to be broadcast in 0 millisecond(s) (t=1788930636692)
1788930636 z6MknSLrJoTcukLrE435hVNQT4JUhbvWLX4kUzqkEStBU8Vi <service> service: Refs announcement of z6Mkt67GdsW7715MEfRuP4pSZxJRJh6kj6Y48WRqVv4N1tRk for rad:z42hL2jL4XNk6K8oHQaSWfMgCL7ji contains our own remote at 16651be0b4e2f69fdafb27d29c12844578159d61 (t=1788930636692)
1788930636 z6MknSLrJoTcukLrE435hVNQT4JUhbvWLX4kUzqkEStBU8Vi <service> service: Updating sync status of z6Mkt67GdsW7715MEfRuP4pSZxJRJh6kj6Y48WRqVv4N1tRk for rad:z42hL2jL4XNk6K8oHQaSWfMgCL7ji to 16651be0b4e2f69fdafb27d29c12844578159d61
1788930636 z6MknSLrJoTcukLrE435hVNQT4JUhbvWLX4kUzqkEStBU8Vi <service> service: Skipping fetch for rad:z42hL2jL4XNk6K8oHQaSWfMgCL7ji, all refs are already in storage
1788930636 test: git-push:69: `git push rad :master` @ /tmp/.tmpyzxzv7/alice/work
1788930636 test: git-push:77: `git push -o alien rad HEAD:alice/2` @ /tmp/.tmpyzxzv7/alice/work
1788930636 test: git-push:84: `git commit -m Something good --allow-empty -s` @ /tmp/.tmpyzxzv7/alice/work
1788930636 test: git-push:88: `git push -o no-sync rad ddcc1f164eacfd7dba41da9bff3261da3ee79fd3:refs/heads/alice/2` @ /tmp/.tmpyzxzv7/alice/work
1788930636 test: git-fetch:2: `cd /tmp/.tmpyzxzv7/bob/work/heartwood`..
1788930636 test: git-fetch:3: `git branch -r` @ /tmp/.tmpyzxzv7/bob/work/heartwood
1788930636 test: git-fetch:9: `git ls-remote alice@z6MknSLrJoTcukLrE435hVNQT4JUhbvWLX4kUzqkEStBU8Vi refs/heads/*` @ /tmp/.tmpyzxzv7/bob/work/heartwood
1788930636 test: git-fetch:15: `git fetch alice@z6MknSLrJoTcukLrE435hVNQT4JUhbvWLX4kUzqkEStBU8Vi` @ /tmp/.tmpyzxzv7/bob/work/heartwood
1788930636 test: git-fetch:21: `git branch -r` @ /tmp/.tmpyzxzv7/bob/work/heartwood
thread 'commands::git::git_push_and_fetch' (27594) panicked at crates/radicle-cli-test/src/lib.rs:504:36:
[31m--- Expected[0m
[32m++++ actual: stdout[0m
[2m 1[0m [31m-[0m [31m alice@z6MknSLrJoTcukLrE435hVNQT4JUhbvWLX4kUzqkEStBU8Vi/HEAD -> alice@z6MknSLrJoTcukLrE435hVNQT4JUhbvWLX4kUzqkEStBU8Vi/master
[0m[2m 2[0m [2m 1[0m [2m|[0m [2m alice@z6MknSLrJoTcukLrE435hVNQT4JUhbvWLX4kUzqkEStBU8Vi/alice/1
[0m[2m 3[0m [2m 2[0m [2m|[0m [2m alice@z6MknSLrJoTcukLrE435hVNQT4JUhbvWLX4kUzqkEStBU8Vi/master
[0m[2m 4[0m [2m 3[0m [2m|[0m [2m rad/master
[0m
note: run with `RUST_BACKTRACE=1` environment variable to display a backtrace
1788930636 test: Node z6Mkt67GdsW7715MEfRuP4pSZxJRJh6kj6Y48WRqVv4N1tRk shutting down..
1788930636 commands::git::git_push_and_fetch reactor::controller: Initiating reactor shutdown…
1788930636 z6Mkt67GdsW7715MEfRuP4pSZxJRJh6kj6Y48WRqVv4N1tRk <service> reactor: Shutdown
1788930636 z6Mkt67GdsW7715MEfRuP4pSZxJRJh6kj6Y48WRqVv4N1tRk <control> control: Received `{"command":"shutdown"}` on control socket
1788930636 z6Mkt67GdsW7715MEfRuP4pSZxJRJh6kj6Y48WRqVv4N1tRk <control> control: Shutdown requested..
1788930636 z6Mkt67GdsW7715MEfRuP4pSZxJRJh6kj6Y48WRqVv4N1tRk <runtime> pool: Worker pool shutting down..
1788930636 z6Mkt67GdsW7715MEfRuP4pSZxJRJh6kj6Y48WRqVv4N1tRk <runtime> node: Node shutdown completed for z6Mkt67GdsW7715MEfRuP4pSZxJRJh6kj6Y48WRqVv4N1tRk
1788930636 test: Node z6MknSLrJoTcukLrE435hVNQT4JUhbvWLX4kUzqkEStBU8Vi shutting down..
1788930636 commands::git::git_push_and_fetch reactor::controller: Initiating reactor shutdown…
1788930636 z6MknSLrJoTcukLrE435hVNQT4JUhbvWLX4kUzqkEStBU8Vi <service> reactor: Shutdown
1788930636 z6MknSLrJoTcukLrE435hVNQT4JUhbvWLX4kUzqkEStBU8Vi <control> control: Received `{"command":"shutdown"}` on control socket
1788930636 z6MknSLrJoTcukLrE435hVNQT4JUhbvWLX4kUzqkEStBU8Vi <control> control: Shutdown requested..
1788930636 z6MknSLrJoTcukLrE435hVNQT4JUhbvWLX4kUzqkEStBU8Vi <runtime> pool: Worker pool shutting down..
1788930636 z6MknSLrJoTcukLrE435hVNQT4JUhbvWLX4kUzqkEStBU8Vi <runtime> node: Node shutdown completed for z6MknSLrJoTcukLrE435hVNQT4JUhbvWLX4kUzqkEStBU8Vi
failures:
commands::git::git_push_and_fetch
test result: FAILED. 122 passed; 1 failed; 3 ignored; 0 measured; 0 filtered out; finished in 75.94s
error: test failed, to rerun pass `-p radicle-cli --test commands`
Running unittests src/lib.rs (target/debug/deps/radicle_cli_test-abde74eb136ebe85)
running 3 tests
test tests::test_parse ... ok
test tests::test_run ... ok
test tests::test_example_spaced_brackets ... ok
test result: ok. 3 passed; 0 failed; 0 ignored; 0 measured; 0 filtered out; finished in 0.00s
Running unittests src/lib.rs (target/debug/deps/radicle_cob-9020a582e8a16531)
running 9 tests
test object::tests::test_serde ... ok
test tests::git::roundtrip ... ok
test tests::git::list_cobs ... ok
test tests::git::update_cob ... ok
test tests::invalid_parse_refstr ... ok
test type_name::test::invalid_typenames ... ok
test type_name::test::valid_typenames ... ok
test tests::git::traverse_cobs ... ok
test tests::parse_refstr ... ok
test result: ok. 9 passed; 0 failed; 0 ignored; 0 measured; 0 filtered out; finished in 0.01s
Running unittests src/lib.rs (target/debug/deps/radicle_core-c6d24468dd71b428)
running 4 tests
test repo::test::valid ... ok
test repo::test::invalid ... ok
test repo::test::assert_prop_roundtrip_parse ... ok
test repo::serde_impls::test::assert_prop_roundtrip_serde_json ... ok
test result: ok. 4 passed; 0 failed; 0 ignored; 0 measured; 0 filtered out; finished in 0.00s
Running unittests src/lib.rs (target/debug/deps/radicle_crypto-16f31f5bdb1e3f77)
running 12 tests
test ssh::agent::test::test_agent_encoding_remove ... ok
test ssh::agent::test::test_agent_encoding_sign ... ok
test ssh::fmt::test::test_key ... ok
test ssh::fmt::test::test_fingerprint ... ok
test ssh::keystore::tests::test_init_no_passphrase ... ok
test tests::did_key_sample ... ok
test tests::diffie_hellman_fixture ... ok
test tests::prop_encode_decode ... ok
test tests::prop_key_equality ... ok
test tests::diffie_hellman ... ok
test ssh::keystore::tests::test_signer ... ok
test ssh::keystore::tests::test_init_passphrase ... ok
test result: ok. 12 passed; 0 failed; 0 ignored; 0 measured; 0 filtered out; finished in 0.88s
Running unittests src/lib.rs (target/debug/deps/radicle_dag-b0910ecd42e75440)
running 20 tests
test tests::test_contains ... ok
test tests::test_cycle ... ok
test tests::test_diamond ... ok
test tests::test_fold_diamond ... ok
test tests::test_dependencies ... ok
test tests::test_fold_multiple_roots ... ok
test tests::test_fold_reject ... ok
test tests::test_fold_sorting_1 ... ok
test tests::test_fold_sorting_2 ... ok
test tests::test_get ... ok
test tests::test_is_empty ... ok
test tests::test_len ... ok
test tests::test_merge_1 ... ok
test tests::test_merge_2 ... ok
test tests::test_prune_1 ... ok
test tests::test_complex ... ok
test tests::test_prune_2 ... ok
test tests::test_prune_by_sorting ... ok
test tests::test_remove ... ok
test tests::test_siblings ... ok
test result: ok. 20 passed; 0 failed; 0 ignored; 0 measured; 0 filtered out; finished in 0.00s
Running unittests src/lib.rs (target/debug/deps/radicle_fetch-dd8aeb7ce9658ae1)
running 0 tests
test result: ok. 0 passed; 0 failed; 0 ignored; 0 measured; 0 filtered out; finished in 0.00s
Running unittests src/lib.rs (target/debug/deps/radicle_git_metadata-73a4cc73bbef2b23)
running 24 tests
test commit::parse::test::error::invalid_author ... ok
test commit::parse::test::error::invalid_parent ... ok
test commit::parse::test::error::invalid_format_continuation_without_preceding_header ... ok
test commit::parse::test::error::invalid_committer ... ok
test commit::parse::test::error::invalid_tree ... ok
test commit::parse::test::error::missing_author ... ok
test commit::parse::test::error::missing_committer ... ok
test commit::parse::test::error::missing_header_body_separator ... ok
test commit::parse::test::error::missing_tree_empty_header ... ok
test commit::parse::test::error::missing_tree_wrong_first_line ... ok
test commit::parse::test::success::commit_gpgsig_is_preserved_and_strip_removes_it ... ok
test commit::parse::test::success::commit_last_paragraph_kept_in_message_when_not_all_trailers ... ok
test commit::parse::test::success::commit_with_extra_headers ... ok
test commit::parse::test::success::merge_commit ... ok
test commit::parse::test::success::commit_with_trailers ... ok
test commit::parse::test::success::commit_with_multiline_gpgsig ... ok
test commit::parse::test::success::commit_with_single_parent ... ok
test commit::parse::test::success::root_commit ... ok
test commit::parse::test::success::roundtrip ... ok
test commit::parse::test::unit::body_last_paragraph_not_trailers_stays_in_message ... ok
test commit::parse::test::unit::trailers_accepts_empty_input ... ok
test commit::parse::test::unit::body_no_paragraph_separator_means_no_trailers ... ok
test commit::parse::test::unit::trailers_rejects_invalid_token_chars ... ok
test commit::parse::test::unit::trailers_rejects_line_without_separator ... ok
test result: ok. 24 passed; 0 failed; 0 ignored; 0 measured; 0 filtered out; finished in 0.00s
Running unittests src/lib.rs (target/debug/deps/radicle_git_ref_format-f8dbe786042836b5)
running 9 tests
test test::component_invalid - should panic ... ok
test test::pattern ... ok
test test::component ... ok
test test::qualified ... ok
test test::qualified_invalid - should panic ... ok
test test::qualified_pattern_invalid - should panic ... ok
test test::refname_invalid - should panic ... ok
test test::qualified_pattern ... ok
test test::refname ... ok
test result: ok. 9 passed; 0 failed; 0 ignored; 0 measured; 0 filtered out; finished in 0.00s
Running unittests src/lib.rs (target/debug/deps/radicle_localtime-9c62c7314f35ce4d)
running 1 test
test serde_impls::test::test_localtime ... ok
test result: ok. 1 passed; 0 failed; 0 ignored; 0 measured; 0 filtered out; finished in 0.00s
Running unittests src/lib.rs (target/debug/deps/radicle_log-fc4d87322da5fd7c)
running 0 tests
test result: ok. 0 passed; 0 failed; 0 ignored; 0 measured; 0 filtered out; finished in 0.00s
Running unittests src/lib.rs (target/debug/deps/radicle_node-98ddb810b5dd004d)
running 87 tests
test reactor::timer::tests::test_next ... ok
test reactor::timer::tests::test_wake ... ok
test control::tests::test_control_socket ... ok
test fingerprint::tests::matching ... ok
test reactor::timer::tests::test_wake_exact ... ok
test control::tests::test_seed_unseed ... ok
test tests::announcement_rebroadcast_timestamp_filtered ... ok
test tests::announcement_rebroadcast ... ok
test tests::announcement_rebroadcast_deduplicates ... ok
test tests::connection_kept_alive ... ok
test tests::disconnecting_unresponsive_peer ... ok
test tests::announcement_relay ... ok
test tests::e2e::clone_without_founder_namespace ... ok
test tests::e2e::fetch_does_not_contain_rad_sigrefs_parent ... ok
test tests::e2e::missing_default_branch ... ok
test tests::e2e::public_to_private_to_public_replay ... ok
test tests::e2e::test_block_active_connection ... ok
test tests::e2e::missing_delegate_default_branch ... ok
test tests::e2e::test_background_foreground_fetch ... ok
test tests::e2e::test_block_prevents_connection ... ok
test tests::e2e::test_block_prevents_fetch ... ok
test tests::e2e::test_channel_reader_limit ... ok
test tests::e2e::test_catchup_on_refs_announcements ... ok
test tests::e2e::test_clone ... ok
test tests::e2e::test_connection_crossing ... ok
test tests::e2e::test_dont_fetch_owned_refs ... ok
test tests::e2e::test_fetch_emits_canonical_ref_update_partial_glob ... ok
test tests::e2e::test_fetch_followed_remotes ... ok
test tests::e2e::test_concurrent_fetches ... ok
test tests::announcement_message_amplification ... ok
test tests::e2e::test_fetch_preserve_owned_refs ... ok
test tests::e2e::test_fetch_unseeded ... ok
test tests::e2e::test_fetch_up_to_date ... ok
test tests::e2e::test_inventory_sync_basic ... ok
test tests::e2e::test_fetch_emits_canonical_ref_update ... ok
test tests::e2e::test_large_fetch ... ok
test tests::e2e::test_migrated_clone ... ok
test tests::e2e::test_missing_remote ... ok
test tests::e2e::test_multiple_offline_inits ... ok
test tests::e2e::test_non_fast_forward_identity_doc ... ok
test tests::e2e::test_non_fast_forward_sigrefs ... ok
test tests::e2e::test_outdated_delegate_sigrefs ... ok
test tests::e2e::test_outdated_sigrefs ... ok
test tests::e2e::test_replication ... ok
test tests::e2e::test_replication_invalid ... ok
test tests::e2e::test_replication_ref_in_sigrefs ... ok
test tests::fetch_missing_inventory_on_gossip ... ok
test tests::fetch_missing_inventory_on_schedule ... ok
test tests::inbound_connection ... ok
test tests::e2e::test_inventory_sync_bridge ... ok
test tests::inventory_decode ... ok
test tests::init_and_seed ... ok
test tests::inventory_relay ... ok
test tests::e2e::test_inventory_sync_ring ... ok
test tests::inventory_relay_bad_timestamp ... ok
test tests::inventory_sync ... ok
test tests::e2e::test_inventory_sync_star ... ok
test tests::maintain_connections_failed_attempt ... ok
test tests::maintain_connections_same_second_loop ... ok
test tests::maintain_connections ... ok
test tests::maintain_connections_transient ... ok
test tests::orphaned_fetch_blocks_repo_from_all_nodes ... ok
test tests::outbound_connection ... ok
test tests::persistent_peer_connect ... ok
test tests::persistent_peer_reconnect_attempt ... ok
test tests::persistent_peer_reconnect_success ... ok
test tests::ping_response ... ok
test tests::queued_fetch_from_ann_same_rid ... ok
test tests::queued_fetch_from_command_same_rid ... ok
test tests::queued_fetch_max_capacity ... ok
test tests::redundant_connect ... ok
test tests::refs_announcement_fetch_trusted_no_inventory ... ok
test tests::refs_announcement_followed ... ok
test tests::inventory_pruning ... ok
test tests::refs_announcement_no_subscribe ... ok
test tests::refs_announcement_offline ... ok
test tests::refs_announcement_relay_private ... ok
test tests::refs_announcement_relay_public ... ok
test tests::refs_announcement_subscribe_private ... ok
test tests::seeding ... ok
test wire::test::test_inventory_ann_with_extension ... ok
test wire::test::test_pong_message_with_extension ... ok
test tests::seed_repo_subscribe ... ok
test tests::refs_synced_event ... ok
test wire::test::worker_result_clears_active_when_peer_connected ... ok
test wire::test::worker_result_clears_active_when_peer_disconnecting ... ok
test tests::prop_inventory_exchange_dense ... ok
test result: ok. 87 passed; 0 failed; 0 ignored; 0 measured; 0 filtered out; finished in 14.73s
Running unittests src/main.rs (target/debug/deps/radicle_node-8074b3a6398d4d03)
running 0 tests
test result: ok. 0 passed; 0 failed; 0 ignored; 0 measured; 0 filtered out; finished in 0.00s
Running unittests src/lib.rs (target/debug/deps/radicle_oid-902c7d6f046f549b)
running 10 tests
test fmt::test::fixture ... ok
test fmt::test::zero ... ok
test fmt::test::gix ... ok
test fmt::test::git2 ... ok
test git2::test::zero ... ok
test gix::test::zero ... ok
test str::test::fixture ... ok
test str::test::git2_roundtrip ... ok
test str::test::gix_roundtrip ... ok
test str::test::zero ... ok
test result: ok. 10 passed; 0 failed; 0 ignored; 0 measured; 0 filtered out; finished in 0.00s
Running unittests src/lib.rs (target/debug/deps/radicle_protocol-6023cd9aae38e420)
running 100 tests
test deserializer::test::test_unparsed ... ok
test deserializer::test::test_decode_next ... ok
test deserializer::test::prop_decode_next ... ok
test fetcher::service::tests::test_fetch_coalescing_different_refs ... ok
test fetcher::test::queue::properties::capacity::capacity_reached_returns_same_item ... ok
test fetcher::test::queue::properties::dequeue::drained_queue_returns_none ... ok
test fetcher::test::queue::properties::dequeue::empty_queue_returns_none ... ok
test fetcher::test::queue::properties::dequeue::enables_reenqueue ... ok
test fetcher::test::queue::properties::capacity::bounded ... ok
test fetcher::test::queue::properties::equality::reflexive ... ok
test fetcher::test::queue::properties::capacity::rejection ... ok
test fetcher::test::queue::properties::fifo::interleaved_operations ... ok
test fetcher::test::queue::properties::equality::symmetric ... ok
test fetcher::test::queue::properties::capacity::restored_after_dequeue ... ok
test fetcher::test::queue::properties::fifo::ordering ... ok
test fetcher::test::queue::properties::equality::transitive ... ok
test fetcher::test::queue::properties::merge::different_rid_accepted ... ok
test fetcher::test::queue::properties::merge::longer_timeout_preserved ... ok
test fetcher::test::queue::properties::merge::does_not_increase_queue_length ... ok
test fetcher::test::queue::properties::merge::succeed_when_at_capacity ... ok
test fetcher::test::queue::properties::merge::empty_refs_fetches_all ... ok
test fetcher::test::queue::properties::merge::combines_refs ... ok
test fetcher::test::queue::unit::capacity_takes_precedence_over_merge_for_new_items ... ok
test fetcher::test::queue::unit::empty_refs_items_can_be_equal ... ok
test fetcher::test::queue::unit::merge_preserves_position_in_queue ... ok
test fetcher::test::queue::unit::max_timeout_accepted ... ok
test fetcher::test::queue::unit::zero_timeout_accepted ... ok
test fetcher::test::state::command::cancel::non_existent_returns_unexpected ... ok
test fetcher::test::state::command::cancel::single_ongoing ... ok
test fetcher::test::state::command::cancel::cancellation_is_isolated ... ok
test fetcher::test::state::command::cancel::ongoing_and_queued ... ok
test fetcher::test::state::command::fetch::fetch_after_previous_completed ... ok
test fetcher::test::state::command::fetch::fetch_at_capacity_enqueues ... ok
test fetcher::test::state::command::fetch::fetch_duplicate_returns_already_fetching ... ok
test fetcher::test::state::command::fetch::fetch_different_repo_same_node_within_capacity ... ok
test fetcher::test::state::command::fetch::fetch_queue_merge_empty_refs_fetches_all ... ok
test fetcher::test::state::command::fetch::fetch_queue_merges_already_queued ... ok
test fetcher::test::state::command::fetch::fetch_queue_merge_takes_longer_timeout ... ok
test fetcher::test::state::command::fetch::fetch_queue_rejected_capacity_reached ... ok
test fetcher::test::state::command::fetch::fetch_same_repo_different_nodes_queues_second ... ok
test fetcher::test::state::command::fetch::fetch_same_repo_different_refs_enqueues ... ok
test fetcher::test::state::command::fetch::fetch_start_first_fetch_for_node ... ok
test fetcher::test::state::command::fetched::complete_one_of_multiple ... ok
test fetcher::test::state::command::fetched::complete_single_ongoing ... ok
test fetcher::test::state::command::fetched::non_existent_returns_not_found ... ok
test fetcher::test::state::command::fetched::complete_then_dequeue_fifo ... ok
test fetcher::test::state::concurrent::fetched_then_cancel ... ok
test fetcher::test::state::command::fetched::stale_from_does_not_clear_active ... ok
test fetcher::test::state::concurrent::interleaved_operations ... ok
test fetcher::test::state::config::min_queue_size ... ok
test fetcher::test::state::dequeue::empty_queue_returns_none ... ok
test fetcher::test::state::dequeue::cannot_dequeue_while_node_at_capacity ... ok
test fetcher::test::state::dequeue::maintains_fifo_order ... ok
test fetcher::test::state::invariant::queue_integrity_after_merge ... ok
test fetcher::test::state::config::high_concurrency ... ok
test fetcher::test::state::multinode::independent_queues ... ok
test service::filter::test::test_parameters ... ok
test service::filter::test::compatible ... ok
test service::gossip::store::test::test_announced ... ok
test service::filter::test::test_sizes ... ok
test service::limiter::test::test_limiter_different_rates ... ok
test service::limiter::test::test_limiter_refill ... ok
test service::limiter::test::test_limiter_multi ... ok
test fetcher::test::state::multinode::high_count ... ok
test service::message::tests::prop_refs_announcement_signing ... ok
test fetcher::test::queue::properties::merge::same_rid_merges_anywhere_in_queue ... ok
test wire::frame::test::test_encode_git_large ... ok
test wire::frame::test::test_stream_id ... ok
test service::message::tests::test_ref_remote_limit ... ok
test service::message::tests::test_inventory_limit ... ok
test wire::message::tests::prop_roundtrip_address ... ok
test wire::message::tests::prop_roundtrip_message ... ok
test wire::message::tests::test_inv_ann_max_size ... ok
test wire::message::tests::test_node_ann_max_size ... ok
test wire::message::tests::test_ping_encode_size_overflow - should panic ... ok
test wire::message::tests::test_pingpong_encode_max_size ... ok
test wire::message::tests::test_pong_encode_size_overflow - should panic ... ok
test wire::message::tests::prop_zero_bytes_encode_decode ... ok
test wire::tests::prop_oid ... ok
test wire::message::tests::test_refs_ann_max_size ... ok
test wire::tests::prop_roundtrip_filter ... ok
test wire::tests::prop_roundtrip_publickey ... ok
test wire::tests::prop_roundtrip_repoid ... ok
test wire::tests::prop_roundtrip_tuple ... ok
test wire::tests::prop_roundtrip_u16 ... ok
test wire::tests::prop_roundtrip_u32 ... ok
test wire::tests::prop_roundtrip_u64 ... ok
test wire::tests::prop_roundtrip_vec ... ok
test wire::tests::prop_roundtrip_refs ... ok
test wire::tests::prop_signature ... ok
test wire::tests::test_alias ... ok
test wire::tests::test_bounded_vec_limit ... ok
test wire::tests::prop_string ... ok
test wire::tests::test_string ... ok
test wire::varint::test::prop_roundtrip_varint ... ok
test wire::tests::test_filter_invalid ... ok
test wire::varint::test::test_encode_overflow - should panic ... ok
test wire::varint::test::test_encoding ... ok
test service::message::tests::test_node_announcement_validate ... ok
test wire::message::tests::prop_message_decoder ... ok
test result: ok. 100 passed; 0 failed; 0 ignored; 0 measured; 0 filtered out; finished in 0.37s
Running unittests src/main.rs (target/debug/deps/git_remote_rad-ad2e7fe2dac1e80f)
running 12 tests
test protocol::tests::test_capabilities ... ok
test protocol::tests::test_empty ... ok
test protocol::tests::test_fetch ... ok
test protocol::tests::test_fetch_whitespace ... ok
test protocol::tests::test_invalid ... ok
test protocol::tests::test_list ... ok
test protocol::tests::test_option_whitespace_preservation ... ok
test protocol::tests::test_list_for_push ... ok
test protocol::tests::test_option ... ok
test protocol::tests::test_push ... ok
test protocol::tests::test_push_delete ... ok
test protocol::tests::test_push_force ... ok
test result: ok. 12 passed; 0 failed; 0 ignored; 0 measured; 0 filtered out; finished in 0.00s
Running unittests src/main.rs (target/debug/deps/radicle_schemars-e2606e8600046214)
running 0 tests
test result: ok. 0 passed; 0 failed; 0 ignored; 0 measured; 0 filtered out; finished in 0.00s
Running unittests src/lib.rs (target/debug/deps/radicle_signals-89dc8d5b58cd3239)
running 0 tests
test result: ok. 0 passed; 0 failed; 0 ignored; 0 measured; 0 filtered out; finished in 0.00s
Running unittests src/lib.rs (target/debug/deps/radicle_surf-7eeab6538a1ee941)
running 41 tests
test test::code_browsing::test_commit_history ... ok
test test::code_browsing::browse_repo_lazily ... ok
test test::code_browsing::iterate_root_dir_recursive ... ok
test test::code_browsing::test_commit_signature ... ok
test test::diff::test_both_missing_eof_newline ... ok
test test::code_browsing::test_file_history ... ok
test test::diff::test_branch_diff ... ok
test test::diff::test_diff ... ok
test test::diff::test_diff_of_rev ... ok
test test::diff::test_initial_diff ... ok
test test::diff::test_new_missing_eof_newline ... ok
test test::diff::test_diff_file ... ok
test test::diff::test_none_missing_eof_newline ... ok
test test::diff::test_old_missing_eof_newline ... ok
test test::file_system::directory::directory_find_entry ... ok
test test::file_system::directory::directory_find_file_and_directory ... ok
test test::file_system::directory::directory_size ... ok
test test::file_system::directory::directory_last_commit ... ok
test test::last_commit::binary_file ... ok
test test::file_system::directory::file_last_commit ... ok
test test::last_commit::can_get_last_commit_for_special_filenames ... ok
test test::last_commit::nest_directory ... ok
test test::last_commit::folder_svelte ... ok
test test::last_commit::readme_missing_and_memory ... ok
test test::last_commit::root ... ok
test test::namespace::golden_namespace ... ok
test test::namespace::me_namespace ... ok
test test::namespace::switch_to_banana ... ok
test test::namespace::silver_namespace ... ok
test test::reference::test_branches ... ok
test test::rev::_master ... ok
test test::rev::commit ... ok
test test::reference::test_namespaces ... ok
test test::reference::test_tag_snapshot ... ok
test test::rev::commit_parents ... ok
test test::rev::commit_short ... ok
test test::rev::tag ... ok
test test::submodule::test_submodule_bare ... ignored, segfault
test test::threading::basic_test ... ok
test test::file_system::directory::directory_with_bracket_in_name ... ok
test test::submodule::test_submodule ... ok
test result: ok. 40 passed; 0 failed; 1 ignored; 0 measured; 0 filtered out; finished in 4.95s
Running unittests src/lib.rs (target/debug/deps/radicle_systemd-07432556807b819e)
running 0 tests
test result: ok. 0 passed; 0 failed; 0 ignored; 0 measured; 0 filtered out; finished in 0.00s
Running unittests src/lib.rs (target/debug/deps/radicle_term-48a9911d7b9aa22b)
running 22 tests
test ansi::tests::colors_disabled ... ok
test cell::test::test_width ... ok
test element::test::test_spaced ... ok
test ansi::tests::wrapping ... ok
test element::test::test_truncate ... ok
test ansi::tests::no_color_disables_colors_not_styles ... ok
test ansi::tests::colors_enabled ... ok
test element::test::test_width ... ok
test table::test::test_table ... ok
test table::test::test_table_truncate ... ok
test table::test::test_table_border_truncated ... ok
test table::test::test_table_border_maximized ... ok
test table::test::test_truncate ... ok
test table::test::test_table_unicode ... ok
test table::test::test_table_unicode_truncate ... ok
test table::test::test_table_border ... ok
test textarea::test::test_wrapping_code_block ... ok
test textarea::test::test_wrapping ... ok
test vstack::test::test_vstack ... ok
test textarea::test::test_wrapping_fenced_block ... ok
test textarea::test::test_wrapping_paragraphs ... ok
test vstack::test::test_vstack_maximize ... ok
test result: ok. 22 passed; 0 failed; 0 ignored; 0 measured; 0 filtered out; finished in 0.00s
Running unittests src/lib.rs (target/debug/deps/radicle_windows-76d8fb89c31a649a)
running 0 tests
test result: ok. 0 passed; 0 failed; 0 ignored; 0 measured; 0 filtered out; finished in 0.00s
Doc-tests radicle
running 1 test
test crates/radicle/src/cob/patch/encoding/review.rs - cob::patch::encoding::review::Review (line 23) ... ignored
test result: ok. 0 passed; 0 failed; 1 ignored; 0 measured; 0 filtered out; finished in 0.00s
Doc-tests radicle_cli
running 0 tests
test result: ok. 0 passed; 0 failed; 0 ignored; 0 measured; 0 filtered out; finished in 0.00s
Doc-tests radicle_cli_test
running 0 tests
test result: ok. 0 passed; 0 failed; 0 ignored; 0 measured; 0 filtered out; finished in 0.00s
Doc-tests radicle_cob
running 1 test
test crates/radicle-cob/src/backend/stable.rs - backend::stable::with_advanced_timestamp (line 56) ... ignored
test result: ok. 0 passed; 0 failed; 1 ignored; 0 measured; 0 filtered out; finished in 0.00s
all doctests ran in 0.09s; merged doctests compilation took 0.09s
Doc-tests radicle_core
running 0 tests
test result: ok. 0 passed; 0 failed; 0 ignored; 0 measured; 0 filtered out; finished in 0.00s
Doc-tests radicle_crypto
running 0 tests
test result: ok. 0 passed; 0 failed; 0 ignored; 0 measured; 0 filtered out; finished in 0.00s
Doc-tests radicle_dag
running 0 tests
test result: ok. 0 passed; 0 failed; 0 ignored; 0 measured; 0 filtered out; finished in 0.00s
Doc-tests radicle_fetch
running 0 tests
test result: ok. 0 passed; 0 failed; 0 ignored; 0 measured; 0 filtered out; finished in 0.00s
Doc-tests radicle_git_metadata
running 0 tests
test result: ok. 0 passed; 0 failed; 0 ignored; 0 measured; 0 filtered out; finished in 0.00s
Doc-tests radicle_git_ref_format
running 3 tests
test crates/radicle-git-ref-format/src/refspec.rs - refspec::NamespacedPattern (line 467) ... ok
test crates/radicle-git-ref-format/src/deriv.rs - deriv::Qualified<'a>::from_components (line 30) ... ok
test crates/radicle-git-ref-format/src/deriv.rs - deriv::Namespaced (line 279) ... ok
test result: ok. 3 passed; 0 failed; 0 ignored; 0 measured; 0 filtered out; finished in 0.00s
all doctests ran in 0.16s; merged doctests compilation took 0.15s
Doc-tests radicle_localtime
running 0 tests
test result: ok. 0 passed; 0 failed; 0 ignored; 0 measured; 0 filtered out; finished in 0.00s
Doc-tests radicle_log
running 0 tests
test result: ok. 0 passed; 0 failed; 0 ignored; 0 measured; 0 filtered out; finished in 0.00s
Doc-tests radicle_node
running 0 tests
test result: ok. 0 passed; 0 failed; 0 ignored; 0 measured; 0 filtered out; finished in 0.00s
Doc-tests radicle_oid
running 0 tests
test result: ok. 0 passed; 0 failed; 0 ignored; 0 measured; 0 filtered out; finished in 0.00s
Doc-tests radicle_protocol
running 6 tests
test crates/radicle-protocol/src/bounded.rs - bounded::BoundedVec<T,N>::truncate (line 50) ... ok
test crates/radicle-protocol/src/bounded.rs - bounded::BoundedVec<T,N>::collect_from (line 30) ... ok
test crates/radicle-protocol/src/bounded.rs - bounded::BoundedVec<T,N>::max (line 96) ... ok
test crates/radicle-protocol/src/bounded.rs - bounded::BoundedVec<T,N>::push (line 122) ... ok
test crates/radicle-protocol/src/bounded.rs - bounded::BoundedVec<T,N>::unbound (line 149) ... ok
test crates/radicle-protocol/src/bounded.rs - bounded::BoundedVec<T,N>::with_capacity (line 66) ... ok
test result: ok. 6 passed; 0 failed; 0 ignored; 0 measured; 0 filtered out; finished in 0.00s
all doctests ran in 0.41s; merged doctests compilation took 0.39s
Doc-tests radicle_signals
running 0 tests
test result: ok. 0 passed; 0 failed; 0 ignored; 0 measured; 0 filtered out; finished in 0.00s
Doc-tests radicle_surf
running 4 tests
test crates/radicle-surf/src/glob.rs - glob::Glob<Local>::branches (line 175) ... ignored
test crates/radicle-surf/src/glob.rs - glob::Glob<Remote>::branches (line 249) ... ignored
test crates/radicle-surf/src/namespace.rs - namespace::Namespace::to_namespaced (line 48) ... ignored
test crates/radicle-surf/src/namespace.rs - namespace::Namespace::to_namespaced_pattern (line 75) ... ignored
test result: ok. 0 passed; 0 failed; 4 ignored; 0 measured; 0 filtered out; finished in 0.00s
all doctests ran in 0.09s; merged doctests compilation took 0.08s
Doc-tests radicle_systemd
running 0 tests
test result: ok. 0 passed; 0 failed; 0 ignored; 0 measured; 0 filtered out; finished in 0.00s
Doc-tests radicle_term
running 1 test
test crates/radicle-term/src/table.rs - table (line 4) ... ok
test result: ok. 1 passed; 0 failed; 0 ignored; 0 measured; 0 filtered out; finished in 0.00s
all doctests ran in 0.18s; merged doctests compilation took 0.17s
Doc-tests radicle_windows
running 0 tests
test result: ok. 0 passed; 0 failed; 0 ignored; 0 measured; 0 filtered out; finished in 0.00s
error: 1 target failed:
`-p radicle-cli --test commands`
Exit code: 101
{
"response": "finished",
"result": "failure"
}