rad:z3gqcJUoA1n9HaHKufZs5FCSGazv5 heartwood9f0dfd88f76c73e648e419eda81f104ad7970276
{
"request": "trigger",
"version": 1,
"event_type": "patch",
"repository": {
"id": "rad:z3gqcJUoA1n9HaHKufZs5FCSGazv5",
"name": "heartwood",
"description": "Radicle Heartwood Protocol & Stack",
"private": false,
"default_branch": "master",
"delegates": [
"did:key:z6MksFqXN3Yhqk8pTJdUGLwATkRfQvwZXPqR2qMEhbS9wzpT",
"did:key:z6MkireRatUThvd3qzfKht1S44wpm4FEWSSa4PRMTSQZ3voM",
"did:key:z6MkkPvBfjP4bQmco5Dm7UGsX2ruDBieEHi8n9DVJWX5sTEz"
]
},
"action": "Created",
"patch": {
"id": "5e4683023476778201ab25c87e1343fbfbe67c89",
"author": {
"id": "did:key:z6Mku8hpprWTmCv3BqkssCYDfr2feUdyLSUnycVajFo9XVAx",
"alias": "levitte"
},
"title": "Add radicle-address crate with node Address types",
"state": {
"status": "open",
"conflicts": []
},
"before": "3419821106e274c96f56948a05d2f51f28f5a6c7",
"after": "9f0dfd88f76c73e648e419eda81f104ad7970276",
"commits": [
"9f0dfd88f76c73e648e419eda81f104ad7970276"
],
"target": "0e5a56f25f51d07290613a9363bd8c0c9fc8e0be",
"labels": [],
"assignees": [],
"revisions": [
{
"id": "5e4683023476778201ab25c87e1343fbfbe67c89",
"author": {
"id": "did:key:z6Mku8hpprWTmCv3BqkssCYDfr2feUdyLSUnycVajFo9XVAx",
"alias": "levitte"
},
"description": "The node address types \u2014 Address, AddressType, and the IP\nroutability helpers \u2014 live in the radicle crate, high up in the\nworkspace dependency stack, so nothing below it can use them.\nUpcoming URI/URN/URL unifying work based on radicle-uri\n(rad:z4YcoMtc5eH42N8u7eZwMP9igvhZu) needs them at a lower layer.\n\nGive them their own crate below radicle. radicle keeps re-exporting\neverything it used to, so downstream code compiles unchanged.\n\nBecause Rust's orphan rule ties trait impls to either the trait's\nor the type's crate, the sqlite and Arbitrary impls for these\ntypes have to move along; the new crate gates them behind the\nsqlite and qcheck features, following the pattern of radicle-crypto\nand radicle-core.\n\nAssisted-by: Pi:moonshot/kimi-k3",
"base": "3419821106e274c96f56948a05d2f51f28f5a6c7",
"oid": "9f0dfd88f76c73e648e419eda81f104ad7970276",
"timestamp": 1790183398
}
]
}
}
{
"response": "triggered",
"run_id": {
"id": "72b45f93-4c58-4ce9-9ca9-8995a207ab4a"
},
"info_url": "https://cci.rad.levitte.org//72b45f93-4c58-4ce9-9ca9-8995a207ab4a.html"
}
Started at: 2026-09-26 14:27:24.409252+02:00
Commands:
$ rad clone rad:z3gqcJUoA1n9HaHKufZs5FCSGazv5 .
✓ Creating checkout in ./...
✓ Remote cloudhead@z6MksFqXN3Yhqk8pTJdUGLwATkRfQvwZXPqR2qMEhbS9wzpT added
✓ Remote-tracking branch cloudhead@z6MksFqXN3Yhqk8pTJdUGLwATkRfQvwZXPqR2qMEhbS9wzpT/master created for z6MksFqXN3Yhqk8pTJdUGLwATkRfQvwZXPqR2qMEhbS9wzpT
✓ Remote fintohaps@z6MkireRatUThvd3qzfKht1S44wpm4FEWSSa4PRMTSQZ3voM added
✓ Remote-tracking branch fintohaps@z6MkireRatUThvd3qzfKht1S44wpm4FEWSSa4PRMTSQZ3voM/master created for z6MkireRatUThvd3qzfKht1S44wpm4FEWSSa4PRMTSQZ3voM
✓ Remote lorenz@z6MkkPvBfjP4bQmco5Dm7UGsX2ruDBieEHi8n9DVJWX5sTEz added
✓ Remote-tracking branch lorenz@z6MkkPvBfjP4bQmco5Dm7UGsX2ruDBieEHi8n9DVJWX5sTEz/master created for z6MkkPvBfjP4bQmco5Dm7UGsX2ruDBieEHi8n9DVJWX5sTEz
✓ Repository successfully cloned under /opt/radcis/ci.rad.levitte.org/cci/state/72b45f93-4c58-4ce9-9ca9-8995a207ab4a/w/
╭────────────────────────────────────╮
│ heartwood │
│ Radicle Heartwood Protocol & Stack │
│ 193 issues · 44 patches │
╰────────────────────────────────────╯
Run `cd ./.` to go to the repository directory.
Exit code: 0
$ rad patch checkout 5e4683023476778201ab25c87e1343fbfbe67c89
✓ Switched to branch patch/5e46830 at revision 5e46830
✓ Branch patch/5e46830 setup to track rad/patches/5e4683023476778201ab25c87e1343fbfbe67c89
Exit code: 0
$ git config advice.detachedHead false
Exit code: 0
$ git checkout 9f0dfd88f76c73e648e419eda81f104ad7970276
HEAD is now at 9f0dfd88 Add radicle-address crate with node Address types
Exit code: 0
$ rad patch show 5e4683023476778201ab25c87e1343fbfbe67c89 -p
╭─────────────────────────────────────────────────────────────────────────────╮
│ Title Add radicle-address crate with node Address types │
│ Patch 5e4683023476778201ab25c87e1343fbfbe67c89 │
│ Author levitte z6Mku8h…Fo9XVAx │
│ Head 9f0dfd88f76c73e648e419eda81f104ad7970276 │
│ Base 3419821106e274c96f56948a05d2f51f28f5a6c7 │
│ Target master │
│ Branches patch/5e46830 │
│ Commits ahead 1, behind 3 │
│ Status open │
│ │
│ The node address types — Address, AddressType, and the IP │
│ routability helpers — live in the radicle crate, high up in the │
│ workspace dependency stack, so nothing below it can use them. │
│ Upcoming URI/URN/URL unifying work based on radicle-uri │
│ (rad:z4YcoMtc5eH42N8u7eZwMP9igvhZu) needs them at a lower layer. │
│ │
│ Give them their own crate below radicle. radicle keeps re-exporting │
│ everything it used to, so downstream code compiles unchanged. │
│ │
│ Because Rust's orphan rule ties trait impls to either the trait's │
│ or the type's crate, the sqlite and Arbitrary impls for these │
│ types have to move along; the new crate gates them behind the │
│ sqlite and qcheck features, following the pattern of radicle-crypto │
│ and radicle-core. │
│ │
│ Assisted-by: Pi:moonshot/kimi-k3 │
├─────────────────────────────────────────────────────────────────────────────┤
│ 9f0dfd8 Add radicle-address crate with node Address types │
├─────────────────────────────────────────────────────────────────────────────┤
│ ● Revision 5e46830 @ 3419821..9f0dfd8 by levitte z6Mku8h…Fo9XVAx 2 days ago │
╰─────────────────────────────────────────────────────────────────────────────╯
commit 9f0dfd88f76c73e648e419eda81f104ad7970276
Author: Richard Levitte <richard@levitte.org>
Date: Wed Sep 2 10:11:10 2026 +0200
Add radicle-address crate with node Address types
The node address types — Address, AddressType, and the IP
routability helpers — live in the radicle crate, high up in the
workspace dependency stack, so nothing below it can use them.
Upcoming URI/URN/URL unifying work needs them at a lower layer.
Give them their own crate below radicle. radicle keeps re-exporting
everything it used to, so downstream code compiles unchanged.
Because Rust's orphan rule ties trait impls to either the trait's
or the type's crate, the sqlite and Arbitrary impls for these
types have to move along; the new crate gates them behind the
sqlite and qcheck features, following the pattern of radicle-crypto
and radicle-core.
Assisted-by: Pi:moonshot/kimi-k3
diff --git a/Cargo.lock b/Cargo.lock
index 754b25c16a..e571e5ed06 100644
--- a/Cargo.lock
+++ b/Cargo.lock
@@ -2813,6 +2813,7 @@ dependencies = [
"pretty_assertions",
"qcheck",
"qcheck-macros",
+ "radicle-address",
"radicle-cob",
"radicle-core",
"radicle-crypto",
@@ -2833,6 +2834,18 @@ dependencies = [
"unicode-normalization",
]
+[[package]]
+name = "radicle-address"
+version = "0.1.0"
+dependencies = [
+ "cyphernet",
+ "qcheck",
+ "radicle-crypto",
+ "schemars",
+ "serde",
+ "sqlite",
+]
+
[[package]]
name = "radicle-cli"
version = "0.23.0"
diff --git a/Cargo.toml b/Cargo.toml
index dc6f8a053b..6d2cb287df 100644
--- a/Cargo.toml
+++ b/Cargo.toml
@@ -44,6 +44,7 @@ proptest = "1.9"
qcheck = { version = "1", default-features = false }
qcheck-macros = { version = "1", default-features = false }
radicle = { version = "0.25.1", path = "crates/radicle" }
+radicle-address = { version = "0.1.0", path = "crates/radicle-address" }
radicle-cli = { version = "0.23", path = "crates/radicle-cli" }
radicle-cli-test = { path = "crates/radicle-cli-test" }
radicle-cob = { version = "0.21.1", path = "crates/radicle-cob" }
diff --git a/crates/radicle-address/Cargo.toml b/crates/radicle-address/Cargo.toml
new file mode 100644
index 0000000000..a85dfaf261
--- /dev/null
+++ b/crates/radicle-address/Cargo.toml
@@ -0,0 +1,24 @@
+[package]
+name = "radicle-address"
+description = "Radicle peer network address types"
+repository.workspace = true
+version = "0.1.0"
+edition.workspace = true
+license.workspace = true
+rust-version.workspace = true
+
+[features]
+default = []
+i2p = ["cyphernet/i2p"]
+tor = ["cyphernet/tor"]
+qcheck = ["dep:qcheck", "dep:radicle-crypto", "radicle-crypto/test"]
+schemars = ["dep:schemars"]
+sqlite = ["dep:sqlite"]
+
+[dependencies]
+cyphernet = { workspace = true, features = ["dns", "p2p-ed25519"] }
+qcheck = { workspace = true, optional = true }
+radicle-crypto = { workspace = true, optional = true }
+schemars = { workspace = true, optional = true, features = ["derive", "std"] }
+serde = { workspace = true, features = ["derive", "std"] }
+sqlite = { workspace = true, optional = true }
diff --git a/crates/radicle-address/src/arbitrary.rs b/crates/radicle-address/src/arbitrary.rs
new file mode 100644
index 0000000000..4656fb793d
--- /dev/null
+++ b/crates/radicle-address/src/arbitrary.rs
@@ -0,0 +1,91 @@
+use std::net;
+#[cfg(feature = "i2p")]
+use std::str::FromStr;
+
+#[cfg(feature = "tor")]
+use cyphernet::EcPk as _;
+use qcheck::Arbitrary;
+
+use super::{Address, AddressType};
+
+impl Arbitrary for AddressType {
+ fn arbitrary(g: &mut qcheck::Gen) -> Self {
+ #[allow(unused_mut)]
+ let mut types = vec![1, 2, 3];
+
+ #[cfg(feature = "tor")]
+ types.push(4);
+
+ #[cfg(feature = "i2p")]
+ types.push(5);
+
+ let t = *g.choose(&types).unwrap() as u8;
+
+ AddressType::try_from(t).unwrap()
+ }
+}
+
+impl Arbitrary for Address {
+ fn arbitrary(g: &mut qcheck::Gen) -> Self {
+ let host = match AddressType::arbitrary(g) {
+ AddressType::Ipv4 => cyphernet::addr::HostName::Ip(net::IpAddr::V4(
+ net::Ipv4Addr::from(u32::arbitrary(g)),
+ )),
+ AddressType::Ipv6 => {
+ let octets: [u8; 16] = Arbitrary::arbitrary(g);
+ cyphernet::addr::HostName::Ip(net::IpAddr::V6(net::Ipv6Addr::from(octets)))
+ }
+ AddressType::Dns => cyphernet::addr::HostName::Dns(
+ g.choose(&["iris.radicle.example.com", "rosa.radicle.example.com"])
+ .unwrap()
+ .to_string(),
+ ),
+ #[cfg(feature = "tor")]
+ AddressType::Onion => {
+ let pk = radicle_crypto::PublicKey::arbitrary(g);
+ let addr = cyphernet::addr::tor::OnionAddrV3::from(
+ cyphernet::ed25519::PublicKey::from_pk_compressed(pk.into_inner().into())
+ .unwrap(),
+ );
+ cyphernet::addr::HostName::Tor(addr)
+ }
+ #[cfg(feature = "i2p")]
+ AddressType::I2p => {
+ let address = if bool::arbitrary(g) {
+ let name: String = std::iter::repeat_with(|| {
+ char::from(
+ // Base32 alphabet from RFC 4648.
+ *g.choose(b"ABCDEFGHIJKLMNOPQRSTUVWXYZ234567")
+ .expect("alphabet is non-empty"),
+ )
+ })
+ .take(56)
+ .collect();
+
+ name + ".b32"
+ } else {
+ g.choose(&["iris.radicle.example", "rosa.radicle.example"])
+ .unwrap()
+ .to_string()
+ };
+
+ let suffix = if bool::arbitrary(g) {
+ ".i2p"
+ } else {
+ ".i2p.alt"
+ };
+
+ let address = address + suffix;
+
+ cyphernet::addr::HostName::I2p(
+ cyphernet::addr::i2p::I2pAddr::from_str(&address).unwrap(),
+ )
+ }
+ };
+
+ Address::from(cyphernet::addr::NetAddr {
+ host,
+ port: u16::arbitrary(g),
+ })
+ }
+}
diff --git a/crates/radicle-address/src/lib.rs b/crates/radicle-address/src/lib.rs
new file mode 100644
index 0000000000..03e2c6ab63
--- /dev/null
+++ b/crates/radicle-address/src/lib.rs
@@ -0,0 +1,361 @@
+//! Radicle peer network address types.
+//!
+//! These are the address types used by the Radicle node protocol:
+//! [`Address`], a peer's public protocol address (a host name or IP
+//! address, and a TCP port), and [`AddressType`], its classification.
+
+use std::fmt::Display;
+use std::net::{IpAddr, Ipv6Addr};
+use std::ops::Deref;
+use std::str::FromStr;
+use std::{fmt, net};
+
+use cyphernet::addr::{AddrParseError, HostName, NetAddr};
+use serde::{Deserialize, Serialize};
+
+#[cfg(feature = "qcheck")]
+mod arbitrary;
+#[cfg(feature = "sqlite")]
+mod sqlite_impls;
+
+/// Peer public protocol address.
+#[derive(Clone, Eq, PartialEq, Debug, Hash, Serialize, Deserialize)]
+#[serde(try_from = "String", into = "String")]
+#[cfg_attr(
+ feature = "schemars",
+ derive(schemars::JsonSchema),
+ schemars(description = "\
+ An IP address, or a DNS name, or a Tor onion name, or an I2P address,\
+ followed by the symbol ':', followed by a TCP port number.",
+ extend("examples" = [
+ "xmrhfasfg5suueegrnc4gsgyi2tyclcy5oz7f5drnrodmdtob6t2ioyd.onion:8776",
+ "f2atcc7udeub5kh4nkljtjwyk7ikjviorufzgwnfwhkphljl3vhq.b32.i2p:8776",
+ "seed.example.com:8776",
+ "192.0.2.0:31337",
+ ],
+ "pattern" = "^.+:((6553[0-5])|(655[0-2][0-9])|(65[0-4][0-9]{2})|(6[0-4][0-9]{3})|([1-5][0-9]{4})|([0-5]{0,5})|([0-9]{1,4}))$",
+ ),
+))]
+pub struct Address {
+ inner: NetAddr<HostName>,
+
+ /// See documentation of [`Address::is_ipv6_without_square_brackets`] for details.
+ #[deprecated]
+ is_ipv6_without_square_brackets: bool,
+}
+
+impl Address {
+ /// Check whether this address is from the local network.
+ pub fn is_local(&self) -> bool {
+ match &self.inner.host {
+ HostName::Ip(ip) => is_local(ip),
+ HostName::Dns(name) => {
+ let name = name.strip_suffix(".").unwrap_or(name);
+
+ // RFC 2606, Section 2
+ // <https://datatracker.ietf.org/doc/html/rfc2606#section-2>
+ name.ends_with(".localhost") || name == "localhost"
+ }
+ _ => false,
+ }
+ }
+
+ /// Check whether this address is globally routable.
+ pub fn is_routable(&self) -> bool {
+ match self.inner.host {
+ HostName::Ip(ip) => is_routable(&ip),
+ HostName::Dns(_) => !self.is_local(),
+ _ => true,
+ }
+ }
+
+ /// Return the [`HostName`] of the [`Address`].
+ pub fn host(&self) -> &HostName {
+ &self.inner.host
+ }
+
+ /// Return the [`AddressType`] of the [`Address`].
+ ///
+ /// Returns `None` if the [`AddressType`] is not known.
+ pub fn address_type(&self) -> Option<AddressType> {
+ match self.host() {
+ HostName::Ip(IpAddr::V4(_)) => Some(AddressType::Ipv4),
+ HostName::Ip(IpAddr::V6(_)) => Some(AddressType::Ipv6),
+ HostName::Dns(_) => Some(AddressType::Dns),
+ #[cfg(feature = "tor")]
+ HostName::Tor(_) => Some(AddressType::Onion),
+ #[cfg(feature = "i2p")]
+ HostName::I2p(_) => Some(AddressType::I2p),
+ _ => None,
+ }
+ }
+
+ /// Returns `true` if the [`HostName`] is a Tor onion address.
+ #[cfg(feature = "tor")]
+ pub fn is_onion(&self) -> bool {
+ matches!(self.inner.host, HostName::Tor(_))
+ }
+
+ /// Returns `true` if the [`HostName`] is an I2P address.
+ #[cfg(feature = "i2p")]
+ pub fn is_i2p(&self) -> bool {
+ matches!(self.inner.host, HostName::I2p(_))
+ }
+
+ /// Return the port number of the [`Address`].
+ pub fn port(&self) -> u16 {
+ self.inner.port
+ }
+
+ pub fn display_compact(&self) -> impl Display + use<> {
+ let host = match self.host() {
+ HostName::Ip(IpAddr::V4(ip)) => ip.to_string(),
+ HostName::Ip(IpAddr::V6(ip)) => format!("[{ip}]"),
+ HostName::Dns(dns) => dns.clone(),
+ #[cfg(feature = "tor")]
+ HostName::Tor(onion) => {
+ let onion = onion.to_string();
+ let start = onion.chars().take(8).collect::<String>();
+ let end = onion
+ .chars()
+ .skip(onion.len() - 8 - ".onion".len())
+ .collect::<String>();
+ format!("{start}…{end}")
+ }
+ #[cfg(feature = "i2p")]
+ HostName::I2p(i2p) => i2p.to_string(),
+ _ => unreachable!(),
+ };
+
+ let port = self.port().to_string();
+
+ format!("{host}:{port}")
+ }
+
+ /// Returns `true` if the address was parsed from a string that
+ /// mentioned an IPv6 address without square brackets.
+ /// May be used to warn the user, since this format is deprecated.
+ /// This function itself is deprecated and will be removed without further
+ /// notice when the format is no longer accepted.
+ #[deprecated]
+ pub fn is_ipv6_without_square_brackets(&self) -> bool {
+ #[allow(deprecated)]
+ self.is_ipv6_without_square_brackets
+ }
+}
+
+impl Display for Address {
+ fn fmt(&self, f: &mut fmt::Formatter<'_>) -> fmt::Result {
+ match self.host() {
+ HostName::Ip(IpAddr::V6(ip)) => {
+ write!(f, "[{ip}]:{}", self.port())
+ }
+ _ => self.inner.fmt(f),
+ }
+ }
+}
+
+impl From<NetAddr<HostName>> for Address {
+ fn from(addr: NetAddr<HostName>) -> Self {
+ Address {
+ inner: addr,
+ #[allow(deprecated)]
+ is_ipv6_without_square_brackets: false,
+ }
+ }
+}
+
+impl TryFrom<String> for Address {
+ type Error = <Self as FromStr>::Err;
+
+ fn try_from(value: String) -> Result<Self, Self::Error> {
+ value.parse()
+ }
+}
+
+impl From<Address> for String {
+ fn from(value: Address) -> Self {
+ value.to_string()
+ }
+}
+
+impl FromStr for Address {
+ type Err = AddrParseError;
+
+ fn from_str(s: &str) -> Result<Self, Self::Err> {
+ let (host, port) = s.rsplit_once(':').ok_or(AddrParseError::PortAbsent)?;
+
+ let (host, is_ipv6_without_square_brackets) = if let Some(host) = host
+ .strip_prefix('[')
+ .and_then(|host| host.strip_suffix(']'))
+ {
+ (HostName::Ip(host.parse::<Ipv6Addr>()?.into()), false)
+ } else {
+ let host = host.parse()?;
+ let is_ipv6_without_square_brackets = matches!(&host, HostName::Ip(IpAddr::V6(_)));
+ (host, is_ipv6_without_square_brackets)
+ };
+
+ let port = port.parse().map_err(|_| AddrParseError::InvalidPort)?;
+
+ Ok(Self {
+ inner: NetAddr::new(host, port),
+ #[allow(deprecated)]
+ is_ipv6_without_square_brackets,
+ })
+ }
+}
+
+impl Deref for Address {
+ type Target = NetAddr<HostName>;
+
+ fn deref(&self) -> &Self::Target {
+ &self.inner
+ }
+}
+
+impl cyphernet::addr::Host for Address {
+ fn requires_proxy(&self) -> bool {
+ self.inner.requires_proxy()
+ }
+}
+
+impl cyphernet::addr::Addr for Address {
+ fn port(&self) -> u16 {
+ self.inner.port()
+ }
+}
+
+impl From<net::SocketAddr> for Address {
+ fn from(addr: net::SocketAddr) -> Self {
+ Address {
+ inner: NetAddr {
+ host: HostName::Ip(addr.ip()),
+ port: addr.port(),
+ },
+ #[allow(deprecated)]
+ is_ipv6_without_square_brackets: false,
+ }
+ }
+}
+
+impl From<Address> for HostName {
+ fn from(addr: Address) -> Self {
+ addr.inner.host
+ }
+}
+
+/// Address type.
+#[repr(u8)]
+#[derive(Debug, Clone, Copy, PartialEq, Eq)]
+#[non_exhaustive]
+pub enum AddressType {
+ Ipv4 = 1,
+ Ipv6 = 2,
+ Dns = 3,
+ #[cfg(feature = "tor")]
+ Onion = 4,
+ #[cfg(feature = "i2p")]
+ I2p = 5,
+}
+
+impl From<AddressType> for u8 {
+ fn from(other: AddressType) -> Self {
+ other as u8
+ }
+}
+
+impl From<&Address> for AddressType {
+ fn from(a: &Address) -> Self {
+ match a.host {
+ HostName::Ip(net::IpAddr::V4(_)) => AddressType::Ipv4,
+ HostName::Ip(net::IpAddr::V6(_)) => AddressType::Ipv6,
+ HostName::Dns(_) => AddressType::Dns,
+ #[cfg(feature = "tor")]
+ HostName::Tor(_) => AddressType::Onion,
+ #[cfg(feature = "i2p")]
+ HostName::I2p(_) => AddressType::I2p,
+ _ => todo!(), // FIXME(cloudhead): Maxim will remove `non-exhaustive`
+ }
+ }
+}
+
+impl TryFrom<u8> for AddressType {
+ type Error = u8;
+
+ fn try_from(other: u8) -> Result<Self, Self::Error> {
+ match other {
+ 1 => Ok(AddressType::Ipv4),
+ 2 => Ok(AddressType::Ipv6),
+ 3 => Ok(AddressType::Dns),
+ #[cfg(feature = "tor")]
+ 4 => Ok(AddressType::Onion),
+ #[cfg(feature = "i2p")]
+ 5 => Ok(AddressType::I2p),
+ _ => Err(other),
+ }
+ }
+}
+
+/// Check whether an IP address is globally routable.
+pub fn is_routable(addr: &net::IpAddr) -> bool {
+ match addr {
+ net::IpAddr::V4(addr) => ipv4_is_routable(addr),
+ net::IpAddr::V6(addr) => ipv6_is_routable(addr),
+ }
+}
+
+/// Check whether an IP address is locally routable.
+pub fn is_local(addr: &net::IpAddr) -> bool {
+ match addr {
+ net::IpAddr::V4(addr) => {
+ addr.is_private() || addr.is_loopback() || addr.is_link_local() || addr.is_unspecified()
+ }
+ net::IpAddr::V6(addr) => {
+ addr.is_loopback() || addr.is_unicast_link_local() || addr.is_unspecified()
+ }
+ }
+}
+
+/// Check whether an IPv4 address is globally routable.
+///
+/// This implementation lacks many exceptions, and should be improved once
+/// corresponding functions in [`std::net::Ipv4Addr`] are stabilized.
+///
+/// See
+/// - <https://github.com/rust-lang/rust/issues/27709>
+/// - <https://www.iana.org/assignments/iana-ipv4-special-registry/iana-ipv4-special-registry.xhtml>
+fn ipv4_is_routable(addr: &net::Ipv4Addr) -> bool {
+ // https://datatracker.ietf.org/doc/html/rfc7723#section-4.1
+ if *addr == net::Ipv4Addr::new(192, 0, 0, 9) {
+ return true;
+ }
+
+ // https://datatracker.ietf.org/doc/html/rfc8155#section-8.1
+ if *addr == net::Ipv4Addr::new(192, 0, 0, 10) {
+ return true;
+ }
+
+ // https://datatracker.ietf.org/doc/html/rfc791#section-3.2
+ if addr.octets()[0] == 0 {
+ return false;
+ }
+
+ !addr.is_private()
+ && !addr.is_loopback()
+ && !addr.is_link_local()
+ && !addr.is_broadcast()
+ && !addr.is_documentation()
+}
+
+/// Check whether an IPv6 address is globally routable.
+///
+/// This implementation lacks many exceptions, and should be improved once
+/// corresponding functions in [`std::net::Ipv6Addr`] are stabilized.
+///
+/// See
+/// - <https://github.com/rust-lang/rust/issues/27709>
+/// - <https://www.iana.org/assignments/iana-ipv6-special-registry/iana-ipv6-special-registry.xhtml>
+fn ipv6_is_routable(addr: &net::Ipv6Addr) -> bool {
+ !addr.is_loopback() && !addr.is_unicast_link_local() && !addr.is_unspecified()
+}
diff --git a/crates/radicle-address/src/sqlite_impls.rs b/crates/radicle-address/src/sqlite_impls.rs
new file mode 100644
index 0000000000..82e2e9059a
--- /dev/null
+++ b/crates/radicle-address/src/sqlite_impls.rs
@@ -0,0 +1,69 @@
+use std::str::FromStr;
+
+use sqlite::{BindableWithIndex, Error, ParameterIndex, Result, Statement, Value};
+
+use super::{Address, AddressType};
+
+impl TryFrom<&Value> for Address {
+ type Error = Error;
+
+ fn try_from(value: &Value) -> std::result::Result<Self, Self::Error> {
+ match value {
+ Value::String(s) => Address::from_str(s.as_str()).map_err(|e| Error {
+ code: None,
+ message: Some(e.to_string()),
+ }),
+ _ => Err(Error {
+ code: None,
+ message: Some(format!(
+ "sql: invalid type `{:?}` for address",
+ value.kind()
+ )),
+ }),
+ }
+ }
+}
+
+impl BindableWithIndex for &Address {
+ fn bind<I: ParameterIndex>(self, stmt: &mut Statement<'_>, i: I) -> Result<()> {
+ self.to_string().bind(stmt, i)
+ }
+}
+
+impl TryFrom<&Value> for AddressType {
+ type Error = Error;
+
+ fn try_from(value: &Value) -> std::result::Result<Self, Self::Error> {
+ let err = Error {
+ code: None,
+ message: Some("sql: invalid address type".to_owned()),
+ };
+ match value {
+ Value::String(s) => match s.as_str() {
+ "ipv4" => Ok(AddressType::Ipv4),
+ "ipv6" => Ok(AddressType::Ipv6),
+ "dns" => Ok(AddressType::Dns),
+ #[cfg(feature = "tor")]
+ "onion" => Ok(AddressType::Onion),
+ #[cfg(feature = "i2p")]
+ "i2p" => Ok(AddressType::I2p),
+ _ => Err(err),
+ },
+ _ => Err(err),
+ }
+ }
+}
+
+impl BindableWithIndex for AddressType {
+ fn bind<I: ParameterIndex>(self, stmt: &mut Statement<'_>, i: I) -> Result<()> {
+ match self {
+ Self::Ipv4 => "ipv4".bind(stmt, i),
+ Self::Ipv6 => "ipv6".bind(stmt, i),
+ Self::Dns => "dns".bind(stmt, i),
+ #[cfg(feature = "tor")]
+ Self::Onion => "onion".bind(stmt, i),
+ #[cfg(feature = "i2p")]
+ Self::I2p => "i2p".bind(stmt, i),
+ }
+ }
+}
diff --git a/crates/radicle/Cargo.toml b/crates/radicle/Cargo.toml
index 3eb5df6fc0..a039fd0a00 100644
--- a/crates/radicle/Cargo.toml
+++ b/crates/radicle/Cargo.toml
@@ -12,11 +12,12 @@ rust-version.workspace = true
bstr = ["radicle-git-ref-format/bstr"]
default = []
gix = ["radicle-oid/gix"]
-i2p = ["cyphernet/i2p"]
+i2p = ["cyphernet/i2p", "radicle-address/i2p"]
test = ["tempfile", "qcheck", "radicle-crypto/test", "radicle-cob/test"]
qcheck = [
"radicle-core/qcheck",
"radicle-oid/qcheck",
+ "radicle-address/qcheck",
"dep:qcheck"
]
schemars = [
@@ -24,9 +25,10 @@ schemars = [
"radicle-core/schemars",
"radicle-crypto/schemars",
"radicle-localtime/schemars",
+ "radicle-address/schemars",
"dep:schemars"
]
-tor = ["cyphernet/tor"]
+tor = ["cyphernet/tor", "radicle-address/tor"]
[dependencies]
base64 = "0.21.3"
@@ -41,6 +43,7 @@ log = { workspace = true, features = ["std"] }
multibase = { workspace = true, features = ["std"] }
nonempty = { workspace = true, features = ["serialize"] }
qcheck = { workspace = true, optional = true }
+radicle-address = { workspace = true, features = ["sqlite"] }
radicle-cob = { workspace = true, features = ["git2"] }
radicle-core = { workspace = true, features = ["git2", "serde", "sqlite"] }
radicle-crypto = { workspace = true, features = ["radicle-git-ref-format", "serde", "ssh", "sqlite", "cyphernet"] }
@@ -71,6 +74,7 @@ jsonschema = { version = "0.30", default-features = false }
pretty_assertions = { workspace = true }
qcheck = { workspace = true }
qcheck-macros = { workspace = true }
+radicle-address = { workspace = true, features = ["qcheck"] }
radicle-cob = { workspace = true, features = ["stable-commit-ids", "test"] }
radicle-core = {workspace = true, features = ["qcheck"] }
radicle-crypto = { workspace = true, features = ["test"] }
diff --git a/crates/radicle/src/node.rs b/crates/radicle/src/node.rs
index 01eba76bc4..c5fde99694 100644
--- a/crates/radicle/src/node.rs
+++ b/crates/radicle/src/node.rs
@@ -1,7 +1,6 @@
mod features;
pub mod address;
-use address::AddressType;
pub mod command;
pub mod config;
@@ -16,11 +15,8 @@ pub mod sync;
pub mod timestamp;
use std::collections::{BTreeMap, BTreeSet, HashMap, HashSet, VecDeque};
-use std::fmt::Display;
use std::io::{BufRead, BufReader};
use std::marker::PhantomData;
-use std::net::IpAddr;
-use std::net::Ipv6Addr;
use std::ops::{ControlFlow, Deref};
use std::path::{Path, PathBuf};
use std::str::FromStr;
@@ -31,7 +27,6 @@ use std::os::unix::net::UnixStream;
#[cfg(windows)]
use uds_windows::UnixStream;
-use cyphernet::addr::{AddrParseError, NetAddr};
use localtime::{LocalDuration, LocalTime};
use serde::de::DeserializeOwned;
use serde::{Deserialize, Serialize};
@@ -51,6 +46,7 @@ pub use cyphernet::addr::{HostName, PeerAddr, PeerAddrParseError};
pub use db::Database;
pub use events::{Event, Events};
pub use features::Features;
+pub use radicle_address::Address;
pub use radicle_core::NodeId;
pub use seed::SyncedAt;
pub use timestamp::Timestamp;
@@ -459,233 +455,6 @@ impl TryFrom<&sqlite::Value> for Alias {
}
}
-/// Peer public protocol address.
-#[derive(Clone, Eq, PartialEq, Debug, Hash, Serialize, Deserialize)]
-#[serde(try_from = "String", into = "String")]
-#[cfg_attr(
- feature = "schemars",
- derive(schemars::JsonSchema),
- schemars(description = "\
- An IP address, or a DNS name, or a Tor onion name, or an I2P address,\
- followed by the symbol ':', followed by a TCP port number.",
- extend("examples" = [
- "xmrhfasfg5suueegrnc4gsgyi2tyclcy5oz7f5drnrodmdtob6t2ioyd.onion:8776",
- "f2atcc7udeub5kh4nkljtjwyk7ikjviorufzgwnfwhkphljl3vhq.b32.i2p:8776",
- "seed.example.com:8776",
- "192.0.2.0:31337",
- ],
- "pattern" = "^.+:((6553[0-5])|(655[0-2][0-9])|(65[0-4][0-9]{2})|(6[0-4][0-9]{3})|([1-5][0-9]{4})|([0-5]{0,5})|([0-9]{1,4}))$",
- ),
-))]
-pub struct Address {
- inner: NetAddr<HostName>,
-
- /// See documentation of [`Address::is_ipv6_without_square_brackets`] for details.
- #[deprecated]
- is_ipv6_without_square_brackets: bool,
-}
-
-impl Address {
- /// Check whether this address is from the local network.
- pub fn is_local(&self) -> bool {
- match &self.inner.host {
- HostName::Ip(ip) => address::is_local(ip),
- HostName::Dns(name) => {
- let name = name.strip_suffix(".").unwrap_or(name);
-
- // RFC 2606, Section 2
- // <https://datatracker.ietf.org/doc/html/rfc2606#section-2>
- name.ends_with(".localhost") || name == "localhost"
- }
- _ => false,
- }
- }
-
- /// Check whether this address is globally routable.
- pub fn is_routable(&self) -> bool {
- match self.inner.host {
- HostName::Ip(ip) => address::is_routable(&ip),
- HostName::Dns(_) => !self.is_local(),
- _ => true,
- }
- }
-
- /// Return the [`HostName`] of the [`Address`].
- pub fn host(&self) -> &HostName {
- &self.inner.host
- }
-
- /// Return the [`AddressType`] of the [`Address`].
- ///
- /// Returns `None` if the [`AddressType`] is not known.
- pub fn address_type(&self) -> Option<AddressType> {
- match self.host() {
- HostName::Ip(IpAddr::V4(_)) => Some(AddressType::Ipv4),
- HostName::Ip(IpAddr::V6(_)) => Some(AddressType::Ipv6),
- HostName::Dns(_) => Some(AddressType::Dns),
- #[cfg(feature = "tor")]
- HostName::Tor(_) => Some(AddressType::Onion),
- #[cfg(feature = "i2p")]
- HostName::I2p(_) => Some(AddressType::I2p),
- _ => None,
- }
- }
-
- /// Returns `true` if the [`HostName`] is a Tor onion address.
- #[cfg(feature = "tor")]
- pub fn is_onion(&self) -> bool {
- matches!(self.inner.host, HostName::Tor(_))
- }
-
- /// Returns `true` if the [`HostName`] is an I2P address.
- #[cfg(feature = "i2p")]
- pub fn is_i2p(&self) -> bool {
- matches!(self.inner.host, HostName::I2p(_))
- }
-
- /// Return the port number of the [`Address`].
- pub fn port(&self) -> u16 {
- self.inner.port
- }
-
- pub fn display_compact(&self) -> impl Display + use<> {
- let host = match self.host() {
- HostName::Ip(IpAddr::V4(ip)) => ip.to_string(),
- HostName::Ip(IpAddr::V6(ip)) => format!("[{ip}]"),
- HostName::Dns(dns) => dns.clone(),
- #[cfg(feature = "tor")]
- HostName::Tor(onion) => {
- let onion = onion.to_string();
- let start = onion.chars().take(8).collect::<String>();
- let end = onion
- .chars()
- .skip(onion.len() - 8 - ".onion".len())
- .collect::<String>();
- format!("{start}…{end}")
- }
- #[cfg(feature = "i2p")]
- HostName::I2p(i2p) => i2p.to_string(),
- _ => unreachable!(),
- };
-
- let port = self.port().to_string();
-
- format!("{host}:{port}")
- }
-
- /// Returns `true` if the address was parsed from a string that
- /// mentioned an IPv6 address without square brackets.
- /// May be used to warn the user, since this format is deprecated.
- /// This function itself is deprecated and will be removed without further
- /// notice when the format is no longer accepted.
- #[deprecated]
- pub fn is_ipv6_without_square_brackets(&self) -> bool {
- #[allow(deprecated)]
- self.is_ipv6_without_square_brackets
- }
-}
-
-impl Display for Address {
- fn fmt(&self, f: &mut fmt::Formatter<'_>) -> fmt::Result {
- match self.host() {
- HostName::Ip(IpAddr::V6(ip)) => {
- write!(f, "[{ip}]:{}", self.port())
- }
- _ => self.inner.fmt(f),
- }
- }
-}
-
-impl From<NetAddr<HostName>> for Address {
- fn from(addr: NetAddr<HostName>) -> Self {
- Address {
- inner: addr,
- #[allow(deprecated)]
- is_ipv6_without_square_brackets: false,
- }
- }
-}
-
-impl TryFrom<String> for Address {
- type Error = <Self as FromStr>::Err;
-
- fn try_from(value: String) -> Result<Self, Self::Error> {
- value.parse()
- }
-}
-
-impl From<Address> for String {
- fn from(value: Address) -> Self {
- value.to_string()
- }
-}
-
-impl FromStr for Address {
- type Err = AddrParseError;
-
- fn from_str(s: &str) -> Result<Self, Self::Err> {
- let (host, port) = s.rsplit_once(':').ok_or(AddrParseError::PortAbsent)?;
-
- let (host, is_ipv6_without_square_brackets) = if let Some(host) = host
- .strip_prefix('[')
- .and_then(|host| host.strip_suffix(']'))
- {
- (HostName::Ip(host.parse::<Ipv6Addr>()?.into()), false)
- } else {
- let host = host.parse()?;
- let is_ipv6_without_square_brackets = matches!(&host, HostName::Ip(IpAddr::V6(_)));
- (host, is_ipv6_without_square_brackets)
- };
-
- let port = port.parse().map_err(|_| AddrParseError::InvalidPort)?;
-
- Ok(Self {
- inner: NetAddr::new(host, port),
- #[allow(deprecated)]
- is_ipv6_without_square_brackets,
- })
- }
-}
-
-impl Deref for Address {
- type Target = NetAddr<HostName>;
-
- fn deref(&self) -> &Self::Target {
- &self.inner
- }
-}
-
-impl cyphernet::addr::Host for Address {
- fn requires_proxy(&self) -> bool {
- self.inner.requires_proxy()
- }
-}
-
-impl cyphernet::addr::Addr for Address {
- fn port(&self) -> u16 {
- self.inner.port()
- }
-}
-
-impl From<net::SocketAddr> for Address {
- fn from(addr: net::SocketAddr) -> Self {
- Address {
- inner: NetAddr {
- host: HostName::Ip(addr.ip()),
- port: addr.port(),
- },
- #[allow(deprecated)]
- is_ipv6_without_square_brackets: false,
- }
- }
-}
-
-impl From<Address> for HostName {
- fn from(addr: Address) -> Self {
- addr.inner.host
- }
-}
-
/// Connection link direction.
#[derive(Debug, Clone, Copy, PartialEq, Eq, Serialize, Deserialize)]
#[serde(rename_all = "camelCase")]
diff --git a/crates/radicle/src/node/address.rs b/crates/radicle/src/node/address.rs
index 1d392fbff2..4cff28086a 100644
--- a/crates/radicle/src/node/address.rs
+++ b/crates/radicle/src/node/address.rs
@@ -2,12 +2,13 @@ pub mod store;
pub use store::{Error, Store};
use std::cell::RefCell;
+use std::hash;
use std::ops::{Deref, DerefMut};
-use std::{hash, net};
-use cyphernet::addr::HostName;
use localtime::LocalTime;
+
use nonempty::NonEmpty;
+pub use radicle_address::{AddressType, is_local, is_routable};
use crate::collections::RandomMap;
use crate::node::{Address, Alias, Penalty, UserAgent};
@@ -193,117 +194,3 @@ impl std::fmt::Display for Source {
}
}
}
-
-/// Address type.
-#[repr(u8)]
-#[derive(Debug, Clone, Copy, PartialEq, Eq)]
-#[non_exhaustive]
-pub enum AddressType {
- Ipv4 = 1,
- Ipv6 = 2,
- Dns = 3,
- #[cfg(feature = "tor")]
- Onion = 4,
- #[cfg(feature = "i2p")]
- I2p = 5,
-}
-
-impl From<AddressType> for u8 {
- fn from(other: AddressType) -> Self {
- other as u8
- }
-}
-
-impl From<&Address> for AddressType {
- fn from(a: &Address) -> Self {
- match a.host {
- HostName::Ip(net::IpAddr::V4(_)) => AddressType::Ipv4,
- HostName::Ip(net::IpAddr::V6(_)) => AddressType::Ipv6,
- HostName::Dns(_) => AddressType::Dns,
- #[cfg(feature = "tor")]
- HostName::Tor(_) => AddressType::Onion,
- #[cfg(feature = "i2p")]
- HostName::I2p(_) => AddressType::I2p,
- _ => todo!(), // FIXME(cloudhead): Maxim will remove `non-exhaustive`
- }
- }
-}
-
-impl TryFrom<u8> for AddressType {
- type Error = u8;
-
- fn try_from(other: u8) -> Result<Self, Self::Error> {
- match other {
- 1 => Ok(AddressType::Ipv4),
- 2 => Ok(AddressType::Ipv6),
- 3 => Ok(AddressType::Dns),
- #[cfg(feature = "tor")]
- 4 => Ok(AddressType::Onion),
- #[cfg(feature = "i2p")]
- 5 => Ok(AddressType::I2p),
- _ => Err(other),
- }
- }
-}
-/// Check whether an IP address is globally routable.
-pub fn is_routable(addr: &net::IpAddr) -> bool {
- match addr {
- net::IpAddr::V4(addr) => ipv4_is_routable(addr),
- net::IpAddr::V6(addr) => ipv6_is_routable(addr),
- }
-}
-
-/// Check whether an IP address is locally routable.
-pub fn is_local(addr: &net::IpAddr) -> bool {
- match addr {
- net::IpAddr::V4(addr) => {
- addr.is_private() || addr.is_loopback() || addr.is_link_local() || addr.is_unspecified()
- }
- net::IpAddr::V6(addr) => {
- addr.is_loopback() || addr.is_unicast_link_local() || addr.is_unspecified()
- }
- }
-}
-
-/// Check whether an IPv4 address is globally routable.
-///
-/// This implementation lacks many exceptions, and should be improved once
-/// corresponding functions in [`std::net::Ipv4Addr`] are stabilized.
-///
-/// See
-/// - <https://github.com/rust-lang/rust/issues/27709>
-/// - <https://www.iana.org/assignments/iana-ipv4-special-registry/iana-ipv4-special-registry.xhtml>
-fn ipv4_is_routable(addr: &net::Ipv4Addr) -> bool {
- // https://datatracker.ietf.org/doc/html/rfc7723#section-4.1
- if *addr == net::Ipv4Addr::new(192, 0, 0, 9) {
- return true;
- }
-
- // https://datatracker.ietf.org/doc/html/rfc8155#section-8.1
- if *addr == net::Ipv4Addr::new(192, 0, 0, 10) {
- return true;
- }
-
- // https://datatracker.ietf.org/doc/html/rfc791#section-3.2
- if addr.octets()[0] == 0 {
- return false;
- }
-
- !addr.is_private()
- && !addr.is_loopback()
- && !addr.is_link_local()
- && !addr.is_broadcast()
- && !addr.is_documentation()
-}
-
-/// Check whether an IPv6 address is globally routable.
-///
-/// This implementation lacks many exceptions, and should be improved once
-/// corresponding functions in [`std::net::Ipv6Addr`] are stabilized.
-///
-/// See
-/// - <https://github.com/rust-lang/rust/issues/27709>
-/// - <https://www.iana.org/assignments/iana-ipv6-special-registry/iana-ipv6-special-registry.xhtml>
-fn ipv6_is_routable(addr: &net::Ipv6Addr) -> bool {
- !addr.is_loopback() && !addr.is_unicast_link_local() && !addr.is_unspecified()
-}
diff --git a/crates/radicle/src/node/address/store.rs b/crates/radicle/src/node/address/store.rs
index 54e3ed34ae..5859802762 100644
--- a/crates/radicle/src/node/address/store.rs
+++ b/crates/radicle/src/node/address/store.rs
@@ -573,44 +573,6 @@ impl sql::BindableWithIndex for Source {
}
}
-impl TryFrom<&sql::Value> for AddressType {
- type Error = sql::Error;
-
- fn try_from(value: &sql::Value) -> Result<Self, Self::Error> {
- let err = sql::Error {
- code: None,
- message: Some("sql: invalid address type".to_owned()),
- };
- match value {
- sql::Value::String(s) => match s.as_str() {
- "ipv4" => Ok(AddressType::Ipv4),
- "ipv6" => Ok(AddressType::Ipv6),
- "dns" => Ok(AddressType::Dns),
- #[cfg(feature = "tor")]
- "onion" => Ok(AddressType::Onion),
- #[cfg(feature = "i2p")]
- "i2p" => Ok(AddressType::I2p),
- _ => Err(err),
- },
- _ => Err(err),
- }
- }
-}
-
-impl sql::BindableWithIndex for AddressType {
- fn bind<I: sql::ParameterIndex>(self, stmt: &mut sql::Statement<'_>, i: I) -> sql::Result<()> {
- match self {
- Self::Ipv4 => "ipv4".bind(stmt, i),
- Self::Ipv6 => "ipv6".bind(stmt, i),
- Self::Dns => "dns".bind(stmt, i),
- #[cfg(feature = "tor")]
- Self::Onion => "onion".bind(stmt, i),
- #[cfg(feature = "i2p")]
- Self::I2p => "i2p".bind(stmt, i),
- }
- }
-}
-
#[cfg(test)]
#[allow(clippy::unwrap_used)]
mod test {
diff --git a/crates/radicle/src/sql.rs b/crates/radicle/src/sql.rs
index 57818ff0b4..e6ad7028ac 100644
--- a/crates/radicle/src/sql.rs
+++ b/crates/radicle/src/sql.rs
@@ -5,7 +5,7 @@ use sqlite as sql;
use sqlite::Value;
use crate::node;
-use crate::node::{Address, UserAgent};
+use crate::node::UserAgent;
/// Run an SQL query inside a transaction.
/// Commits the transaction on success, and rolls back on error.
@@ -50,32 +50,6 @@ impl TryFrom<&Value> for node::Features {
}
}
-impl TryFrom<&sql::Value> for Address {
- type Error = sql::Error;
-
- fn try_from(value: &sql::Value) -> Result<Self, Self::Error> {
- match value {
- sql::Value::String(s) => Address::from_str(s.as_str()).map_err(|e| sql::Error {
- code: None,
- message: Some(e.to_string()),
- }),
- _ => Err(sql::Error {
- code: None,
- message: Some(format!(
- "sql: invalid type `{:?}` for address",
- value.kind()
- )),
- }),
- }
- }
-}
-
-impl sql::BindableWithIndex for &Address {
- fn bind<I: sql::ParameterIndex>(self, stmt: &mut sql::Statement<'_>, i: I) -> sql::Result<()> {
- self.to_string().bind(stmt, i)
- }
-}
-
impl TryFrom<&Value> for UserAgent {
type Error = sql::Error;
diff --git a/crates/radicle/src/test/arbitrary.rs b/crates/radicle/src/test/arbitrary.rs
index ce81c2397e..65741e94c7 100644
--- a/crates/radicle/src/test/arbitrary.rs
+++ b/crates/radicle/src/test/arbitrary.rs
@@ -1,14 +1,10 @@
use std::collections::{BTreeSet, HashMap, HashSet};
use std::hash::Hash;
+use std::iter;
use std::ops::RangeBounds;
use std::str::FromStr;
-use std::{iter, net};
use crypto::PublicKey;
-#[cfg(feature = "i2p")]
-use cyphernet::addr::i2p::I2pAddr;
-#[cfg(feature = "tor")]
-use cyphernet::{EcPk, addr::tor::OnionAddrV3};
use qcheck::Arbitrary;
use crate::identity::doc::Visibility;
@@ -18,7 +14,7 @@ use crate::identity::{
doc::{Doc, DocAt, RawDoc, RepoId},
project::Project,
};
-use crate::node::address::{AddressType, Source};
+use crate::node::address::Source;
use crate::node::{Address, Alias, KnownAddress, Timestamp, UserAgent};
use crate::storage;
use crate::test::storage::{MockRepository, MockStorage};
@@ -212,86 +208,6 @@ impl Arbitrary for MockRepository {
}
}
-impl Arbitrary for AddressType {
- fn arbitrary(g: &mut qcheck::Gen) -> Self {
- #[allow(unused_mut)]
- let mut types = vec![1, 2, 3];
-
- #[cfg(feature = "tor")]
- types.push(4);
-
- #[cfg(feature = "i2p")]
- types.push(5);
-
- let t = *g.choose(&types).unwrap() as u8;
-
- AddressType::try_from(t).unwrap()
- }
-}
-
-impl Arbitrary for Address {
- fn arbitrary(g: &mut qcheck::Gen) -> Self {
- let host = match AddressType::arbitrary(g) {
- AddressType::Ipv4 => cyphernet::addr::HostName::Ip(net::IpAddr::V4(
- net::Ipv4Addr::from(u32::arbitrary(g)),
- )),
- AddressType::Ipv6 => {
- let octets: [u8; 16] = Arbitrary::arbitrary(g);
- cyphernet::addr::HostName::Ip(net::IpAddr::V6(net::Ipv6Addr::from(octets)))
- }
- AddressType::Dns => cyphernet::addr::HostName::Dns(
- g.choose(&["iris.radicle.example.com", "rosa.radicle.example.com"])
- .unwrap()
- .to_string(),
- ),
- #[cfg(feature = "tor")]
- AddressType::Onion => {
- let pk = PublicKey::arbitrary(g);
- let addr = OnionAddrV3::from(
- cyphernet::ed25519::PublicKey::from_pk_compressed(pk.into_inner().into())
- .unwrap(),
- );
- cyphernet::addr::HostName::Tor(addr)
- }
- #[cfg(feature = "i2p")]
- AddressType::I2p => {
- let address = if bool::arbitrary(g) {
- let name: String = iter::repeat_with(|| {
- char::from(
- // Base32 alphabet from RFC 4648.
- *g.choose(b"ABCDEFGHIJKLMNOPQRSTUVWXYZ234567")
- .expect("alphabet is non-empty"),
- )
- })
- .take(56)
- .collect();
-
- name + ".b32"
- } else {
- g.choose(&["iris.radicle.example", "rosa.radicle.example"])
- .unwrap()
- .to_string()
- };
-
- let suffix = if bool::arbitrary(g) {
- ".i2p"
- } else {
- ".i2p.alt"
- };
-
- let address = address + suffix;
-
- cyphernet::addr::HostName::I2p(I2pAddr::from_str(&address).unwrap())
- }
- };
-
- Address::from(cyphernet::addr::NetAddr {
- host,
- port: u16::arbitrary(g),
- })
- }
-}
-
impl Arbitrary for KnownAddress {
fn arbitrary(g: &mut qcheck::Gen) -> Self {
KnownAddress::new(Address::arbitrary(g), Source::Peer)
Exit code: 0
shell: 'export RUSTDOCFLAGS=''-D warnings'' cargo --version rustc --version cargo fmt --check cargo clippy --all-targets --workspace -- --deny warnings cargo build --all-targets --workspace cargo doc --workspace --no-deps --all-features cargo test --workspace --no-fail-fast '
Commands:
$ podman run --name 72b45f93-4c58-4ce9-9ca9-8995a207ab4a -v /opt/radcis/ci.rad.levitte.org/cci/state/72b45f93-4c58-4ce9-9ca9-8995a207ab4a/s:/72b45f93-4c58-4ce9-9ca9-8995a207ab4a/s:ro -v /opt/radcis/ci.rad.levitte.org/cci/state/72b45f93-4c58-4ce9-9ca9-8995a207ab4a/w:/72b45f93-4c58-4ce9-9ca9-8995a207ab4a/w -w /72b45f93-4c58-4ce9-9ca9-8995a207ab4a/w -v /opt/radcis/ci.rad.levitte.org/.radicle:/${id}/.radicle:ro -e RAD_HOME=/${id}/.radicle rust:trixie bash /72b45f93-4c58-4ce9-9ca9-8995a207ab4a/s/script.sh
+ export 'RUSTDOCFLAGS=-D warnings'
+ RUSTDOCFLAGS='-D warnings'
+ cargo --version
info: syncing channel updates for '1.98.0-x86_64-unknown-linux-gnu'
info: latest update on 2026-08-20, rust version 1.98.0 (88d9e12ae 2026-08-18)
info: downloading component 'cargo'
info: downloading component 'clippy'
info: downloading component 'rust-docs'
info: downloading component 'rust-src'
info: downloading component 'rust-std'
info: downloading component 'rustc'
info: downloading component 'rustfmt'
info: installing component 'cargo'
info: installing component 'clippy'
info: installing component 'rust-docs'
info: installing component 'rust-src'
info: installing component 'rust-std'
info: installing component 'rustc'
info: installing component 'rustfmt'
cargo 1.98.0 (797e8a9bc 2026-08-05)
+ rustc --version
rustc 1.98.0 (88d9e12ae 2026-08-18)
+ cargo fmt --check
+ cargo clippy --all-targets --workspace -- --deny warnings
Updating crates.io index
Downloading crates ...
Downloaded document-features v0.2.12
Downloaded ec25519 v0.1.0
Downloaded cipher v0.4.4
Downloaded ctr v0.9.2
Downloaded addr2line v0.25.1
Downloaded clap v4.6.0
Downloaded crypto-bigint v0.5.5
Downloaded crypto-common v0.1.7
Downloaded same-file v1.0.6
Downloaded scopeguard v1.2.0
Downloaded clap_builder v4.6.0
Downloaded const-str v0.4.3
Downloaded curve25519-dalek v4.1.3
Downloaded chrono v0.4.44
Downloaded convert_case v0.10.0
Downloaded ed25519 v2.2.3
Downloaded const-oid v0.9.6
Downloaded ecdsa v0.16.9
Downloaded qcheck-macros v1.0.0
Downloaded quick-error v1.2.3
Downloaded gix-sec v0.14.0
Downloaded crossterm v0.29.0
Downloaded der v0.7.10
Downloaded email_address v0.2.9
Downloaded quote v1.0.45
Downloaded clap_derive v4.6.0
Downloaded colorchoice v1.0.5
Downloaded crossbeam-utils v0.8.21
Downloaded env_filter v1.0.0
Downloaded scrypt v0.11.0
Downloaded fnv v1.0.7
Downloaded ghash v0.5.1
Downloaded thiserror-impl v2.0.18
Downloaded signals_receipts v0.2.5
Downloaded find-msvc-tools v0.1.9
Downloaded rand v0.8.5
Downloaded ryu v1.0.23
Downloaded gix-prompt v0.15.0
Downloaded console v0.16.3
Downloaded serde_json v1.0.149
Downloaded curve25519-dalek-derive v0.1.1
Downloaded env_logger v0.11.9
Downloaded equivalent v1.0.2
Downloaded dyn-clone v1.0.20
Downloaded clap_complete v4.6.0
Downloaded gix-actor v0.41.0
Downloaded cpufeatures v0.2.17
Downloaded regex-syntax v0.8.10
Downloaded fast-glob v0.3.3
Downloaded ed25519 v1.5.3
Downloaded escargot v0.5.15
Downloaded gix-credentials v0.38.0
Downloaded gix-path v0.12.0
Downloaded clap_lex v1.1.0
Downloaded getrandom v0.2.17
Downloaded crc32fast v1.5.0
Downloaded fastrand v2.3.0
Downloaded gix-chunk v0.7.1
Downloaded ed25519-dalek v2.2.0
Downloaded salsa20 v0.10.2
Downloaded schemars v1.2.1
Downloaded rand_core v0.9.5
Downloaded rustversion v1.0.22
Downloaded rand_chacha v0.9.0
Downloaded rusty-fork v0.3.1
Downloaded derive_more-impl v2.1.1
Downloaded emojis v0.6.4
Downloaded gix-quote v0.7.1
Downloaded gix-refspec v0.41.0
Downloaded ref-cast v1.0.25
Downloaded colored v2.2.0
Downloaded elliptic-curve v0.13.8
Downloaded cypheraddr v0.4.1
Downloaded form_urlencoded v1.2.2
Downloaded erased-serde v0.4.10
Downloaded gix-config-value v0.18.0
Downloaded rustc-demangle v0.1.27
Downloaded signature v2.2.0
Downloaded socks5-client v0.4.3
Downloaded data-encoding v2.10.0
Downloaded errno v0.3.14
Downloaded rand_chacha v0.3.1
Downloaded rustc_version v0.4.1
Downloaded sec1 v0.7.3
Downloaded streaming-iterator v0.1.9
Downloaded siphasher v1.0.2
Downloaded ssh-encoding v0.2.0
Downloaded data-encoding-macro-internal v0.1.17
Downloaded data-encoding-macro v0.1.19
Downloaded gix-features v0.48.0
Downloaded rs-release v0.1.11
Downloaded sha2 v0.10.9
Downloaded shell-words v1.1.1
Downloaded signal-hook-registry v1.4.8
Downloaded structured-logger v1.0.5
Downloaded spin v0.9.9
Downloaded secrecy v0.10.3
Downloaded strsim v0.11.1
Downloaded rfc6979 v0.4.0
Downloaded serde_spanned v1.0.4
Downloaded sval_json v2.17.0
Downloaded rand_core v0.6.4
Downloaded ref-cast-impl v1.0.25
Downloaded schemars_derive v1.2.1
Downloaded sem_safe v0.2.1
Downloaded simd-adler32 v0.3.8
Downloaded sqlite3-sys v0.18.0
Downloaded signature v1.6.4
Downloaded sval_dynamic v2.17.0
Downloaded ssh-cipher v0.2.0
Downloaded subtle v2.6.1
Downloaded test-log v0.2.19
Downloaded gix-lock v23.0.0
Downloaded gix-hashtable v0.15.0
Downloaded signal-hook-mio v0.2.5
Downloaded sval_serde v2.17.0
Downloaded stable_deref_trait v1.2.1
Downloaded sval_fmt v2.17.0
Downloaded sval_nested v2.17.0
Downloaded serde-untagged v0.1.9
Downloaded smallvec v1.15.1
Downloaded spki v0.7.3
Downloaded referencing v0.30.0
Downloaded snapbox-macros v1.1.0
Downloaded dunce v1.0.5
Downloaded faster-hex v0.10.0
Downloaded gix-command v0.9.0
Downloaded rand_xorshift v0.4.0
Downloaded serde_fmt v1.1.0
Downloaded siphasher v0.3.11
Downloaded systemd-journal-logger v2.2.2
Downloaded tree-sitter-json v0.24.8
Downloaded sval_ref v2.17.0
Downloaded num v0.4.3
Downloaded unicode-display-width v0.3.0
Downloaded value-bag-serde1 v1.12.0
Downloaded inout v0.1.4
Downloaded shlex v1.3.0
Downloaded sqlite v0.37.0
Downloaded itoa v1.0.17
Downloaded serde_derive_internals v0.29.1
Downloaded sha1 v0.10.6
Downloaded synstructure v0.13.2
Downloaded thiserror-impl v1.0.69
Downloaded generic-array v0.14.7
Downloaded thiserror v2.0.18
Downloaded gix-negotiate v0.31.0
Downloaded signal-hook v0.3.18
Downloaded sval_buffer v2.17.0
Downloaded test-log-macros v0.2.19
Downloaded potential_utf v0.1.4
Downloaded thiserror v1.0.69
Downloaded tree-sitter-toml-ng v0.6.0
Downloaded anstyle v1.0.14
Downloaded gix-glob v0.26.0
Downloaded cyphergraphy v0.3.1
Downloaded diff v0.1.13
Downloaded cbc v0.1.2
Downloaded displaydoc v0.2.5
Downloaded tinyvec_macros v0.1.1
Downloaded semver v1.0.27
Downloaded noise-framework v0.4.1
Downloaded pbkdf2 v0.12.2
Downloaded lazy_static v1.5.0
Downloaded gix-utils v0.3.2
Downloaded socket2 v0.5.10
Downloaded tempfile v3.27.0
Downloaded opaque-debug v0.3.1
Downloaded matchers v0.2.0
Downloaded base16ct v0.2.0
Downloaded base32 v0.4.0
Downloaded tree-sitter-css v0.23.2
Downloaded utf8parse v0.2.2
Downloaded universal-hash v0.5.1
Downloaded unarray v0.1.4
Downloaded typeid v1.0.3
Downloaded adler2 v2.0.1
Downloaded zerofrom v0.1.6
Downloaded aead v0.5.2
Downloaded ssh-agent-lib v0.6.0
Downloaded pin-project-lite v0.2.17
Downloaded wait-timeout v0.2.1
Downloaded gix-shallow v0.12.0
Downloaded nonempty v0.9.0
Downloaded is_terminal_polyfill v1.70.2
Downloaded litemap v0.8.1
Downloaded litrs v1.0.0
Downloaded match-lookup v0.1.2
Downloaded multibase v0.9.2
Downloaded percent-encoding v2.3.2
Downloaded rand v0.9.2
Downloaded snapbox v1.2.2
Downloaded autocfg v1.5.0
Downloaded gix-fs v0.21.1
Downloaded gix-revision v0.45.0
Downloaded gix-revwalk v0.31.0
Downloaded human-panic v2.0.6
Downloaded pastey v0.2.1
Downloaded serde_derive v1.0.228
Downloaded sharded-slab v0.1.7
Downloaded yoke-derive v0.8.1
Downloaded base-x v0.2.11
Downloaded bytecount v0.6.9
Downloaded either v1.15.0
Downloaded ff v0.13.1
Downloaded serde_core v1.0.228
Downloaded gix-date v0.15.3
Downloaded hex-literal v1.1.0
Downloaded icu_provider v2.1.1
Downloaded group v0.13.0
Downloaded icu_locale_core v2.1.1
Downloaded ssh-key v0.6.7
Downloaded base256emoji v1.0.2
Downloaded unit-prefix v0.5.2
Downloaded maybe-async v0.2.10
Downloaded gix-validate v0.11.1
Downloaded num-iter v0.1.45
Downloaded primeorder v0.13.6
Downloaded tracing-log v0.2.0
Downloaded writeable v0.6.2
Downloaded zerovec-derive v0.11.2
Downloaded polyval v0.6.2
Downloaded p256 v0.13.2
Downloaded rsa v0.9.10
Downloaded gix-hash v0.25.0
Downloaded uuid-simd v0.8.0
Downloaded poly1305 v0.8.0
Downloaded chacha20 v0.9.1
Downloaded similar v3.1.1
Downloaded hmac v0.12.1
Downloaded serde v1.0.228
Downloaded gix-error v0.2.3
Downloaded amplify_syn v2.0.1
Downloaded icu_normalizer_data v2.1.1
Downloaded toml v0.9.12+spec-1.1.0
Downloaded ppv-lite86 v0.2.21
Downloaded idna_adapter v1.2.1
Downloaded timeago v0.4.2
Downloaded yoke v0.8.1
Downloaded pkg-config v0.3.32
Downloaded cfg-if v1.0.4
Downloaded value-bag-sval2 v1.12.0
Downloaded pkcs8 v0.10.2
Downloaded qcheck v1.0.0
Downloaded value-bag v1.12.0
Downloaded gix-protocol v0.61.0
Downloaded hash32 v0.3.1
Downloaded normalize-line-endings v0.3.0
Downloaded gix-tempfile v23.0.0
Downloaded anstream v0.6.21
Downloaded digest v0.10.7
Downloaded gix-commitgraph v0.37.0
Downloaded sval v2.17.0
Downloaded blowfish v0.9.1
Downloaded borrow-or-share v0.2.4
Downloaded gix-packetline v0.21.5
Downloaded phf_shared v0.11.3
Downloaded gix-trace v0.1.21
Downloaded anstream v1.0.0
Downloaded base64ct v1.8.3
Downloaded tinystr v0.8.2
Downloaded version_check v0.9.5
Downloaded block-padding v0.3.3
Downloaded amplify_num v0.5.3
Downloaded num-bigint v0.4.6
Downloaded toml_datetime v0.7.5+spec-1.1.0
Downloaded humantime v2.3.0
Downloaded outref v0.5.2
Downloaded tree-sitter-language v0.1.7
Downloaded block-buffer v0.10.4
Downloaded amplify_derive v4.0.1
Downloaded miniz_oxide v0.8.9
Downloaded thread_local v1.1.9
Downloaded heck v0.5.0
Downloaded walkdir v2.5.0
Downloaded amplify v4.9.0
Downloaded anstyle-query v1.1.5
Downloaded derive_more v2.1.1
Downloaded num-rational v0.4.2
Downloaded toml_writer v1.0.7+spec-1.1.0
Downloaded phf v0.11.3
Downloaded lock_api v0.4.14
Downloaded zeroize v1.9.0
Downloaded memmap2 v0.9.10
Downloaded yansi v1.0.1
Downloaded bytes v1.11.1
Downloaded base64 v0.22.1
Downloaded parking_lot_core v0.9.12
Downloaded num-integer v0.1.46
Downloaded ahash v0.8.12
Downloaded num-complex v0.4.6
Downloaded getrandom v0.3.4
Downloaded pem-rfc7468 v0.7.0
Downloaded gix-traverse v0.57.0
Downloaded keccak v0.1.6
Downloaded gix-odb v0.80.0
Downloaded lexopt v0.3.2
Downloaded base64 v0.21.7
Downloaded getrandom v0.4.3
Downloaded num-cmp v0.1.0
Downloaded zerofrom-derive v0.1.6
Downloaded gix-object v0.60.0
Downloaded fluent-uri v0.3.2
Downloaded ascii v1.1.0
Downloaded anyhow v1.0.102
Downloaded fancy-regex v0.14.0
Downloaded tree-sitter-html v0.23.2
Downloaded uuid v1.22.0
Downloaded backtrace v0.3.76
Downloaded jobserver v0.1.34
Downloaded tree-sitter-highlight v0.24.7
Downloaded vsimd v0.8.0
Downloaded memchr v2.8.0
Downloaded tinyvec v1.11.0
Downloaded utf8_iter v1.0.4
Downloaded bit-set v0.8.0
Downloaded anstyle-parse v1.0.0
Downloaded bcrypt-pbkdf v0.10.0
Downloaded zmij v1.0.21
Downloaded indicatif v0.18.4
Downloaded log v0.4.29
Downloaded inquire v0.9.4
Downloaded parking_lot v0.12.5
Downloaded icu_properties v2.1.2
Downloaded bitflags v2.11.0
Downloaded typenum v1.20.1
Downloaded chacha20poly1305 v0.10.1
Downloaded num-bigint-dig v0.8.6
Downloaded bytesize v2.3.1
Downloaded iana-time-zone v0.1.65
Downloaded regex v1.12.3
Downloaded indexmap v2.13.0
Downloaded bit-vec v0.8.0
Downloaded gix-transport v0.57.0
Downloaded pretty_assertions v1.4.1
Downloaded nu-ansi-term v0.50.3
Downloaded gix-url v0.36.0
Downloaded mio v1.1.1
Downloaded aes v0.8.4
Downloaded nonempty v0.12.0
Downloaded icu_collections v2.1.1
Downloaded gix-ref v0.63.0
Downloaded gix-diff v0.63.0
Downloaded prodash v31.0.0
Downloaded tracing-core v0.1.36
Downloaded icu_properties_data v2.1.2
Downloaded heapless v0.8.0
Downloaded anstyle-parse v0.2.7
Downloaded tree-sitter-go v0.23.4
Downloaded flate2 v1.1.9
Downloaded sysinfo v0.37.2
Downloaded once_cell v1.21.4
Downloaded byteorder v1.5.0
Downloaded tree-sitter v0.24.7
Downloaded jiff-static v0.2.23
Downloaded pkcs1 v0.7.5
Downloaded unicode-segmentation v1.12.0
Downloaded aes-gcm v0.10.3
Downloaded itertools v0.14.0
Downloaded zerovec v0.11.5
Downloaded crossbeam-channel v0.5.15
Downloaded jsonschema v0.30.0
Downloaded fraction v0.15.3
Downloaded sha1-checked v0.10.0
Downloaded hashbrown v0.16.1
Downloaded icu_normalizer v2.1.1
Downloaded num-traits v0.2.19
Downloaded proc-macro2 v1.0.106
Downloaded unicode-ident v1.0.24
Downloaded gix-pack v0.70.0
Downloaded cc v1.2.57
Downloaded syn v1.0.109
Downloaded arc-swap v1.9.1
Downloaded zerotrie v0.2.3
Downloaded vcpkg v0.2.15
Downloaded zlib-rs v0.6.5
Downloaded regex-automata v0.4.14
Downloaded url v2.5.8
Downloaded rustix v1.1.4
Downloaded syn v2.0.117
Downloaded zerocopy v0.8.42
Downloaded tree-sitter-c v0.23.4
Downloaded unicode-normalization v0.1.25
Downloaded libm v0.2.16
Downloaded object v0.37.3
Downloaded cyphernet v0.5.4
Downloaded bloomy v1.2.0
Downloaded tree-sitter-bash v0.23.3
Downloaded idna v1.1.0
Downloaded aho-corasick v1.1.4
Downloaded tracing v0.1.44
Downloaded p521 v0.13.3
Downloaded proptest v1.10.0
Downloaded tracing-subscriber v0.3.23
Downloaded tree-sitter-python v0.23.6
Downloaded git2 v0.21.0
Downloaded p384 v0.13.1
Downloaded portable-atomic v1.13.1
Downloaded jiff v0.2.23
Downloaded gimli v0.32.3
Downloaded tree-sitter-typescript v0.23.2
Downloaded sha3 v0.10.8
Downloaded tokio v1.50.0
Downloaded libc v0.2.183
Downloaded unicode-width v0.2.2
Downloaded libz-sys v1.1.25
Downloaded tree-sitter-rust v0.23.3
Downloaded tree-sitter-md v0.3.2
Downloaded bstr v1.12.1
Downloaded tree-sitter-ruby v0.23.1
Downloaded sqlite3-src v0.7.0
Downloaded libgit2-sys v0.18.4+1.9.3
Downloaded linux-raw-sys v0.12.1
Compiling libc v0.2.183
Compiling proc-macro2 v1.0.106
Compiling unicode-ident v1.0.24
Compiling quote v1.0.45
Compiling serde_core v1.0.228
Checking cfg-if v1.0.4
Compiling serde v1.0.228
Compiling version_check v0.9.5
Compiling generic-array v0.14.7
Compiling syn v2.0.117
Checking getrandom v0.2.17
Checking typenum v1.20.1
Checking rand_core v0.6.4
Checking memchr v2.8.0
Compiling find-msvc-tools v0.1.9
Compiling shlex v1.3.0
Compiling jobserver v0.1.34
Checking subtle v2.6.1
Checking const-oid v0.9.6
Checking smallvec v1.15.1
Checking regex-syntax v0.8.10
Compiling cc v1.2.57
Checking aho-corasick v1.1.4
Checking cpufeatures v0.2.17
Compiling thiserror v2.0.18
Checking fastrand v2.3.0
Compiling parking_lot_core v0.9.12
Checking regex-automata v0.4.14
Checking scopeguard v1.2.0
Checking lock_api v0.4.14
Compiling typeid v1.0.3
Checking parking_lot v0.12.5
Checking stable_deref_trait v1.2.1
Checking bitflags v2.11.0
Compiling erased-serde v0.4.10
Checking itoa v1.0.17
Checking serde_fmt v1.1.0
Checking hashbrown v0.16.1
Checking value-bag-serde1 v1.12.0
Checking tinyvec_macros v0.1.1
Checking gix-trace v0.1.21
Checking byteorder v1.5.0
Checking tinyvec v1.11.0
Checking value-bag v1.12.0
Checking unicode-normalization v0.1.25
Checking log v0.4.29
Compiling serde_derive v1.0.228
Compiling thiserror-impl v2.0.18
Checking bstr v1.12.1
Checking gix-utils v0.3.2
Compiling crc32fast v1.5.0
Compiling autocfg v1.5.0
Checking gix-validate v0.11.1
Compiling getrandom v0.4.3
Checking same-file v1.0.6
Compiling pkg-config v0.3.32
Compiling libm v0.2.16
Checking walkdir v2.5.0
Checking gix-path v0.12.0
Compiling num-traits v0.2.19
Checking prodash v31.0.0
Checking zlib-rs v0.6.5
Compiling heapless v0.8.0
Checking hash32 v0.3.1
Compiling zerocopy v0.8.42
Compiling rustix v1.1.4
Checking gix-features v0.48.0
Compiling zmij v1.0.21
Checking linux-raw-sys v0.12.1
Checking faster-hex v0.10.0
Checking equivalent v1.0.2
Compiling serde_json v1.0.149
Checking zeroize v1.9.0
Checking indexmap v2.13.0
Checking crypto-common v0.1.7
Checking block-buffer v0.10.4
Checking digest v0.10.7
Compiling ref-cast v1.0.25
Checking sha1 v0.10.6
Checking sha1-checked v0.10.0
Checking block-padding v0.3.3
Compiling ref-cast-impl v1.0.25
Checking inout v0.1.4
Checking gix-hash v0.25.0
Checking sha2 v0.10.9
Checking once_cell v1.21.4
Checking dyn-clone v1.0.20
Checking cipher v0.4.4
Compiling serde_derive_internals v0.29.1
Compiling vcpkg v0.2.15
Compiling libz-sys v1.1.25
Checking der v0.7.10
Compiling schemars_derive v1.2.1
Checking spin v0.9.9
Checking lazy_static v1.5.0
Checking ppv-lite86 v0.2.21
Checking tempfile v3.27.0
Checking rand_chacha v0.3.1
Compiling syn v1.0.109
Compiling libgit2-sys v0.18.4+1.9.3
Checking rand v0.8.5
Checking hmac v0.12.1
Checking universal-hash v0.5.1
Checking num-integer v0.1.46
Checking schemars v1.2.1
Checking opaque-debug v0.3.1
Checking spki v0.7.3
Checking signature v2.2.0
Checking ff v0.13.1
Compiling tree-sitter-language v0.1.7
Checking base16ct v0.2.0
Checking group v0.13.0
Checking sec1 v0.7.3
Checking crypto-bigint v0.5.5
Compiling data-encoding v2.10.0
Compiling data-encoding-macro-internal v0.1.17
Checking elliptic-curve v0.13.8
Compiling amplify_syn v2.0.1
Checking num-iter v0.1.45
Checking aead v0.5.2
Compiling match-lookup v0.1.2
Compiling semver v1.0.27
Checking const-str v0.4.3
Checking signature v1.6.4
Checking ed25519 v1.5.3
Compiling amplify_derive v4.0.1
Checking base256emoji v1.0.2
Checking data-encoding-macro v0.1.19
Compiling rustc_version v0.4.1
Checking poly1305 v0.8.0
Checking rfc6979 v0.4.0
Checking qcheck v1.0.0
Checking chacha20 v0.9.1
Checking base-x v0.2.11
Checking ascii v1.1.0
Checking amplify_num v0.5.3
Checking multibase v0.9.2
Checking ecdsa v0.16.9
Compiling curve25519-dalek v4.1.3
Checking ec25519 v0.1.0
Checking primeorder v0.13.6
Checking amplify v4.9.0
Checking polyval v0.6.2
Checking base64ct v1.8.3
Compiling num-bigint-dig v0.8.6
Checking cyphergraphy v0.3.1
Checking pem-rfc7468 v0.7.0
Checking ghash v0.5.1
Checking pkcs8 v0.10.2
Checking pbkdf2 v0.12.2
Checking aes v0.8.4
Checking ctr v0.9.2
Checking radicle-git-ref-format v0.2.0 (/72b45f93-4c58-4ce9-9ca9-8995a207ab4a/w/crates/radicle-git-ref-format)
Compiling sqlite3-src v0.7.0
Checking gix-error v0.2.3
Compiling curve25519-dalek-derive v0.1.1
Checking keccak v0.1.6
Checking sha3 v0.10.8
Checking aes-gcm v0.10.3
Checking pkcs1 v0.7.5
Checking ssh-encoding v0.2.0
Checking ed25519 v2.2.3
Checking cbc v0.1.2
Checking blowfish v0.9.1
Checking base32 v0.4.0
Checking bcrypt-pbkdf v0.10.0
Checking cypheraddr v0.4.1
Checking rsa v0.9.10
Checking ssh-cipher v0.2.0
Checking ed25519-dalek v2.2.0
Checking p521 v0.13.3
Checking p256 v0.13.2
Checking p384 v0.13.1
Checking chacha20poly1305 v0.10.1
Compiling synstructure v0.13.2
Checking ssh-key v0.6.7
Checking noise-framework v0.4.1
Checking socks5-client v0.4.3
Checking secrecy v0.10.3
Checking percent-encoding v2.3.2
Checking cyphernet v0.5.4
Checking ssh-agent-lib v0.6.0
Compiling zerofrom-derive v0.1.6
Compiling yoke-derive v0.8.1
Checking zerofrom v0.1.6
Checking nonempty v0.9.0
Checking yoke v0.8.1
Checking utf8parse v0.2.2
Checking anstyle-query v1.1.5
Checking jiff v0.2.23
Compiling zerovec-derive v0.11.2
Checking zerovec v0.11.5
Checking radicle-localtime v0.1.0 (/72b45f93-4c58-4ce9-9ca9-8995a207ab4a/w/crates/radicle-localtime)
Compiling displaydoc v0.2.5
Checking errno v0.3.14
Checking is_terminal_polyfill v1.70.2
Checking colorchoice v1.0.5
Checking anstyle v1.0.14
Checking base64 v0.21.7
Checking gix-hashtable v0.15.0
Checking gix-date v0.15.3
Checking siphasher v1.0.2
Checking gix-actor v0.41.0
Checking radicle-dag v0.10.0 (/72b45f93-4c58-4ce9-9ca9-8995a207ab4a/w/crates/radicle-dag)
Checking gix-object v0.60.0
Checking memmap2 v0.9.10
Checking nonempty v0.12.0
Checking tinystr v0.8.2
Checking gix-chunk v0.7.1
Checking writeable v0.6.2
Compiling radicle v0.25.1 (/72b45f93-4c58-4ce9-9ca9-8995a207ab4a/w/crates/radicle)
Checking litemap v0.8.1
Checking icu_locale_core v2.1.1
Checking gix-commitgraph v0.37.0
Checking zerotrie v0.2.3
Checking potential_utf v0.1.4
Checking anstyle-parse v1.0.0
Checking serde-untagged v0.1.9
Checking bytesize v2.3.1
Compiling icu_normalizer_data v2.1.1
Compiling icu_properties_data v2.1.2
Checking fast-glob v0.3.3
Checking dunce v1.0.5
Checking anstream v1.0.0
Checking icu_provider v2.1.1
Checking icu_collections v2.1.1
Checking gix-revwalk v0.31.0
Checking gix-fs v0.21.1
Checking mio v1.1.1
Checking sem_safe v0.2.1
Checking adler2 v2.0.1
Checking simd-adler32 v0.3.8
Checking signals_receipts v0.2.5
Checking miniz_oxide v0.8.9
Checking gix-tempfile v23.0.0
Checking gix-quote v0.7.1
Checking icu_properties v2.1.2
Checking icu_normalizer v2.1.1
Checking iana-time-zone v0.1.65
Checking either v1.15.0
Checking shell-words v1.1.1
Compiling signal-hook v0.3.18
Compiling unicode-segmentation v1.12.0
Checking idna_adapter v1.2.1
Checking gix-command v0.9.0
Checking chrono v0.4.44
Compiling convert_case v0.10.0
Checking radicle-signals v0.12.1 (/72b45f93-4c58-4ce9-9ca9-8995a207ab4a/w/crates/radicle-signals)
Checking signal-hook-registry v1.4.8
Checking colored v2.2.0
Compiling rustversion v1.0.22
Compiling object v0.37.3
Checking utf8_iter v1.0.4
Compiling getrandom v0.3.4
Checking idna v1.1.0
Compiling derive_more-impl v2.1.1
Checking gix-lock v23.0.0
Checking gix-url v0.36.0
Checking gix-config-value v0.18.0
Checking gix-sec v0.14.0
Compiling thiserror v1.0.69
Checking unicode-width v0.2.2
Checking gimli v0.32.3
Compiling portable-atomic v1.13.1
Compiling litrs v1.0.0
Compiling document-features v0.2.12
Checking gix-prompt v0.15.0
Checking derive_more v2.1.1
Checking signal-hook-mio v0.2.5
Checking addr2line v0.25.1
Checking radicle-log v0.2.0 (/72b45f93-4c58-4ce9-9ca9-8995a207ab4a/w/crates/radicle-log)
Checking gix-traverse v0.57.0
Checking gix-revision v0.45.0
Checking gix-diff v0.63.0
Checking anstyle-parse v0.2.7
Checking gix-packetline v0.21.5
Checking gix-glob v0.26.0
Compiling thiserror-impl v1.0.69
Checking rustc-demangle v0.1.27
Checking backtrace v0.3.76
Checking gix-refspec v0.41.0
Checking gix-transport v0.57.0
Checking anstream v0.6.21
Checking gix-pack v0.70.0
Checking arc-swap v1.9.1
Checking crossterm v0.29.0
Checking gix-credentials v0.38.0
Checking console v0.16.3
Checking gix-shallow v0.12.0
Checking gix-ref v0.63.0
Checking gix-negotiate v0.31.0
Checking form_urlencoded v1.2.2
Checking regex v1.12.3
Compiling maybe-async v0.2.10
Compiling tree-sitter v0.24.7
Checking unit-prefix v0.5.2
Checking indicatif v0.18.4
Checking gix-protocol v0.61.0
Checking url v2.5.8
Checking gix-odb v0.80.0
Checking inquire v0.9.4
Checking unicode-display-width v0.3.0
Checking uuid v1.22.0
Checking bytes v1.11.1
Checking snapbox-macros v1.1.0
Checking salsa20 v0.10.2
Checking siphasher v0.3.11
Checking streaming-iterator v0.1.9
Checking normalize-line-endings v0.3.0
Checking clap_lex v1.1.0
Compiling heck v0.5.0
Compiling crossbeam-utils v0.8.21
Checking similar v3.1.1
Checking strsim v0.11.1
Checking clap_builder v4.6.0
Checking snapbox v1.2.2
Compiling clap_derive v4.6.0
Checking sqlite3-sys v0.18.0
Checking sqlite v0.37.0
Checking bloomy v1.2.0
Checking radicle-crypto v0.19.0 (/72b45f93-4c58-4ce9-9ca9-8995a207ab4a/w/crates/radicle-crypto)
Checking scrypt v0.11.0
Checking systemd-journal-logger v2.2.2
Compiling tree-sitter-python v0.23.6
Checking radicle-address v0.1.0 (/72b45f93-4c58-4ce9-9ca9-8995a207ab4a/w/crates/radicle-address)
Compiling tree-sitter-toml-ng v0.6.0
Compiling tree-sitter-css v0.23.2
Compiling tree-sitter-json v0.24.8
Compiling tree-sitter-md v0.3.2
Compiling tree-sitter-bash v0.23.3
Compiling tree-sitter-c v0.23.4
Compiling tree-sitter-go v0.23.4
Compiling tree-sitter-ruby v0.23.1
Compiling tree-sitter-rust v0.23.3
Compiling tree-sitter-html v0.23.2
Compiling tree-sitter-typescript v0.23.2
Checking toml_datetime v0.7.5+spec-1.1.0
Checking serde_spanned v1.0.4
Checking toml_writer v1.0.7+spec-1.1.0
Compiling anyhow v1.0.102
Checking bit-vec v0.8.0
Checking pin-project-lite v0.2.17
Checking tokio v1.50.0
Checking bit-set v0.8.0
Checking toml v0.9.12+spec-1.1.0
Checking clap v4.6.0
Checking rand_core v0.9.5
Checking sysinfo v0.37.2
Checking diff v0.1.13
Compiling radicle-node v0.21.1 (/72b45f93-4c58-4ce9-9ca9-8995a207ab4a/w/crates/radicle-node)
Compiling radicle-cli v0.23.0 (/72b45f93-4c58-4ce9-9ca9-8995a207ab4a/w/crates/radicle-cli)
Checking yansi v1.0.1
Checking human-panic v2.0.6
Checking pretty_assertions v1.4.1
Checking crossbeam-channel v0.5.15
Checking clap_complete v4.6.0
Checking structured-logger v1.0.5
Checking radicle-systemd v0.13.0 (/72b45f93-4c58-4ce9-9ca9-8995a207ab4a/w/crates/radicle-systemd)
Checking tree-sitter-highlight v0.24.7
Checking itertools v0.14.0
Checking socket2 v0.5.10
Checking lexopt v0.3.2
Compiling escargot v0.5.15
Checking rs-release v0.1.11
Checking humantime v2.3.0
Checking timeago v0.4.2
Checking wait-timeout v0.2.1
Checking quick-error v1.2.3
Checking fnv v1.0.7
Checking rusty-fork v0.3.1
Checking rand_chacha v0.9.0
Checking rand_xorshift v0.4.0
Checking rand v0.9.2
Compiling qcheck-macros v1.0.0
Checking num-bigint v0.4.6
Compiling ahash v0.8.12
Checking unarray v0.1.4
Checking proptest v1.10.0
Checking num-complex v0.4.6
Checking env_filter v1.0.0
Checking borrow-or-share v0.2.4
Checking num-rational v0.4.2
Checking fluent-uri v0.3.2
Checking num v0.4.3
Checking env_logger v0.11.9
Checking flate2 v1.1.9
Checking phf_shared v0.11.3
Compiling test-log-macros v0.2.19
Checking hex-literal v1.1.0
Checking vsimd v0.8.0
Compiling radicle-remote-helper v0.18.1 (/72b45f93-4c58-4ce9-9ca9-8995a207ab4a/w/crates/radicle-remote-helper)
Checking outref v0.5.2
Checking uuid-simd v0.8.0
Checking test-log v0.2.19
Checking phf v0.11.3
Checking referencing v0.30.0
Checking fraction v0.15.3
Checking fancy-regex v0.14.0
Checking email_address v0.2.9
Checking num-cmp v0.1.0
Checking bytecount v0.6.9
Checking base64 v0.22.1
Checking emojis v0.6.4
Compiling pastey v0.2.1
Checking jsonschema v0.30.0
Checking radicle-windows v0.1.0 (/72b45f93-4c58-4ce9-9ca9-8995a207ab4a/w/crates/radicle-windows)
Checking git2 v0.21.0
Checking radicle-oid v0.2.2 (/72b45f93-4c58-4ce9-9ca9-8995a207ab4a/w/crates/radicle-oid)
Checking radicle-git-metadata v0.2.1 (/72b45f93-4c58-4ce9-9ca9-8995a207ab4a/w/crates/radicle-git-metadata)
Checking radicle-term v0.19.1 (/72b45f93-4c58-4ce9-9ca9-8995a207ab4a/w/crates/radicle-term)
Checking radicle-core v0.4.1 (/72b45f93-4c58-4ce9-9ca9-8995a207ab4a/w/crates/radicle-core)
Checking radicle-cob v0.21.1 (/72b45f93-4c58-4ce9-9ca9-8995a207ab4a/w/crates/radicle-cob)
Checking radicle-surf v0.29.0 (/72b45f93-4c58-4ce9-9ca9-8995a207ab4a/w/crates/radicle-surf)
Checking radicle-cli-test v0.14.1 (/72b45f93-4c58-4ce9-9ca9-8995a207ab4a/w/crates/radicle-cli-test)
Checking radicle-fetch v0.21.1 (/72b45f93-4c58-4ce9-9ca9-8995a207ab4a/w/crates/radicle-fetch)
Checking radicle-schemars v0.9.1 (/72b45f93-4c58-4ce9-9ca9-8995a207ab4a/w/crates/radicle-schemars)
Checking radicle-protocol v0.9.1 (/72b45f93-4c58-4ce9-9ca9-8995a207ab4a/w/crates/radicle-protocol)
Finished `dev` profile [unoptimized + debuginfo] target(s) in 41.56s
+ cargo build --all-targets --workspace
Compiling libc v0.2.183
Compiling cfg-if v1.0.4
Compiling serde_core v1.0.228
Compiling typenum v1.20.1
Compiling memchr v2.8.0
Compiling shlex v1.3.0
Compiling getrandom v0.2.17
Compiling jobserver v0.1.34
Compiling subtle v2.6.1
Compiling rand_core v0.6.4
Compiling cc v1.2.57
Compiling const-oid v0.9.6
Compiling smallvec v1.15.1
Compiling regex-syntax v0.8.10
Compiling aho-corasick v1.1.4
Compiling serde v1.0.228
Compiling zeroize v1.9.0
Compiling cpufeatures v0.2.17
Compiling thiserror v2.0.18
Compiling fastrand v2.3.0
Compiling generic-array v0.14.7
Compiling scopeguard v1.2.0
Compiling regex-automata v0.4.14
Compiling crypto-common v0.1.7
Compiling block-buffer v0.10.4
Compiling digest v0.10.7
Compiling lock_api v0.4.14
Compiling parking_lot_core v0.9.12
Compiling bitflags v2.11.0
Compiling parking_lot v0.12.5
Compiling stable_deref_trait v1.2.1
Compiling typeid v1.0.3
Compiling erased-serde v0.4.10
Compiling itoa v1.0.17
Compiling serde_fmt v1.1.0
Compiling hashbrown v0.16.1
Compiling byteorder v1.5.0
Compiling value-bag-serde1 v1.12.0
Compiling gix-trace v0.1.21
Compiling tinyvec_macros v0.1.1
Compiling tinyvec v1.11.0
Compiling value-bag v1.12.0
Compiling log v0.4.29
Compiling unicode-normalization v0.1.25
Compiling crc32fast v1.5.0
Compiling same-file v1.0.6
Compiling prodash v31.0.0
Compiling gix-utils v0.3.2
Compiling walkdir v2.5.0
Compiling bstr v1.12.1
Compiling zlib-rs v0.6.5
Compiling libm v0.2.16
Compiling gix-validate v0.11.1
Compiling gix-path v0.12.0
Compiling getrandom v0.4.3
Compiling num-traits v0.2.19
Compiling hash32 v0.3.1
Compiling heapless v0.8.0
Compiling linux-raw-sys v0.12.1
Compiling faster-hex v0.10.0
Compiling zerocopy v0.8.42
Compiling equivalent v1.0.2
Compiling indexmap v2.13.0
Compiling rustix v1.1.4
Compiling zmij v1.0.21
Compiling gix-features v0.48.0
Compiling sha1 v0.10.6
Compiling serde_json v1.0.149
Compiling sha1-checked v0.10.0
Compiling block-padding v0.3.3
Compiling ref-cast v1.0.25
Compiling inout v0.1.4
Compiling gix-hash v0.25.0
Compiling sha2 v0.10.9
Compiling once_cell v1.21.4
Compiling dyn-clone v1.0.20
Compiling ppv-lite86 v0.2.21
Compiling cipher v0.4.4
Compiling libz-sys v1.1.25
Compiling der v0.7.10
Compiling spin v0.9.9
Compiling lazy_static v1.5.0
Compiling schemars v1.2.1
Compiling rand_chacha v0.3.1
Compiling tempfile v3.27.0
Compiling rand v0.8.5
Compiling libgit2-sys v0.18.4+1.9.3
Compiling num-integer v0.1.46
Compiling hmac v0.12.1
Compiling universal-hash v0.5.1
Compiling opaque-debug v0.3.1
Compiling spki v0.7.3
Compiling signature v2.2.0
Compiling ff v0.13.1
Compiling base16ct v0.2.0
Compiling crypto-bigint v0.5.5
Compiling sec1 v0.7.3
Compiling group v0.13.0
Compiling num-iter v0.1.45
Compiling aead v0.5.2
Compiling data-encoding v2.10.0
Compiling const-str v0.4.3
Compiling signature v1.6.4
Compiling ed25519 v1.5.3
Compiling elliptic-curve v0.13.8
Compiling base256emoji v1.0.2
Compiling data-encoding-macro v0.1.19
Compiling poly1305 v0.8.0
Compiling rfc6979 v0.4.0
Compiling qcheck v1.0.0
Compiling chacha20 v0.9.1
Compiling base-x v0.2.11
Compiling amplify_num v0.5.3
Compiling ascii v1.1.0
Compiling multibase v0.9.2
Compiling ecdsa v0.16.9
Compiling primeorder v0.13.6
Compiling amplify v4.9.0
Compiling ec25519 v0.1.0
Compiling polyval v0.6.2
Compiling base64ct v1.8.3
Compiling ghash v0.5.1
Compiling cyphergraphy v0.3.1
Compiling pkcs8 v0.10.2
Compiling pem-rfc7468 v0.7.0
Compiling pbkdf2 v0.12.2
Compiling ctr v0.9.2
Compiling aes v0.8.4
Compiling gix-error v0.2.3
Compiling radicle-git-ref-format v0.2.0 (/72b45f93-4c58-4ce9-9ca9-8995a207ab4a/w/crates/radicle-git-ref-format)
Compiling sqlite3-src v0.7.0
Compiling keccak v0.1.6
Compiling sha3 v0.10.8
Compiling curve25519-dalek v4.1.3
Compiling aes-gcm v0.10.3
Compiling ssh-encoding v0.2.0
Compiling pkcs1 v0.7.5
Compiling num-bigint-dig v0.8.6
Compiling ed25519 v2.2.3
Compiling blowfish v0.9.1
Compiling cbc v0.1.2
Compiling base32 v0.4.0
Compiling cypheraddr v0.4.1
Compiling ssh-cipher v0.2.0
Compiling bcrypt-pbkdf v0.10.0
Compiling ed25519-dalek v2.2.0
Compiling rsa v0.9.10
Compiling p521 v0.13.3
Compiling p384 v0.13.1
Compiling p256 v0.13.2
Compiling chacha20poly1305 v0.10.1
Compiling ssh-key v0.6.7
Compiling noise-framework v0.4.1
Compiling socks5-client v0.4.3
Compiling secrecy v0.10.3
Compiling percent-encoding v2.3.2
Compiling cyphernet v0.5.4
Compiling zerofrom v0.1.6
Compiling ssh-agent-lib v0.6.0
Compiling yoke v0.8.1
Compiling nonempty v0.9.0
Compiling anstyle-query v1.1.5
Compiling utf8parse v0.2.2
Compiling jiff v0.2.23
Compiling zerovec v0.11.5
Compiling radicle-localtime v0.1.0 (/72b45f93-4c58-4ce9-9ca9-8995a207ab4a/w/crates/radicle-localtime)
Compiling errno v0.3.14
Compiling anstyle v1.0.14
Compiling colorchoice v1.0.5
Compiling is_terminal_polyfill v1.70.2
Compiling base64 v0.21.7
Compiling gix-hashtable v0.15.0
Compiling siphasher v1.0.2
Compiling tree-sitter-language v0.1.7
Compiling radicle-dag v0.10.0 (/72b45f93-4c58-4ce9-9ca9-8995a207ab4a/w/crates/radicle-dag)
Compiling memmap2 v0.9.10
Compiling nonempty v0.12.0
Compiling tinystr v0.8.2
Compiling gix-date v0.15.3
Compiling gix-actor v0.41.0
Compiling gix-object v0.60.0
Compiling gix-chunk v0.7.1
Compiling radicle v0.25.1 (/72b45f93-4c58-4ce9-9ca9-8995a207ab4a/w/crates/radicle)
Compiling litemap v0.8.1
Compiling writeable v0.6.2
Compiling icu_locale_core v2.1.1
Compiling gix-commitgraph v0.37.0
Compiling zerotrie v0.2.3
Compiling potential_utf v0.1.4
Compiling anstyle-parse v1.0.0
Compiling serde-untagged v0.1.9
Compiling bytesize v2.3.1
Compiling dunce v1.0.5
Compiling fast-glob v0.3.3
Compiling anstream v1.0.0
Compiling icu_collections v2.1.1
Compiling icu_provider v2.1.1
Compiling gix-revwalk v0.31.0
Compiling gix-fs v0.21.1
Compiling mio v1.1.1
Compiling sem_safe v0.2.1
Compiling adler2 v2.0.1
Compiling simd-adler32 v0.3.8
Compiling miniz_oxide v0.8.9
Compiling signals_receipts v0.2.5
Compiling gix-tempfile v23.0.0
Compiling icu_properties_data v2.1.2
Compiling icu_normalizer_data v2.1.1
Compiling gix-quote v0.7.1
Compiling unicode-segmentation v1.12.0
Compiling icu_normalizer v2.1.1
Compiling icu_properties v2.1.2
Compiling either v1.15.0
Compiling iana-time-zone v0.1.65
Compiling shell-words v1.1.1
Compiling gix-command v0.9.0
Compiling idna_adapter v1.2.1
Compiling chrono v0.4.44
Compiling convert_case v0.10.0
Compiling radicle-signals v0.12.1 (/72b45f93-4c58-4ce9-9ca9-8995a207ab4a/w/crates/radicle-signals)
Compiling signal-hook-registry v1.4.8
Compiling colored v2.2.0
Compiling utf8_iter v1.0.4
Compiling idna v1.1.0
Compiling signal-hook v0.3.18
Compiling derive_more-impl v2.1.1
Compiling gix-lock v23.0.0
Compiling gix-url v0.36.0
Compiling gix-config-value v0.18.0
Compiling gix-sec v0.14.0
Compiling gimli v0.32.3
Compiling unicode-width v0.2.2
Compiling gix-prompt v0.15.0
Compiling derive_more v2.1.1
Compiling signal-hook-mio v0.2.5
Compiling getrandom v0.3.4
Compiling object v0.37.3
Compiling addr2line v0.25.1
Compiling radicle-log v0.2.0 (/72b45f93-4c58-4ce9-9ca9-8995a207ab4a/w/crates/radicle-log)
Compiling gix-traverse v0.57.0
Compiling gix-revision v0.45.0
Compiling gix-diff v0.63.0
Compiling anstyle-parse v0.2.7
Compiling gix-glob v0.26.0
Compiling gix-packetline v0.21.5
Compiling rustc-demangle v0.1.27
Compiling thiserror v1.0.69
Compiling gix-transport v0.57.0
Compiling backtrace v0.3.76
Compiling gix-refspec v0.41.0
Compiling sqlite3-sys v0.18.0
Compiling sqlite v0.37.0
Compiling radicle-crypto v0.19.0 (/72b45f93-4c58-4ce9-9ca9-8995a207ab4a/w/crates/radicle-crypto)
Compiling anstream v0.6.21
Compiling radicle-address v0.1.0 (/72b45f93-4c58-4ce9-9ca9-8995a207ab4a/w/crates/radicle-address)
Compiling gix-pack v0.70.0
Compiling arc-swap v1.9.1
Compiling crossterm v0.29.0
Compiling gix-credentials v0.38.0
Compiling portable-atomic v1.13.1
Compiling console v0.16.3
Compiling gix-shallow v0.12.0
Compiling gix-ref v0.63.0
Compiling gix-negotiate v0.31.0
Compiling form_urlencoded v1.2.2
Compiling regex v1.12.3
Compiling tree-sitter v0.24.7
Compiling unit-prefix v0.5.2
Compiling gix-protocol v0.61.0
Compiling indicatif v0.18.4
Compiling url v2.5.8
Compiling inquire v0.9.4
Compiling gix-odb v0.80.0
Compiling unicode-display-width v0.3.0
Compiling uuid v1.22.0
Compiling bytes v1.11.1
Compiling snapbox-macros v1.1.0
Compiling salsa20 v0.10.2
Compiling siphasher v0.3.11
Compiling streaming-iterator v0.1.9
Compiling clap_lex v1.1.0
Compiling strsim v0.11.1
Compiling normalize-line-endings v0.3.0
Compiling similar v3.1.1
Compiling clap_builder v4.6.0
Compiling snapbox v1.2.2
Compiling bloomy v1.2.0
Compiling scrypt v0.11.0
Compiling systemd-journal-logger v2.2.2
Compiling tree-sitter-python v0.23.6
Compiling tree-sitter-toml-ng v0.6.0
Compiling tree-sitter-rust v0.23.3
Compiling tree-sitter-c v0.23.4
Compiling tree-sitter-go v0.23.4
Compiling tree-sitter-ruby v0.23.1
Compiling tree-sitter-typescript v0.23.2
Compiling tree-sitter-css v0.23.2
Compiling tree-sitter-md v0.3.2
Compiling tree-sitter-bash v0.23.3
Compiling tree-sitter-html v0.23.2
Compiling tree-sitter-json v0.24.8
Compiling toml_datetime v0.7.5+spec-1.1.0
Compiling serde_spanned v1.0.4
Compiling bit-vec v0.8.0
Compiling pin-project-lite v0.2.17
Compiling toml_writer v1.0.7+spec-1.1.0
Compiling tokio v1.50.0
Compiling toml v0.9.12+spec-1.1.0
Compiling bit-set v0.8.0
Compiling clap v4.6.0
Compiling crossbeam-utils v0.8.21
Compiling rand_core v0.9.5
Compiling sysinfo v0.37.2
Compiling diff v0.1.13
Compiling radicle-cli v0.23.0 (/72b45f93-4c58-4ce9-9ca9-8995a207ab4a/w/crates/radicle-cli)
Compiling radicle-node v0.21.1 (/72b45f93-4c58-4ce9-9ca9-8995a207ab4a/w/crates/radicle-node)
Compiling yansi v1.0.1
Compiling pretty_assertions v1.4.1
Compiling human-panic v2.0.6
Compiling crossbeam-channel v0.5.15
Compiling git2 v0.21.0
Compiling clap_complete v4.6.0
Compiling structured-logger v1.0.5
Compiling anyhow v1.0.102
Compiling radicle-systemd v0.13.0 (/72b45f93-4c58-4ce9-9ca9-8995a207ab4a/w/crates/radicle-systemd)
Compiling tree-sitter-highlight v0.24.7
Compiling itertools v0.14.0
Compiling socket2 v0.5.10
Compiling lexopt v0.3.2
Compiling timeago v0.4.2
Compiling rs-release v0.1.11
Compiling humantime v2.3.0
Compiling wait-timeout v0.2.1
Compiling quick-error v1.2.3
Compiling fnv v1.0.7
Compiling rusty-fork v0.3.1
Compiling radicle-oid v0.2.2 (/72b45f93-4c58-4ce9-9ca9-8995a207ab4a/w/crates/radicle-oid)
Compiling radicle-git-metadata v0.2.1 (/72b45f93-4c58-4ce9-9ca9-8995a207ab4a/w/crates/radicle-git-metadata)
Compiling radicle-core v0.4.1 (/72b45f93-4c58-4ce9-9ca9-8995a207ab4a/w/crates/radicle-core)
Compiling radicle-term v0.19.1 (/72b45f93-4c58-4ce9-9ca9-8995a207ab4a/w/crates/radicle-term)
Compiling radicle-cob v0.21.1 (/72b45f93-4c58-4ce9-9ca9-8995a207ab4a/w/crates/radicle-cob)
Compiling radicle-surf v0.29.0 (/72b45f93-4c58-4ce9-9ca9-8995a207ab4a/w/crates/radicle-surf)
Compiling escargot v0.5.15
Compiling rand_chacha v0.9.0
Compiling rand v0.9.2
Compiling rand_xorshift v0.4.0
Compiling num-bigint v0.4.6
Compiling unarray v0.1.4
Compiling num-complex v0.4.6
Compiling proptest v1.10.0
Compiling env_filter v1.0.0
Compiling borrow-or-share v0.2.4
Compiling fluent-uri v0.3.2
Compiling num-rational v0.4.2
Compiling env_logger v0.11.9
Compiling num v0.4.3
Compiling ahash v0.8.12
Compiling radicle-cli-test v0.14.1 (/72b45f93-4c58-4ce9-9ca9-8995a207ab4a/w/crates/radicle-cli-test)
Compiling flate2 v1.1.9
Compiling phf_shared v0.11.3
Compiling outref v0.5.2
Compiling hex-literal v1.1.0
Compiling vsimd v0.8.0
Compiling radicle-remote-helper v0.18.1 (/72b45f93-4c58-4ce9-9ca9-8995a207ab4a/w/crates/radicle-remote-helper)
Compiling uuid-simd v0.8.0
Compiling test-log v0.2.19
Compiling phf v0.11.3
Compiling referencing v0.30.0
Compiling fraction v0.15.3
Compiling fancy-regex v0.14.0
Compiling email_address v0.2.9
Compiling num-cmp v0.1.0
Compiling bytecount v0.6.9
Compiling base64 v0.22.1
Compiling emojis v0.6.4
Compiling jsonschema v0.30.0
Compiling radicle-fetch v0.21.1 (/72b45f93-4c58-4ce9-9ca9-8995a207ab4a/w/crates/radicle-fetch)
Compiling radicle-protocol v0.9.1 (/72b45f93-4c58-4ce9-9ca9-8995a207ab4a/w/crates/radicle-protocol)
Compiling radicle-schemars v0.9.1 (/72b45f93-4c58-4ce9-9ca9-8995a207ab4a/w/crates/radicle-schemars)
Compiling radicle-windows v0.1.0 (/72b45f93-4c58-4ce9-9ca9-8995a207ab4a/w/crates/radicle-windows)
Finished `dev` profile [unoptimized + debuginfo] target(s) in 1m 02s
+ cargo doc --workspace --no-deps --all-features
Downloading crates ...
Downloaded dhat v0.3.3
Downloaded minicbor v0.13.2
Downloaded mintex v0.1.4
Downloaded rustc-hash v1.1.0
Downloaded thousands v0.2.0
Checking regex-automata v0.4.14
Compiling num-traits v0.2.19
Compiling syn v1.0.109
Compiling minicbor v0.13.2
Checking once_cell v1.21.4
Checking tempfile v3.27.0
Checking num-integer v0.1.46
Checking num-iter v0.1.45
Checking radicle-git-metadata v0.2.1 (/72b45f93-4c58-4ce9-9ca9-8995a207ab4a/w/crates/radicle-git-metadata)
Checking num-bigint-dig v0.8.6
Checking rusty-fork v0.3.1
Checking radicle-localtime v0.1.0 (/72b45f93-4c58-4ce9-9ca9-8995a207ab4a/w/crates/radicle-localtime)
Compiling amplify_syn v2.0.1
Checking rsa v0.9.10
Checking bstr v1.12.1
Checking ssh-key v0.6.7
Checking gix-validate v0.11.1
Checking gix-error v0.2.3
Compiling amplify_derive v4.0.1
Checking gix-path v0.12.0
Checking radicle-git-ref-format v0.2.0 (/72b45f93-4c58-4ce9-9ca9-8995a207ab4a/w/crates/radicle-git-ref-format)
Checking gix-features v0.48.0
Checking gix-date v0.15.3
Checking gix-hash v0.25.0
Checking gix-actor v0.41.0
Checking ssh-agent-lib v0.6.0
Checking proptest v1.10.0
Checking radicle-oid v0.2.2 (/72b45f93-4c58-4ce9-9ca9-8995a207ab4a/w/crates/radicle-oid)
Checking gix-hashtable v0.15.0
Checking gix-chunk v0.7.1
Checking gix-object v0.60.0
Checking radicle-dag v0.10.0 (/72b45f93-4c58-4ce9-9ca9-8995a207ab4a/w/crates/radicle-dag)
Checking gix-commitgraph v0.37.0
Checking gix-fs v0.21.1
Checking gix-tempfile v23.0.0
Checking gix-revwalk v0.31.0
Checking gix-quote v0.7.1
Checking miniz_oxide v0.8.9
Checking gix-command v0.9.0
Checking amplify v4.9.0
Checking chrono v0.4.44
Checking radicle-signals v0.12.1 (/72b45f93-4c58-4ce9-9ca9-8995a207ab4a/w/crates/radicle-signals)
Checking gix-lock v23.0.0
Checking cyphergraphy v0.3.1
Checking gix-url v0.36.0
Checking cypheraddr v0.4.1
Checking noise-framework v0.4.1
Checking gix-config-value v0.18.0
Checking socks5-client v0.4.3
Checking idna v1.1.0
Checking backtrace v0.3.76
Checking gix-prompt v0.15.0
Checking cyphernet v0.5.4
Checking inquire v0.9.4
Checking radicle-crypto v0.19.0 (/72b45f93-4c58-4ce9-9ca9-8995a207ab4a/w/crates/radicle-crypto)
Checking gix-traverse v0.57.0
Checking gix-revision v0.45.0
Checking radicle-address v0.1.0 (/72b45f93-4c58-4ce9-9ca9-8995a207ab4a/w/crates/radicle-address)
Checking radicle-core v0.4.1 (/72b45f93-4c58-4ce9-9ca9-8995a207ab4a/w/crates/radicle-core)
Checking radicle-cob v0.21.1 (/72b45f93-4c58-4ce9-9ca9-8995a207ab4a/w/crates/radicle-cob)
Checking gix-diff v0.63.0
Checking gix-glob v0.26.0
Checking gix-packetline v0.21.5
Checking regex v1.12.3
Checking url v2.5.8
Checking gix-transport v0.57.0
Checking tree-sitter v0.24.7
Checking radicle v0.25.1 (/72b45f93-4c58-4ce9-9ca9-8995a207ab4a/w/crates/radicle)
Checking gix-refspec v0.41.0
Checking gix-pack v0.70.0
Checking gix-credentials v0.38.0
Checking radicle-log v0.2.0 (/72b45f93-4c58-4ce9-9ca9-8995a207ab4a/w/crates/radicle-log)
Checking gix-shallow v0.12.0
Checking gix-ref v0.63.0
Checking gix-negotiate v0.31.0
Checking radicle-term v0.19.1 (/72b45f93-4c58-4ce9-9ca9-8995a207ab4a/w/crates/radicle-term)
Checking gix-protocol v0.61.0
Checking uuid v1.22.0
Checking gix-odb v0.80.0
Checking human-panic v2.0.6
Checking tree-sitter-toml-ng v0.6.0
Checking tree-sitter-highlight v0.24.7
Checking radicle-surf v0.29.0 (/72b45f93-4c58-4ce9-9ca9-8995a207ab4a/w/crates/radicle-surf)
Checking rustc-hash v1.1.0
Checking thousands v0.2.0
Compiling radicle-node v0.21.1 (/72b45f93-4c58-4ce9-9ca9-8995a207ab4a/w/crates/radicle-node)
Checking mintex v0.1.4
Checking dhat v0.3.3
Checking radicle-systemd v0.13.0 (/72b45f93-4c58-4ce9-9ca9-8995a207ab4a/w/crates/radicle-systemd)
Documenting radicle-cli-test v0.14.1 (/72b45f93-4c58-4ce9-9ca9-8995a207ab4a/w/crates/radicle-cli-test)
Documenting radicle-systemd v0.13.0 (/72b45f93-4c58-4ce9-9ca9-8995a207ab4a/w/crates/radicle-systemd)
Documenting radicle-surf v0.29.0 (/72b45f93-4c58-4ce9-9ca9-8995a207ab4a/w/crates/radicle-surf)
Documenting radicle v0.25.1 (/72b45f93-4c58-4ce9-9ca9-8995a207ab4a/w/crates/radicle)
Documenting radicle-term v0.19.1 (/72b45f93-4c58-4ce9-9ca9-8995a207ab4a/w/crates/radicle-term)
Documenting radicle-address v0.1.0 (/72b45f93-4c58-4ce9-9ca9-8995a207ab4a/w/crates/radicle-address)
Documenting radicle-cob v0.21.1 (/72b45f93-4c58-4ce9-9ca9-8995a207ab4a/w/crates/radicle-cob)
Documenting radicle-core v0.4.1 (/72b45f93-4c58-4ce9-9ca9-8995a207ab4a/w/crates/radicle-core)
Documenting radicle-crypto v0.19.0 (/72b45f93-4c58-4ce9-9ca9-8995a207ab4a/w/crates/radicle-crypto)
Documenting radicle-log v0.2.0 (/72b45f93-4c58-4ce9-9ca9-8995a207ab4a/w/crates/radicle-log)
Documenting radicle-signals v0.12.1 (/72b45f93-4c58-4ce9-9ca9-8995a207ab4a/w/crates/radicle-signals)
Documenting radicle-oid v0.2.2 (/72b45f93-4c58-4ce9-9ca9-8995a207ab4a/w/crates/radicle-oid)
Documenting radicle-git-ref-format v0.2.0 (/72b45f93-4c58-4ce9-9ca9-8995a207ab4a/w/crates/radicle-git-ref-format)
Checking radicle-fetch v0.21.1 (/72b45f93-4c58-4ce9-9ca9-8995a207ab4a/w/crates/radicle-fetch)
Checking radicle-cli v0.23.0 (/72b45f93-4c58-4ce9-9ca9-8995a207ab4a/w/crates/radicle-cli)
Documenting radicle-cli v0.23.0 (/72b45f93-4c58-4ce9-9ca9-8995a207ab4a/w/crates/radicle-cli)
Documenting radicle-schemars v0.9.1 (/72b45f93-4c58-4ce9-9ca9-8995a207ab4a/w/crates/radicle-schemars)
Checking radicle-protocol v0.9.1 (/72b45f93-4c58-4ce9-9ca9-8995a207ab4a/w/crates/radicle-protocol)
Documenting radicle-node v0.21.1 (/72b45f93-4c58-4ce9-9ca9-8995a207ab4a/w/crates/radicle-node)
Documenting radicle-protocol v0.9.1 (/72b45f93-4c58-4ce9-9ca9-8995a207ab4a/w/crates/radicle-protocol)
Documenting radicle-fetch v0.21.1 (/72b45f93-4c58-4ce9-9ca9-8995a207ab4a/w/crates/radicle-fetch)
Documenting radicle-remote-helper v0.18.1 (/72b45f93-4c58-4ce9-9ca9-8995a207ab4a/w/crates/radicle-remote-helper)
Documenting radicle-git-metadata v0.2.1 (/72b45f93-4c58-4ce9-9ca9-8995a207ab4a/w/crates/radicle-git-metadata)
Documenting radicle-localtime v0.1.0 (/72b45f93-4c58-4ce9-9ca9-8995a207ab4a/w/crates/radicle-localtime)
Documenting radicle-dag v0.10.0 (/72b45f93-4c58-4ce9-9ca9-8995a207ab4a/w/crates/radicle-dag)
Documenting radicle-windows v0.1.0 (/72b45f93-4c58-4ce9-9ca9-8995a207ab4a/w/crates/radicle-windows)
Finished `dev` profile [unoptimized + debuginfo] target(s) in 11.77s
Generated /72b45f93-4c58-4ce9-9ca9-8995a207ab4a/w/target/doc/radicle/index.html and 23 other files
+ cargo test --workspace --no-fail-fast
Finished `test` profile [unoptimized + debuginfo] target(s) in 0.22s
Running unittests src/lib.rs (target/debug/deps/radicle-f7754c8ca23d0532)
running 402 tests
test canonical::formatter::test::ascii_control_characters ... ok
test cob::cache::migrations::_2::tests::test_patch_json_deserialization ... ok
test canonical::formatter::test::securesystemslib_asserts ... ok
test canonical::formatter::test::ordered_nested_object ... ok
test cob::common::test::test_color ... ok
test cob::common::test::test_emojis ... ok
test cob::common::test::test_title ... ok
test cob::cache::tests::test_check_version ... ok
test cob::cache::tests::test_migrate_to ... ok
test cob::cache::migrations::_2::tests::test_migration_2 ... ok
test cob::identity::test::accepted_sibling_causes_rejection ... ok
test cob::identity::test::accept_rejects_sibling_accept ... ok
test cob::identity::test::cannot_redact_previously_accepted_revision ... ok
test cob::identity::test::authorization_based_on_parent_not_current ... ok
test cob::identity::test::concurrent_accept_before_redact_converge ... ok
test cob::identity::test::concurrent_redact_and_accept_converge ... ok
test cob::identity::test::evaluates_queued_children ... ok
test cob::identity::test::cascading_rejections ... ok
test cob::identity::test::evaluation_skips_sibling_accept_in_old_history ... ok
test cob::identity::test::evaluation_strips_author_accept_for_sibling_creation ... ok
test cob::identity::test::prop_json_eq_str ... ok
test cob::identity::test::has_accepted_active_sibling_returns_true_when_sibling_accepted ... ok
test cob::identity::test::evaluates_queued_children_with_new_delegate ... ok
test cob::identity::test::redact_parent_cascades ... ok
test cob::identity::test::reject_concurrent ... ok
test cob::identity::test::remove_delegate_concurrent ... ok
test cob::identity::test::test_identity_redact_revision ... ok
test cob::identity::test::terminal_states_concurrent ... ok
test cob::identity::test::test_identity_updates ... ok
test cob::identity::test::test_identity_update_rejected ... ok
test cob::identity::test::test_identity_cannot_redact_terminal_states ... ok
test cob::identity::test::test_valid_identity ... ok
test cob::identity::test::test_identity_updates_concurrent ... ok
test cob::issue::cache::tests::test_counts ... ok
test cob::issue::cache::tests::test_get ... ok
test cob::issue::cache::tests::test_is_empty ... ok
test cob::issue::cache::tests::test_list ... ok
test cob::issue::cache::tests::test_list_by_status ... ok
test cob::issue::cache::tests::test_remove ... ok
test cob::identity::test::update_rejects_second_sibling_proposal ... ok
test cob::identity::test::test_identity_updates_concurrent_outdated ... ok
test cob::issue::test::test_embeds ... ok
test cob::issue::test::test_embeds_edit ... ok
test cob::issue::test::test_invalid_actions ... ok
test cob::issue::test::test_invalid_cob ... ok
test cob::issue::test::test_invalid_tx ... ok
test cob::issue::test::test_invalid_tx_reference ... ok
test cob::issue::test::test_issue_all ... ok
test cob::issue::test::test_concurrency ... ok
test cob::issue::test::test_issue_comment ... ok
test cob::issue::test::test_issue_comment_redact ... ok
test cob::issue::test::test_issue_create_and_assign ... ok
test cob::issue::test::test_issue_create_and_get ... ok
test cob::issue::test::test_issue_create_and_change_state ... ok
test cob::issue::test::test_issue_create_and_unassign ... ok
test cob::issue::test::test_issue_create_and_reassign ... ok
test cob::issue::test::test_issue_edit ... ok
test cob::issue::test::test_issue_multilines ... ok
test cob::issue::test::test_issue_edit_description ... ok
test cob::issue::test::test_issue_label ... ok
test cob::issue::test::test_issue_state_serde ... ok
test cob::issue::test::test_ordering ... ok
test cob::patch::actions::test::test_review_edit ... ok
test cob::issue::test::test_issue_react ... ok
test cob::issue::test::test_issue_reply ... ok
test cob::patch::cache::tests::test_get ... ok
test cob::patch::cache::tests::test_is_empty ... ok
test cob::patch::cache::tests::test_counts ... ok
test cob::patch::cache::tests::test_find_by_revision ... ok
test cob::patch::cache::tests::test_list_by_status ... ok
test cob::patch::encoding::review::test::test_review_deserialize_summary_migration_null_summary ... ok
test cob::patch::encoding::review::test::test_review_deserialize_summary_migration_with_summary ... ok
test cob::patch::encoding::review::test::test_review_deserialize_summary_migration_without_summary ... ok
test cob::patch::encoding::review::test::test_review_deserialize_summary_v2 ... ok
test cob::patch::encoding::review::test::test_review_summary ... ok
test cob::patch::test::test_json ... ok
test cob::patch::test::test_json_serialisation_target ... ok
test cob::patch::test::test_json_serialization ... ok
test cob::patch::test::test_merge_target_resolution ... ok
test cob::patch::cache::tests::test_list ... ok
test cob::patch::test::test_patch_create_and_get ... ok
test cob::patch::cache::tests::test_remove ... ok
test cob::patch::test::test_patch_merge_authorization_ref_formats ... ok
test cob::patch::test::test_patch_merge_custom_destination_authorized ... ok
test cob::patch::test::test_patch_merge_custom_destination_unauthorized ... ok
test cob::patch::test::test_patch_discussion ... ok
test cob::patch::test::test_patch_merge ... ok
test cob::patch::test::test_patch_review ... ok
test cob::patch::test::test_patch_redact ... ok
test cob::patch::test::test_patch_review_comment ... ok
test cob::patch::test::test_patch_review_duplicate ... ok
test cob::patch::test::test_patch_review_edit ... ok
test cob::patch::test::test_patch_review_edit_comment ... ok
test cob::patch::test::test_patch_review_remove_summary ... ok
test cob::patch::test::test_reactions_json_serialization ... ok
test cob::patch::test::test_revision_edit_redact ... ok
test cob::patch::test::test_revision_reaction ... ok
test cob::patch::test::test_revision_review_merge_redacted ... ok
test cob::patch::test::test_target_branch ... ok
test cob::patch::test::test_patch_review_revision_redact ... ok
test cob::stream::tests::test_all_from ... ok
test cob::stream::tests::test_all_from_until ... ok
test cob::stream::tests::test_all_until ... ok
test cob::stream::tests::test_regression_from_until ... ok
test cob::stream::tests::test_from_until ... ok
test cob::thread::tests::resolve_and_unresolve_multiple_comments_in_one_operation ... ok
test cob::thread::tests::test_comment_edit_missing ... ok
test cob::thread::tests::test_comment_edit_redacted ... ok
test cob::thread::tests::test_comment_redact_missing ... ok
test cob::thread::tests::test_duplicate_comments ... ok
test cob::thread::tests::test_edit_comment ... ok
test cob::thread::tests::test_redact_comment ... ok
test cob::thread::tests::test_timeline ... ok
test git::canonical::protect::tests::refs_rad ... ok
test git::canonical::protect::tests::refs_rad_id ... ok
test git::canonical::protect::tests::refs_radieschen ... ok
test git::canonical::quorum::test::merge_base_commutative ... ok
test git::canonical::quorum::test::test_merge_bases ... ok
test git::canonical::rules::test::canonical ... ok
test git::canonical::rules::test::deserialization ... ok
test git::canonical::rules::test::deserialize_extensions ... ok
test git::canonical::rules::test::matches_exactly_curly_braces ... ok
test git::canonical::rules::test::matches_expands_globs_appropriately ... ok
test git::canonical::rules::test::most_specific_match_ignores_lexicographic_order ... ok
test git::canonical::rules::test::ordering ... ok
test git::canonical::rules::test::property::identity ... ok
test git::canonical::rules::test::property::prefix ... ok
test cob::thread::tests::prop_ordering ... ok
test git::canonical::rules::test::property::prefix_negative ... ok
test git::canonical::rules::test::property::suffix ... ok
test git::canonical::rules::test::property::suffix_negative ... ok
test git::canonical::rules::test::roundtrip ... ok
test cob::patch::test::test_patch_update ... ok
test git::canonical::rules::test::rule_validate_success ... ok
test git::canonical::rules::test::special_branches ... ok
test git::canonical::symbolic::test::canonical_roundtrip ... ok
test git::canonical::symbolic::test::deserialize_infinite ... ok
test git::canonical::symbolic::test::deserialize_order ... ok
test git::canonical::symbolic::test::deserialize_valid ... ok
test git::canonical::symbolic::test::infinite_multi ... ok
test git::canonical::symbolic::test::infinite_single ... ok
test git::canonical::symbolic::test::raw_is_freely_mutable ... ok
test git::canonical::symbolic::test::reclassification_combine ... ok
test git::canonical::symbolic::test::reclassification_combine_reverse ... ok
test git::canonical::symbolic::test::reclassification_diamond ... ok
test git::canonical::symbolic::test::reclassification_order_invariant ... ok
test git::canonical::symbolic::test::reclassification_reverse_chain ... ok
test git::canonical::symbolic::test::resolve_two_hop_chain ... ok
test git::canonical::symbolic::test::target_classification ... ok
test git::canonical::symbolic::test::target_classification_symbolic ... ok
test git::canonical::symbolic::test::target_reclassification ... ok
test git::canonical::symbolic::test::target_reclassification_commutative ... ok
test git::canonical::tests::test_commit_quorum_fork_of_a_fork ... ok
test git::canonical::tests::test_commit_quorum_forked_merge_commits ... ok
test git::canonical::tests::test_commit_quorum_groups ... ok
test git::canonical::tests::test_commit_quorum_linear ... ok
test git::canonical::rules::test::property::trailing_asterisk_partial_component ... ok
test git::canonical::tests::test_commit_quorum_merges ... ok
test git::canonical::tests::test_commit_quorum_three_way_fork ... ok
test git::canonical::tests::test_commit_quorum_two_way_fork ... ok
test git::canonical::tests::test_commit_quorum_single ... ok
test git::canonical::tests::test_quorum_different_types ... ok
test git::canonical::rules::test::rule_validate_failures ... ok
test git::canonical::tests::test_tag_quorum ... ok
test identity::crefs::tests::invalid_clash ... ok
test identity::crefs::tests::invalid_clash_asterisk_name ... ok
test identity::crefs::tests::invalid_dangling ... ok
test identity::crefs::tests::omit_symbolic ... ok
test identity::crefs::tests::valid ... ok
test identity::crefs::tests::valid_asterisk_target ... ok
test identity::did::test::test_did_encode_decode ... ok
test identity::did::test::test_did_vectors ... ok
test identity::doc::test::default_branch_clash ... ok
test identity::doc::test::default_branch_without_project ... ok
test identity::doc::test::encode_preserves_symbolic_chain ... ok
test identity::doc::test::test_canonical_doc ... ok
test identity::doc::test::test_canonical_example ... ok
test identity::doc::test::test_duplicate_dids ... ok
test identity::doc::test::test_future_version_error ... ok
test identity::doc::test::test_is_valid_version ... ok
test identity::doc::test::test_max_delegates ... ok
test identity::doc::test::test_not_found ... ok
test identity::doc::test::test_parse_version ... ok
test identity::doc::test::test_visibility_json ... ok
test identity::doc::update::test::test_can_update_crefs ... ok
test identity::doc::update::test::test_cannot_include_default_branch_rule ... ok
test identity::doc::update::test::test_default_branch_rule_exists_after_verification ... ok
test identity::project::test::test_project_name ... ok
test node::address::store::test::skip_invalid_address_type ... ok
test node::address::store::test::skip_mismatched_address_type ... ok
test node::address::store::test::test_alias ... ok
test node::address::store::test::test_disconnected ... ok
test node::address::store::test::test_disconnected_ban ... ok
test node::address::store::test::test_empty ... ok
test node::address::store::test::test_entries ... ok
test node::address::store::test::test_entries_skips_unparsable_address ... ok
test node::address::store::test::test_get_none ... ok
test node::address::store::test::test_insert_and_get ... ok
test node::address::store::test::test_insert_and_remove ... ok
test node::address::store::test::test_insert_and_update ... ok
test node::address::store::test::test_insert_duplicate ... ok
test node::address::store::test::test_node_aliases ... ok
test identity::doc::test::prop_encode_decode ... ok
test node::command::test::command_result ... ok
test node::config::test::deserialize_migrating_scope ... ok
test node::config::test::fetch_level_min ... ok
test node::address::store::test::test_remove_nothing ... ok
test node::config::test::onion_absent ... ok
test node::config::test::onion_null ... ok
test node::config::test::partial ... ok
test node::config::test::regression_ipv6_address_brackets ... ok
test node::config::test::regression_ipv6_address_no_brackets ... ok
test node::config::test::serialize_migrating_scope ... ok
test node::config::test::user_agent_custom ... ok
test node::config::test::user_agent_default ... ok
test node::config::test::user_agent_opt_out ... ok
test node::config::test::user_agent_default_explicit ... ok
test node::db::config::test::database_config_valid_combinations ... ok
test node::db::config::test::invalid ... ok
test node::db::test::migration_8::dns_address_starting_with_bracket_but_missing_closing_bracket_colon_is_unaffected ... ok
test node::db::test::migration_8::all_ipv6_formatted_dns_addresses_are_retyped ... ok
test git::canonical::tests::test_quorum_properties ... ok
test node::db::test::migration_8::dns_address_with_bracket_not_at_start_is_unaffected ... ok
test node::db::test::migration_8::ipv4_address_is_unaffected ... ok
test node::db::test::migration_8::ipv6_formatted_dns_address_is_deleted_when_correct_ipv6_row_already_exists ... ok
test node::db::test::migration_8::ipv6_formatted_dns_address_is_retyped_to_ipv6 ... ok
test node::db::test::migration_8::migration_applies_to_all_nodes ... ok
test node::db::test::migration_8::plain_dns_hostname_without_brackets_is_unaffected ... ok
test node::db::test::migration_8::retype_preserves_address_metadata ... ok
test node::db::test::migration_9::bracketed_non_ipv6_garbage_is_deleted ... ok
test node::db::test::migration_9::dns_row_is_unaffected_even_when_inner_part_has_no_colon ... ok
test node::db::test::migration_9::full_ipv6_address_is_kept ... ok
test node::db::test::migration_9::ipv4_row_is_unaffected ... ok
test node::db::test::migration_9::empty_brackets_ipv6_row_is_deleted ... ok
test node::db::test::migration_9::loopback_address_is_kept ... ok
test node::features::test::test_operations ... ok
test node::notifications::store::test::test_branch_notifications ... ok
test node::db::test::migration_9::unspecified_address_is_kept ... ok
test node::notifications::store::test::test_clear ... ok
test node::db::test::test_version ... ok
test node::notifications::store::test::test_cob_notifications ... ok
test node::notifications::store::test::test_duplicate_notifications ... ok
test node::notifications::store::test::test_counts_by_repo ... ok
test node::policy::store::test::test_follow_and_unfollow_node ... ok
test node::notifications::store::test::test_notification_status ... ok
test node::policy::store::test::test_node_policy ... ok
test node::policy::store::test::test_node_aliases ... ok
test node::policy::store::test::test_repo_policies ... ok
test node::policy::store::test::test_repo_policy ... ok
test node::policy::store::test::test_node_policies ... ok
test node::policy::store::test::test_seed_and_unseed_repo ... ok
test node::policy::store::test::test_update_alias ... ok
test node::policy::store::test::test_update_scope ... ok
test node::refs::store::test::test_count ... ok
test node::refs::store::test::test_set_and_get ... ok
test node::refs::store::test::test_set_and_delete ... ok
test node::routing::test::test_count ... ok
test node::routing::test::test_insert_and_get ... ok
test node::routing::test::test_insert_and_get_resources ... ok
test node::routing::test::test_entries ... ok
test node::routing::test::test_insert_and_remove ... ok
test node::routing::test::test_insert_existing_updated_time ... ok
test node::routing::test::test_insert_duplicate ... ok
test node::routing::test::test_len ... ok
test node::routing::test::test_remove_many ... ok
test node::routing::test::test_remove_redundant ... ok
test node::sync::announce::test::all_synced_nodes_are_preferred_seeds ... ok
test node::sync::announce::test::announcer_adapts_target_to_reach ... ok
test node::sync::announce::test::announcer_preferred_seeds_or_replica_factor ... ok
test node::sync::announce::test::announcer_reached_max_replication_target ... ok
test node::routing::test::test_update_existing_multi ... ok
test node::sync::announce::test::announcer_reached_min_replication_target ... ok
test node::sync::announce::test::announcer_reached_preferred_seeds ... ok
test node::sync::announce::test::announcer_synced_with_unknown_node ... ok
test node::sync::announce::test::announcer_timed_out ... ok
test node::sync::announce::test::announcer_with_replication_factor_zero_and_preferred_seeds ... ok
test node::routing::test::test_prune ... ok
test node::sync::announce::test::construct_node_appears_in_multiple_input_sets ... ok
test node::sync::announce::test::construct_only_preferred_seeds_provided ... ok
test node::sync::announce::test::invariant_progress_should_match_state ... ok
test node::sync::announce::test::local_node_in_multiple_sets ... ok
test node::sync::announce::test::cannot_construct_announcer ... ok
test node::sync::announce::test::local_node_in_preferred_seeds ... ok
test node::sync::announce::test::local_node_only_in_all_sets_results_in_no_seeds_error ... ok
test node::sync::announce::test::local_node_in_synced_set ... ok
test node::sync::announce::test::local_node_in_unsynced_set ... ok
test node::sync::announce::test::preferred_seeds_already_synced ... ok
test node::sync::announce::test::synced_with_local_node_is_ignored ... ok
test node::sync::announce::test::synced_with_same_node_multiple_times ... ok
test node::sync::announce::test::timed_out_after_reaching_success ... ok
test node::sync::fetch::test::all_nodes_are_candidates ... ok
test node::sync::fetch::test::could_not_reach_target ... ok
test node::sync::fetch::test::ignores_duplicates_and_local_node ... ok
test node::sync::fetch::test::all_nodes_are_fetchable ... ok
test node::sync::fetch::test::preferred_seeds_target_returned_over_replicas ... ok
test node::sync::fetch::test::reaches_target_of_max_replicas ... ok
test node::sync::test::ensure_replicas_construction ... ok
test node::sync::test::replicas_constrain_to ... ok
test node::sync::fetch::test::reaches_target_of_preferred_seeds ... ok
test node::test::test_address ... ok
test node::test::test_alias ... ok
test node::sync::fetch::test::reaches_target_of_replicas ... ok
test node::test::test_user_agent ... ok
test node::test::test_command_result ... ok
test node::timestamp::tests::test_timestamp_max ... ok
test profile::test::test_config ... ok
test profile::test::canonicalize_home ... ok
test rad::tests::test_checkout ... ok
test rad::tests::test_fork ... ok
test rad::tests::test_init ... ok
test storage::git::tests::test_references_of ... ok
test storage::git::transport::local::url::test::test_url_parse ... ok
test storage::git::transport::local::url::test::test_url_to_string ... ok
test storage::git::transport::remote::url::test::test_url_parse ... ok
test storage::git::tests::test_sign_refs ... ok
test profile::config::test::schema ... ok
test storage::refs::sigrefs::git::properties::idempotent_write ... ok
test storage::refs::sigrefs::git::properties::initial_commit_roundtrip ... ok
test storage::refs::sigrefs::property::idempotent ... ok
test storage::refs::sigrefs::read::test::commit_reader::identity_root_error ... ok
test storage::refs::sigrefs::read::test::commit_reader::missing_commit ... ok
test storage::refs::sigrefs::read::test::commit_reader::read_ok ... ok
test storage::refs::sigrefs::read::test::commit_reader::too_many_parents ... ok
test storage::refs::sigrefs::read::test::commit_reader::tree_error ... ok
test storage::refs::sigrefs::read::test::identity_root_reader::doc_blob_error ... ok
test storage::refs::sigrefs::read::test::identity_root_reader::missing_identity ... ok
test storage::refs::sigrefs::read::test::identity_root_reader::read_ok_none ... ok
test storage::refs::sigrefs::read::test::identity_root_reader::read_ok_some ... ok
test storage::refs::sigrefs::read::test::resolve_tip::find_reference_error ... ok
test storage::refs::sigrefs::read::test::resolve_tip::missing_sigrefs ... ok
test storage::refs::sigrefs::read::test::resolve_tip::resolve_tip_ok ... ok
test storage::refs::sigrefs::read::test::signed_refs_reader::detect_parent::root_without_parent ... ok
test storage::refs::sigrefs::read::test::signed_refs_reader::detect_parent::root_without_root ... ok
test storage::refs::sigrefs::read::test::signed_refs_reader::downgrade::parent ... ok
test storage::refs::sigrefs::read::test::signed_refs_reader::downgrade::restore ... ok
test storage::refs::sigrefs::read::test::signed_refs_reader::downgrade::root ... ok
test storage::refs::sigrefs::read::test::signed_refs_reader::downgrade::root_with_parent ... ok
test storage::refs::sigrefs::read::test::signed_refs_reader::head_commit_error ... ok
test storage::refs::sigrefs::read::test::signed_refs_reader::head_verify_mismatched_identity_error ... ok
test storage::refs::sigrefs::read::test::signed_refs_reader::head_verify_signature_error ... ok
test storage::refs::sigrefs::read::test::signed_refs_reader::invalid_parent ... ok
test storage::refs::sigrefs::read::test::signed_refs_reader::read_ok_no_parent ... ok
test storage::refs::sigrefs::read::test::signed_refs_reader::read_ok_parent ... ok
test storage::refs::sigrefs::read::test::signed_refs_reader::read_ok_root ... ok
test storage::refs::sigrefs::read::test::signed_refs_reader::replay::alternating ... ok
test storage::refs::sigrefs::read::test::signed_refs_reader::replay::chain ... ok
test storage::refs::sigrefs::read::test::signed_refs_reader::replay::multiple ... ok
test storage::refs::sigrefs::read::test::signed_refs_reader::replay::root_at_head ... ok
test storage::refs::sigrefs::read::test::signed_refs_reader::single_commit ... ok
test storage::refs::sigrefs::read::test::signed_refs_reader::two_commits ... ok
test storage::refs::sigrefs::read::test::signed_refs_reader::walk_commit_error ... ok
test storage::refs::sigrefs::read::test::signed_refs_reader::walk_verify_error ... ok
test storage::refs::sigrefs::read::test::tree_reader::missing_both ... ok
test storage::refs::sigrefs::read::test::tree_reader::missing_refs ... ok
test storage::refs::sigrefs::read::test::tree_reader::missing_signature ... ok
test storage::refs::sigrefs::read::test::tree_reader::parse_refs_error ... ok
test storage::refs::sigrefs::read::test::tree_reader::parse_signature_error ... ok
test storage::refs::sigrefs::read::test::tree_reader::read_ok ... ok
test storage::refs::sigrefs::read::test::tree_reader::read_refs_error ... ok
test storage::refs::sigrefs::read::test::tree_reader::read_signature_error ... ok
test storage::refs::sigrefs::write::test::commit_writer::tree_error ... ok
test storage::refs::sigrefs::write::test::commit_writer::write_commit_error ... ok
test storage::refs::sigrefs::write::test::commit_writer::write_empty_refs ... ok
test storage::refs::sigrefs::write::test::commit_writer::write_root_ok ... ok
test storage::refs::sigrefs::write::test::commit_writer::write_with_parent_ok ... ok
test storage::refs::sigrefs::write::test::head_reader::no_head ... ok
test storage::refs::sigrefs::write::test::head_reader::read_ok ... ok
test storage::refs::sigrefs::write::test::head_reader::reference_error ... ok
test storage::refs::sigrefs::write::test::head_reader::refs_blob_error ... ok
test storage::refs::sigrefs::write::test::head_reader::refs_blob_missing ... ok
test storage::refs::sigrefs::write::test::head_reader::refs_parse_error ... ok
test storage::refs::sigrefs::write::test::head_reader::signature_blob_error ... ok
test storage::refs::sigrefs::write::test::head_reader::signature_blob_missing ... ok
test storage::refs::sigrefs::write::test::head_reader::signature_parse_error ... ok
test storage::refs::sigrefs::write::test::signed_refs_writer::commit_error ... ok
test storage::refs::sigrefs::write::test::signed_refs_writer::head_error ... ok
test storage::refs::sigrefs::write::test::signed_refs_writer::never_write_rad_sigrefs ... ok
test storage::refs::sigrefs::write::test::signed_refs_writer::reference_error ... ok
test storage::refs::sigrefs::write::test::signed_refs_writer::unchanged ... ok
test storage::refs::sigrefs::write::test::signed_refs_writer::unchanged_force_writes_new_commit ... ok
test storage::refs::sigrefs::write::test::signed_refs_writer::write_empty_refs ... ok
test storage::refs::sigrefs::write::test::signed_refs_writer::write_root_ok ... ok
test storage::refs::sigrefs::write::test::signed_refs_writer::write_with_parent_ok ... ok
test storage::refs::sigrefs::write::test::tree_writer::sign_error ... ok
test storage::refs::sigrefs::write::test::tree_writer::write_ok ... ok
test storage::refs::sigrefs::write::test::tree_writer::write_tree_error ... ok
test storage::refs::tests::prop_canonical_roundtrip ... ok
test storage::refs::tests::test_rid_verification ... ok
test storage::tests::test_storage ... ok
test test::assert::test::assert_with_message ... ok
test test::assert::test::test_assert_no_move ... ok
test test::assert::test::test_assert_panic_0 - should panic ... ok
test test::assert::test::test_assert_panic_1 - should panic ... ok
test test::assert::test::test_assert_panic_2 - should panic ... ok
test test::assert::test::test_assert_succeed ... ok
test test::assert::test::test_panic_message ... ok
test version::test::test_version ... ok
test web::test::description_only ... ok
test web::test::pinned_empty ... ok
test cob::identity::test::property::prop_invariants ... ok
test storage::refs::sigrefs::property::roundtrip ... ok
test storage::refs::sigrefs::git::properties::chain_roundtrip ... ok
test result: ok. 402 passed; 0 failed; 0 ignored; 0 measured; 0 filtered out; finished in 3.54s
Running unittests src/lib.rs (target/debug/deps/radicle_address-d4836b3e45c696e9)
running 0 tests
test result: ok. 0 passed; 0 failed; 0 ignored; 0 measured; 0 filtered out; finished in 0.00s
Running unittests src/lib.rs (target/debug/deps/radicle_cli-d7acd129bc40beef)
running 48 tests
test commands::block::args::test::should_not_parse ... ok
test commands::block::args::test::should_parse_nid ... ok
test commands::block::args::test::should_parse_rid ... ok
test commands::clone::args::test::should_parse_rid_non_urn ... ok
test commands::clone::args::test::should_parse_rid_urn ... ok
test commands::clone::args::test::should_parse_rid_url ... ok
test commands::cob::args::test::should_allow_log_json_format ... ok
test commands::cob::args::test::should_not_allow_show_pretty_format ... ok
test commands::cob::args::test::should_allow_update_json_format ... ok
test commands::cob::args::test::should_allow_show_json_format ... ok
test commands::cob::args::test::should_not_allow_update_pretty_format ... ok
test commands::cob::args::test::should_allow_log_pretty_format ... ok
test commands::fork::args::test::should_not_parse_rid_url ... ok
test commands::fork::args::test::should_parse_rid_urn ... ok
test commands::fork::args::test::should_parse_rid_non_urn ... ok
test commands::id::args::test::should_not_clobber_payload_args ... ok
test commands::id::args::test::should_not_parse_into_payload - should panic ... ok
test commands::id::args::test::should_parse_into_payload ... ok
test commands::id::args::test::should_not_parse_single_payload ... ok
test commands::id::args::test::should_not_parse_single_payloads ... ok
test commands::init::args::test::should_not_parse_rid_url ... ok
test commands::id::args::test::should_parse_multiple_payloads ... ok
test commands::id::args::test::should_parse_single_payload ... ok
test commands::init::args::test::should_parse_rid_non_urn ... ok
test commands::patch::review::builder::tests::test_review_comments_basic ... ok
test commands::inspect::test::test_tree ... ok
test commands::init::args::test::should_parse_rid_urn ... ok
test commands::patch::review::builder::tests::test_review_comments_before ... ok
test commands::patch::review::builder::tests::test_review_comments_multiline ... ok
test commands::patch::review::builder::tests::test_review_comments_split_hunk ... ok
test commands::publish::args::test::should_not_parse_rid_url ... ok
test commands::publish::args::test::should_parse_rid_non_urn ... ok
test commands::watch::args::test::should_parse_ref_str ... ok
test commands::publish::args::test::should_parse_rid_urn ... ok
test git::pretty_diff::test::test_pretty ... ignored
test git::test::test_version_ord ... ok
test git::test::test_version_from_str ... ok
test git::ddiff::tests::diff_encode_decode_ddiff_hunk ... ok
test terminal::args::test::should_not_parse ... ok
test git::unified_diff::test::test_diff_content_encode_decode_content ... ok
test terminal::args::test::should_parse_rid ... ok
test terminal::format::test::test_bytes ... ok
test terminal::args::test::should_parse_nid ... ok
test terminal::format::test::test_strip_comments ... ok
test terminal::patch::test::test_edit_display_message ... ok
test git::unified_diff::test::test_diff_encode_decode_diff ... ok
test terminal::patch::test::test_create_display_message ... ok
test terminal::patch::test::test_update_display_message ... ok
test result: ok. 47 passed; 0 failed; 1 ignored; 0 measured; 0 filtered out; finished in 0.01s
Running unittests src/main.rs (target/debug/deps/rad-903821f358b17cd1)
running 0 tests
test result: ok. 0 passed; 0 failed; 0 ignored; 0 measured; 0 filtered out; finished in 0.00s
Running tests/commands.rs (target/debug/deps/commands-b011708bd7adfe1c)
running 126 tests
test commands::checkout::rad_checkout ... ok
test commands::clone::rad_clone_bare ... ok
test commands::clone::rad_clone ... ok
test commands::clone::rad_clone_all ... ok
test commands::clone::rad_clone_scope ... ok
test commands::clone::rad_clone_directory ... ok
test commands::clone::rad_clone_unknown ... ok
test commands::clone::rad_clone_connect ... ok
test commands::clone::rad_clone_partial_fail ... ok
test commands::cob::rad_cob_multiset ... ok
test commands::clone::test_clone_without_seeds ... ok
test commands::cob::rad_cob_log ... ok
test commands::cob::rad_cob_operations ... ok
test commands::cob::rad_cob_migrate ... ok
test commands::cob::rad_cob_show ... ok
test commands::cob::rad_cob_update_identity ... ok
test commands::cob::rad_cob_update ... ok
test commands::cob::test_cob_deletion ... ok
test commands::cob::test_cob_replication ... ok
test commands::git::git_push_amend ... ok
test commands::git::git_push_and_fetch ... FAILED
test commands::git::git_push_canonical_lightweight_tags ... ok
test commands::git::git_push_diverge ... ok
test commands::git::git_push_force_with_lease ... ok
test commands::git::git_push_canonical ... ok
test commands::git::git_push_converge ... ok
test commands::id::rad_id_collaboration ... ignored, slow
test commands::git::git_push_rollback ... ok
test commands::id::rad_id ... ok
test commands::git::git_tag ... ok
test commands::id::rad_id_private ... ok
test commands::id::rad_id_threshold_soft_fork ... ok
test commands::id::rad_id_conflict ... ok
test commands::id::rad_id_threshold ... ok
test commands::id::rad_id_unknown_field ... ok
test commands::id::rad_id_unauthorized_delegate ... ok
test commands::init::rad_init ... ignored, part of many other tests
test commands::id::rad_id_update_delete_field ... ok
test commands::id::rad_id_multi_delegate ... ok
test commands::init::rad_init_detached_head ... ok
test commands::init::rad_init_bare ... ok
test commands::init::rad_init_existing ... ok
test commands::init::rad_init_existing_bare ... ok
test commands::init::rad_init_no_git ... ok
test commands::init::rad_init_no_seed ... ok
test commands::init::rad_init_private ... ok
test commands::init::rad_init_private_no_seed ... ok
test commands::init::rad_init_private_clone ... ok
test commands::inbox::rad_inbox ... ok
test commands::init::rad_init_private_clone_seed ... ok
test commands::init::rad_init_private_seed ... ok
test commands::init::rad_init_sync_not_connected ... ok
test commands::init::rad_init_sync_preferred ... ok
test commands::init::rad_init_with_existing_remote ... ok
test commands::init::rad_publish ... ok
test commands::issue::rad_issue ... ok
test commands::jj::rad_jj_bare ... ignored, the bare repository does not have a `rad` remote, and so it cannot determine the RID of the repository
test commands::jj::rad_jj_colocated_patch ... ok
test commands::issue::rad_issue_list ... ok
test commands::node::rad_node_connect ... ok
test commands::node::rad_node_connect_without_address ... ok
test commands::patch::rad_merge_after_update ... ok
test commands::patch::rad_merge_no_ff ... ok
test commands::node::rad_node ... ok
test commands::patch::rad_merge_via_push ... ok
test commands::patch::rad_patch ... ok
test commands::patch::rad_patch_ahead_behind ... ok
test commands::patch::rad_patch_change_base ... ok
test commands::patch::rad_patch_checkout ... ok
test commands::patch::rad_patch_checkout_revision ... ok
test commands::init::rad_init_sync_and_clone ... ok
test commands::init::rad_init_sync_timeout ... ok
test commands::patch::rad_patch_checkout_force ... ok
test commands::patch::rad_patch_detached_head ... ok
test commands::patch::rad_patch_diff ... ok
test commands::patch::rad_patch_draft ... ok
test commands::patch::rad_patch_edit ... ok
test commands::patch::rad_patch_fetch_2 ... ok
test commands::patch::rad_patch_merge_draft ... ok
test commands::patch::rad_patch_fetch_1 ... ok
test commands::patch::rad_patch_magic_push ... ok
test commands::patch::rad_patch_merge_into_canonical_ref_branch ... ok
test commands::patch::rad_patch_delete ... ok
test commands::patch::rad_patch_merge_wrong_branch ... ok
test commands::patch::rad_patch_merge_on_first_push ... ok
test commands::patch::rad_patch_merge_unauthorized_branch ... ok
test commands::patch::rad_patch_revert_merge ... ok
test commands::patch::rad_patch_open_explore ... ok
test commands::patch::rad_patch_revert_custom_branch ... ok
test commands::patch::rad_patch_update ... ok
test commands::patch::rad_patch_review_no_options ... ok
test commands::patch::rad_patch_via_push ... ok
test commands::policy::rad_block ... ok
test commands::policy::rad_seed_and_follow ... ok
test commands::patch::rad_review_by_hunk ... ok
test commands::policy::rad_seed_policy_allow_no_scope ... ok
test commands::policy::rad_seed_scope ... ok
test commands::policy::rad_unseed ... ok
test commands::policy::rad_unseed_many ... ok
test commands::policy::rad_seed_many ... ok
test commands::sigpipe::config ... ok
test commands::sigpipe::help ... ok
test commands::patch::rad_push_and_pull_patches ... ok
test commands::sigpipe::rad_self ... ok
test commands::remote::rad_remote ... ok
test commands::sync::rad_sync_without_node ... ok
test commands::sync::rad_sync ... ok
test commands::utility::framework_home ... ok
test commands::utility::rad_auth ... ok
test commands::utility::rad_auth_errors ... ok
test commands::patch::rad_patch_pull_update ... ok
test commands::utility::rad_config ... ok
test commands::utility::rad_clean ... ok
test commands::utility::rad_diff ... ok
test commands::utility::rad_help ... ok
test commands::utility::rad_inspect ... ok
test commands::utility::rad_key_mismatch ... ok
test commands::utility::rad_self ... ok
test commands::utility::rad_warn_ipv6 ... ok
test commands::utility::rad_warn_old_nodes ... ok
test commands::watch::rad_watch ... ok
test commands::sync::rad_fetch ... ok
test rad_remote ... ok
test commands::workflow::rad_workflow ... ok
test commands::sync::test_replication_via_seed ... ok
test commands::utility::rad_fork ... ok
failures:
---- commands::git::git_push_and_fetch stdout ----
1790425824 test: rad-init:6: `rad init --name heartwood --description Radicle Heartwood Protocol & Stack --no-confirm --public -v` @ /tmp/.tmpwcuRtb/alice/work
1790425824 test: rad-init:28: `rad init` @ /tmp/.tmpwcuRtb/alice/work
1790425824 test: rad-init:35: `rad ls` @ /tmp/.tmpwcuRtb/alice/work
1790425824 test: rad-init:46: `rad node inventory` @ /tmp/.tmpwcuRtb/alice/work
1790425824 commands::git::git_push_and_fetch node: Opening policy database..
1790425824 commands::git::git_push_and_fetch node: Default seeding policy set to 'block (all)'
1790425824 commands::git::git_push_and_fetch node: Initializing service (Test)..
1790425824 commands::git::git_push_and_fetch node: Opening node database..
1790425824 commands::git::git_push_and_fetch node: Address book is empty. Adding bootstrap nodes..
1790425824 commands::git::git_push_and_fetch node: 0 nodes added to address book
1790425824 commands::git::git_push_and_fetch service: Init @1790425824379
1790425824 commands::git::git_push_and_fetch service: Empty refs database, populating from storage..
1790425824 commands::git::git_push_and_fetch radicle_protocol::service: Migrating `rad/sigrefs` of rad:z42hL2jL4XNk6K8oHQaSWfMgCL7ji to force feature level parent.
1790425824 commands::git::git_push_and_fetch service: Saved local sync status for rad:z42hL2jL4XNk6K8oHQaSWfMgCL7ji..
1790425824 commands::git::git_push_and_fetch service: Adding refs announcement for rad:z42hL2jL4XNk6K8oHQaSWfMgCL7ji to historical gossip messages..
1790425824 commands::git::git_push_and_fetch service: Not enough available peers to connect to (available=0, wanted=8)
1790425824 commands::git::git_push_and_fetch reactor-controller: Initializing reactor thread…
1790425824 z6MknSLrJoTcukLrE435hVNQT4JUhbvWLX4kUzqkEStBU8Vi <service> reactor: Entering reactor event loop
1790425824 z6MknSLrJoTcukLrE435hVNQT4JUhbvWLX4kUzqkEStBU8Vi <service> node: Listening on 127.0.0.1:46655..
1790425824 commands::git::git_push_and_fetch node: Binding control socket /tmp/.tmpwcuRtb/alice/.radicle/node/control.sock..
1790425824 commands::git::git_push_and_fetch node: Opening policy database..
1790425824 z6MknSLrJoTcukLrE435hVNQT4JUhbvWLX4kUzqkEStBU8Vi <runtime> node: Running node z6MknSLrJoTcukLrE435hVNQT4JUhbvWLX4kUzqkEStBU8Vi in /tmp/.tmpwcuRtb/alice/.radicle..
1790425824 z6MknSLrJoTcukLrE435hVNQT4JUhbvWLX4kUzqkEStBU8Vi <control> control: Control thread listening on socket..
1790425824 z6MknSLrJoTcukLrE435hVNQT4JUhbvWLX4kUzqkEStBU8Vi <signals> node: Signal notifications channel error: receiving on a closed channel
1790425824 z6MknSLrJoTcukLrE435hVNQT4JUhbvWLX4kUzqkEStBU8Vi <service> service: Received command QueryState(..)
1790425824 commands::git::git_push_and_fetch node: Default seeding policy set to 'block (all)'
1790425824 commands::git::git_push_and_fetch node: Initializing service (Test)..
1790425824 commands::git::git_push_and_fetch node: Opening node database..
1790425824 commands::git::git_push_and_fetch node: Address book is empty. Adding bootstrap nodes..
1790425824 commands::git::git_push_and_fetch node: 0 nodes added to address book
1790425824 commands::git::git_push_and_fetch service: Init @1790425824397
1790425824 commands::git::git_push_and_fetch service: Empty refs database, populating from storage..
1790425824 commands::git::git_push_and_fetch service: Not enough available peers to connect to (available=0, wanted=8)
1790425824 commands::git::git_push_and_fetch reactor-controller: Initializing reactor thread…
1790425824 z6Mkt67GdsW7715MEfRuP4pSZxJRJh6kj6Y48WRqVv4N1tRk <service> reactor: Entering reactor event loop
1790425824 z6Mkt67GdsW7715MEfRuP4pSZxJRJh6kj6Y48WRqVv4N1tRk <service> node: Listening on 127.0.0.1:35535..
1790425824 commands::git::git_push_and_fetch node: Binding control socket /tmp/.tmpwcuRtb/bob/.radicle/node/control.sock..
1790425824 z6Mkt67GdsW7715MEfRuP4pSZxJRJh6kj6Y48WRqVv4N1tRk <runtime> node: Running node z6Mkt67GdsW7715MEfRuP4pSZxJRJh6kj6Y48WRqVv4N1tRk in /tmp/.tmpwcuRtb/bob/.radicle..
1790425824 z6Mkt67GdsW7715MEfRuP4pSZxJRJh6kj6Y48WRqVv4N1tRk <control> control: Control thread listening on socket..
1790425824 z6Mkt67GdsW7715MEfRuP4pSZxJRJh6kj6Y48WRqVv4N1tRk <signals> node: Signal notifications channel error: receiving on a closed channel
1790425824 z6Mkt67GdsW7715MEfRuP4pSZxJRJh6kj6Y48WRqVv4N1tRk <service> service: Received command QueryState(..)
1790425824 z6Mkt67GdsW7715MEfRuP4pSZxJRJh6kj6Y48WRqVv4N1tRk <service> service: Received command QueryState(..)
1790425824 z6Mkt67GdsW7715MEfRuP4pSZxJRJh6kj6Y48WRqVv4N1tRk <service> service: Received command Connect(z6MknSLrJoTcukLrE435hVNQT4JUhbvWLX4kUzqkEStBU8Vi, 127.0.0.1:46655, ConnectOptions { persistent: false, timeout: 30s })
1790425824 z6Mkt67GdsW7715MEfRuP4pSZxJRJh6kj6Y48WRqVv4N1tRk <service> service: Connecting to z6MknSLrJoTcukLrE435hVNQT4JUhbvWLX4kUzqkEStBU8Vi (127.0.0.1:46655)..
1790425824 z6Mkt67GdsW7715MEfRuP4pSZxJRJh6kj6Y48WRqVv4N1tRk <service> service: Attempted connection to z6MknSLrJoTcukLrE435hVNQT4JUhbvWLX4kUzqkEStBU8Vi (127.0.0.1:46655)
1790425824 z6Mkt67GdsW7715MEfRuP4pSZxJRJh6kj6Y48WRqVv4N1tRk <service> wire: Registering outbound transport for z6MknSLrJoTcukLrE435hVNQT4JUhbvWLX4kUzqkEStBU8Vi..
1790425824 z6Mkt67GdsW7715MEfRuP4pSZxJRJh6kj6Y48WRqVv4N1tRk <service> reactor: Registering transport
1790425824 z6Mkt67GdsW7715MEfRuP4pSZxJRJh6kj6Y48WRqVv4N1tRk <service> wire: Outbound peer resource registered for z6MknSLrJoTcukLrE435hVNQT4JUhbvWLX4kUzqkEStBU8Vi
1790425824 z6MknSLrJoTcukLrE435hVNQT4JUhbvWLX4kUzqkEStBU8Vi <service> wire: Inbound connection from 127.0.0.1:54500..
1790425824 z6MknSLrJoTcukLrE435hVNQT4JUhbvWLX4kUzqkEStBU8Vi <service> wire: Accepted inbound connection from 127.0.0.1:54500..
1790425824 z6MknSLrJoTcukLrE435hVNQT4JUhbvWLX4kUzqkEStBU8Vi <service> reactor: Registering transport
1790425824 z6MknSLrJoTcukLrE435hVNQT4JUhbvWLX4kUzqkEStBU8Vi <service> wire: Inbound peer resource registered
1790425824 z6Mkt67GdsW7715MEfRuP4pSZxJRJh6kj6Y48WRqVv4N1tRk <service> transport: Handshake with ProtocolArtifact { session: "<omitted>", state: "<omitted>" } is complete
1790425824 z6MknSLrJoTcukLrE435hVNQT4JUhbvWLX4kUzqkEStBU8Vi <service> transport: Handshake with ProtocolArtifact { session: "<omitted>", state: "<omitted>" } is complete
1790425824 z6MknSLrJoTcukLrE435hVNQT4JUhbvWLX4kUzqkEStBU8Vi <service> wire: Session established with z6Mkt67GdsW7715MEfRuP4pSZxJRJh6kj6Y48WRqVv4N1tRk
1790425824 z6Mkt67GdsW7715MEfRuP4pSZxJRJh6kj6Y48WRqVv4N1tRk <service> wire: Session established with z6MknSLrJoTcukLrE435hVNQT4JUhbvWLX4kUzqkEStBU8Vi
1790425824 z6Mkt67GdsW7715MEfRuP4pSZxJRJh6kj6Y48WRqVv4N1tRk <service> service: Connected to z6MknSLrJoTcukLrE435hVNQT4JUhbvWLX4kUzqkEStBU8Vi (127.0.0.1:46655) (Outbound)
1790425824 z6MknSLrJoTcukLrE435hVNQT4JUhbvWLX4kUzqkEStBU8Vi <service> service: Connected to z6Mkt67GdsW7715MEfRuP4pSZxJRJh6kj6Y48WRqVv4N1tRk (127.0.0.1:54500) (Inbound)
1790425824 z6MknSLrJoTcukLrE435hVNQT4JUhbvWLX4kUzqkEStBU8Vi <service> service: Subscribing to messages since timestamp 1790339424429..
1790425824 test: Node z6MknSLrJoTcukLrE435hVNQT4JUhbvWLX4kUzqkEStBU8Vi has converged
1790425824 test: Node has missing routes: [(RepoId(rad:z42hL2jL4XNk6K8oHQaSWfMgCL7ji), PublicKey([118, 161, 89, 32, 68, 166, 228, 245, 17, 38, 91, 202, 115, 166, 4, 217, 11, 5, 41, 209, 223, 96, 43, 227, 10, 25, 169, 37, 118, 96, 209, 245]))]
1790425824 z6Mkt67GdsW7715MEfRuP4pSZxJRJh6kj6Y48WRqVv4N1tRk <service> service: Subscribing to messages since timestamp 1790339424429..
1790425824 z6Mkt67GdsW7715MEfRuP4pSZxJRJh6kj6Y48WRqVv4N1tRk <service> service: Received node announcement of z6MknSLrJoTcukLrE435hVNQT4JUhbvWLX4kUzqkEStBU8Vi with 0 address(es) from z6MknSLrJoTcukLrE435hVNQT4JUhbvWLX4kUzqkEStBU8Vi (t=1790425824379)
1790425824 z6MknSLrJoTcukLrE435hVNQT4JUhbvWLX4kUzqkEStBU8Vi <service> service: Received node announcement of z6Mkt67GdsW7715MEfRuP4pSZxJRJh6kj6Y48WRqVv4N1tRk with 0 address(es) from z6Mkt67GdsW7715MEfRuP4pSZxJRJh6kj6Y48WRqVv4N1tRk (t=1790425824397)
1790425824 z6Mkt67GdsW7715MEfRuP4pSZxJRJh6kj6Y48WRqVv4N1tRk <service> service: Stored announcement from z6MknSLrJoTcukLrE435hVNQT4JUhbvWLX4kUzqkEStBU8Vi to be broadcast in 0 millisecond(s) (t=1790425824379)
1790425824 z6MknSLrJoTcukLrE435hVNQT4JUhbvWLX4kUzqkEStBU8Vi <service> service: Stored announcement from z6Mkt67GdsW7715MEfRuP4pSZxJRJh6kj6Y48WRqVv4N1tRk to be broadcast in 0 millisecond(s) (t=1790425824397)
1790425824 z6Mkt67GdsW7715MEfRuP4pSZxJRJh6kj6Y48WRqVv4N1tRk <service> service: Address store entry for node z6MknSLrJoTcukLrE435hVNQT4JUhbvWLX4kUzqkEStBU8Vi updated at 1790425824379
1790425824 z6Mkt67GdsW7715MEfRuP4pSZxJRJh6kj6Y48WRqVv4N1tRk <service> service: Received inventory announcement of z6MknSLrJoTcukLrE435hVNQT4JUhbvWLX4kUzqkEStBU8Vi with 1 item(s) from z6MknSLrJoTcukLrE435hVNQT4JUhbvWLX4kUzqkEStBU8Vi (t=1790425824381)
1790425824 z6MknSLrJoTcukLrE435hVNQT4JUhbvWLX4kUzqkEStBU8Vi <service> service: Address store entry for node z6Mkt67GdsW7715MEfRuP4pSZxJRJh6kj6Y48WRqVv4N1tRk updated at 1790425824397
1790425824 z6MknSLrJoTcukLrE435hVNQT4JUhbvWLX4kUzqkEStBU8Vi <service> service: Received inventory announcement of z6Mkt67GdsW7715MEfRuP4pSZxJRJh6kj6Y48WRqVv4N1tRk with 0 item(s) from z6Mkt67GdsW7715MEfRuP4pSZxJRJh6kj6Y48WRqVv4N1tRk (t=1790425824398)
1790425824 z6Mkt67GdsW7715MEfRuP4pSZxJRJh6kj6Y48WRqVv4N1tRk <service> service: Stored announcement from z6MknSLrJoTcukLrE435hVNQT4JUhbvWLX4kUzqkEStBU8Vi to be broadcast in 0 millisecond(s) (t=1790425824381)
1790425824 z6MknSLrJoTcukLrE435hVNQT4JUhbvWLX4kUzqkEStBU8Vi <service> service: Stored announcement from z6Mkt67GdsW7715MEfRuP4pSZxJRJh6kj6Y48WRqVv4N1tRk to be broadcast in 0 millisecond(s) (t=1790425824398)
1790425824 z6Mkt67GdsW7715MEfRuP4pSZxJRJh6kj6Y48WRqVv4N1tRk <service> service: Routing table updated for rad:z42hL2jL4XNk6K8oHQaSWfMgCL7ji with seed z6MknSLrJoTcukLrE435hVNQT4JUhbvWLX4kUzqkEStBU8Vi
1790425824 z6MknSLrJoTcukLrE435hVNQT4JUhbvWLX4kUzqkEStBU8Vi <service> service: Received subscription filter from z6Mkt67GdsW7715MEfRuP4pSZxJRJh6kj6Y48WRqVv4N1tRk
1790425824 z6Mkt67GdsW7715MEfRuP4pSZxJRJh6kj6Y48WRqVv4N1tRk <service> service: Received subscription filter from z6MknSLrJoTcukLrE435hVNQT4JUhbvWLX4kUzqkEStBU8Vi
1790425824 test: Node z6Mkt67GdsW7715MEfRuP4pSZxJRJh6kj6Y48WRqVv4N1tRk has converged
1790425824 test: rad-clone:5: `rad clone rad:z42hL2jL4XNk6K8oHQaSWfMgCL7ji` @ /tmp/.tmpwcuRtb/bob/work
1790425824 z6Mkt67GdsW7715MEfRuP4pSZxJRJh6kj6Y48WRqVv4N1tRk <control> control: Received `{"command":"status"}` on control socket
1790425824 z6Mkt67GdsW7715MEfRuP4pSZxJRJh6kj6Y48WRqVv4N1tRk <control> control: Received `{"command":"seed","rid":"rad:z42hL2jL4XNk6K8oHQaSWfMgCL7ji","scope":"followed"}` on control socket
1790425824 z6Mkt67GdsW7715MEfRuP4pSZxJRJh6kj6Y48WRqVv4N1tRk <service> service: Received command Seed(rad:z42hL2jL4XNk6K8oHQaSWfMgCL7ji, followed)
1790425824 z6Mkt67GdsW7715MEfRuP4pSZxJRJh6kj6Y48WRqVv4N1tRk <service> service: Sending subscription filter to z6MknSLrJoTcukLrE435hVNQT4JUhbvWLX4kUzqkEStBU8Vi
1790425824 z6MknSLrJoTcukLrE435hVNQT4JUhbvWLX4kUzqkEStBU8Vi <service> service: Received subscription filter from z6Mkt67GdsW7715MEfRuP4pSZxJRJh6kj6Y48WRqVv4N1tRk
1790425824 z6Mkt67GdsW7715MEfRuP4pSZxJRJh6kj6Y48WRqVv4N1tRk <control> control: Received `{"command":"seedsFor","rid":"rad:z42hL2jL4XNk6K8oHQaSWfMgCL7ji","namespaces":["z6Mkt67GdsW7715MEfRuP4pSZxJRJh6kj6Y48WRqVv4N1tRk"]}` on control socket
1790425824 z6Mkt67GdsW7715MEfRuP4pSZxJRJh6kj6Y48WRqVv4N1tRk <service> service: Received command Seeds(rad:z42hL2jL4XNk6K8oHQaSWfMgCL7ji)
1790425824 z6Mkt67GdsW7715MEfRuP4pSZxJRJh6kj6Y48WRqVv4N1tRk <service> service: Found 1 connected seed(s) and 0 disconnected seed(s) for rad:z42hL2jL4XNk6K8oHQaSWfMgCL7ji
1790425824 z6Mkt67GdsW7715MEfRuP4pSZxJRJh6kj6Y48WRqVv4N1tRk <control> control: Received `{"command":"session","nid":"z6MknSLrJoTcukLrE435hVNQT4JUhbvWLX4kUzqkEStBU8Vi"}` on control socket
1790425824 z6Mkt67GdsW7715MEfRuP4pSZxJRJh6kj6Y48WRqVv4N1tRk <service> service: Received command QueryState(..)
1790425824 z6Mkt67GdsW7715MEfRuP4pSZxJRJh6kj6Y48WRqVv4N1tRk <control> control: Received `{"command":"fetch","rid":"rad:z42hL2jL4XNk6K8oHQaSWfMgCL7ji","nid":"z6MknSLrJoTcukLrE435hVNQT4JUhbvWLX4kUzqkEStBU8Vi","timeout":{"secs":9,"nanos":0},"signedReferencesMinimumFeatureLevel":null}` on control socket
1790425824 z6Mkt67GdsW7715MEfRuP4pSZxJRJh6kj6Y48WRqVv4N1tRk <service> service: Received command Fetch(rad:z42hL2jL4XNk6K8oHQaSWfMgCL7ji, z6MknSLrJoTcukLrE435hVNQT4JUhbvWLX4kUzqkEStBU8Vi)
1790425824 z6Mkt67GdsW7715MEfRuP4pSZxJRJh6kj6Y48WRqVv4N1tRk <service> service: Starting fetch for rad:z42hL2jL4XNk6K8oHQaSWfMgCL7ji from z6MknSLrJoTcukLrE435hVNQT4JUhbvWLX4kUzqkEStBU8Vi
1790425824 z6Mkt67GdsW7715MEfRuP4pSZxJRJh6kj6Y48WRqVv4N1tRk <service> service: Fetch initiated for rad:z42hL2jL4XNk6K8oHQaSWfMgCL7ji with z6MknSLrJoTcukLrE435hVNQT4JUhbvWLX4kUzqkEStBU8Vi [outbound connected] (all remotes)..
1790425824 z6Mkt67GdsW7715MEfRuP4pSZxJRJh6kj6Y48WRqVv4N1tRk <service> wire: Opened new stream with id 12 for rad:z42hL2jL4XNk6K8oHQaSWfMgCL7ji and remote z6MknSLrJoTcukLrE435hVNQT4JUhbvWLX4kUzqkEStBU8Vi
1790425824 z6MknSLrJoTcukLrE435hVNQT4JUhbvWLX4kUzqkEStBU8Vi <service> wire: Received `open` command for stream 12 from z6Mkt67GdsW7715MEfRuP4pSZxJRJh6kj6Y48WRqVv4N1tRk
1790425824 z6Mkt67GdsW7715MEfRuP4pSZxJRJh6kj6Y48WRqVv4N1tRk <worker#1> worker: Worker processing outgoing fetch for rad:z42hL2jL4XNk6K8oHQaSWfMgCL7ji
1790425824 z6MknSLrJoTcukLrE435hVNQT4JUhbvWLX4kUzqkEStBU8Vi <worker#0> worker: Worker processing incoming fetch for z6Mkt67GdsW7715MEfRuP4pSZxJRJh6kj6Y48WRqVv4N1tRk on stream 12..
1790425824 z6Mkt67GdsW7715MEfRuP4pSZxJRJh6kj6Y48WRqVv4N1tRk <worker#1> worker: z6Mkt67GdsW7715MEfRuP4pSZxJRJh6kj6Y48WRqVv4N1tRk cloning from z6MknSLrJoTcukLrE435hVNQT4JUhbvWLX4kUzqkEStBU8Vi
1790425824 z6MknSLrJoTcukLrE435hVNQT4JUhbvWLX4kUzqkEStBU8Vi <worker#0> worker: Spawning upload-pack process for rad:z42hL2jL4XNk6K8oHQaSWfMgCL7ji on stream 12..
1790425824 z6Mkt67GdsW7715MEfRuP4pSZxJRJh6kj6Y48WRqVv4N1tRk <worker#1> radicle_fetch::state: Fetched rad/id (3ms)
1790425824 z6Mkt67GdsW7715MEfRuP4pSZxJRJh6kj6Y48WRqVv4N1tRk <worker#1> radicle_fetch::state: Fetched data for 1 remote(s) (7ms)
1790425824 z6Mkt67GdsW7715MEfRuP4pSZxJRJh6kj6Y48WRqVv4N1tRk <worker#1> radicle_fetch::state: Fetched data refs for 0 remotes (9ms)
1790425824 z6Mkt67GdsW7715MEfRuP4pSZxJRJh6kj6Y48WRqVv4N1tRk <worker#1> radicle_fetch::state: Sent done signal to remote z6MknSLrJoTcukLrE435hVNQT4JUhbvWLX4kUzqkEStBU8Vi
1790425824 z6MknSLrJoTcukLrE435hVNQT4JUhbvWLX4kUzqkEStBU8Vi <service> wire: Received `end-of-file` on stream 12 from z6Mkt67GdsW7715MEfRuP4pSZxJRJh6kj6Y48WRqVv4N1tRk
1790425824 z6Mkt67GdsW7715MEfRuP4pSZxJRJh6kj6Y48WRqVv4N1tRk <worker#1> radicle_fetch::state: Validated 1 remote(s) (9ms)
1790425824 z6Mkt67GdsW7715MEfRuP4pSZxJRJh6kj6Y48WRqVv4N1tRk <worker#1> radicle_fetch::state: Applied updates (10ms)
1790425824 z6Mkt67GdsW7715MEfRuP4pSZxJRJh6kj6Y48WRqVv4N1tRk <worker#1> radicle_fetch: Finished clone of rad:z42hL2jL4XNk6K8oHQaSWfMgCL7ji from z6MknSLrJoTcukLrE435hVNQT4JUhbvWLX4kUzqkEStBU8Vi (15ms)
1790425824 z6MknSLrJoTcukLrE435hVNQT4JUhbvWLX4kUzqkEStBU8Vi <upload-pack> worker: Exiting upload-pack reader thread for rad:z42hL2jL4XNk6K8oHQaSWfMgCL7ji
1790425824 z6MknSLrJoTcukLrE435hVNQT4JUhbvWLX4kUzqkEStBU8Vi <worker#0> worker: Upload pack finished (15ms)
1790425824 z6MknSLrJoTcukLrE435hVNQT4JUhbvWLX4kUzqkEStBU8Vi <worker#0> worker: Upload process on stream 12 exited with result Ok(())
1790425824 z6MknSLrJoTcukLrE435hVNQT4JUhbvWLX4kUzqkEStBU8Vi <service> wire: Stream 12 of z6Mkt67GdsW7715MEfRuP4pSZxJRJh6kj6Y48WRqVv4N1tRk closing with 0 byte(s) sent and 0 byte(s) received
1790425824 z6MknSLrJoTcukLrE435hVNQT4JUhbvWLX4kUzqkEStBU8Vi <service> wire: Peer z6Mkt67GdsW7715MEfRuP4pSZxJRJh6kj6Y48WRqVv4N1tRk fetched rad:z42hL2jL4XNk6K8oHQaSWfMgCL7ji from us successfully
1790425824 z6Mkt67GdsW7715MEfRuP4pSZxJRJh6kj6Y48WRqVv4N1tRk <service> wire: Received `close` command for stream 12 from z6MknSLrJoTcukLrE435hVNQT4JUhbvWLX4kUzqkEStBU8Vi
1790425824 z6Mkt67GdsW7715MEfRuP4pSZxJRJh6kj6Y48WRqVv4N1tRk <service> wire: Stream 12 of z6MknSLrJoTcukLrE435hVNQT4JUhbvWLX4kUzqkEStBU8Vi closed with 0 byte(s) sent and 0 byte(s) received
1790425824 z6Mkt67GdsW7715MEfRuP4pSZxJRJh6kj6Y48WRqVv4N1tRk <worker#1> storage: Obtained identity COB root commit '0656c217f917c3e06234771e9ecae53aba5e173e' via reference 'refs/rad/root' in namespace of founder 'did:key:z6MknSLrJoTcukLrE435hVNQT4JUhbvWLX4kUzqkEStBU8Vi' of identity document 'rad:z42hL2jL4XNk6K8oHQaSWfMgCL7ji'.
1790425824 z6Mkt67GdsW7715MEfRuP4pSZxJRJh6kj6Y48WRqVv4N1tRk <worker#1> cob: Loading object of type xyz.radicle.id at 0656c217f917c3e06234771e9ecae53aba5e173e.
1790425824 z6Mkt67GdsW7715MEfRuP4pSZxJRJh6kj6Y48WRqVv4N1tRk <worker#1> storage: Setting ref: refs/rad/id -> 0656c217f917c3e06234771e9ecae53aba5e173e
1790425824 z6Mkt67GdsW7715MEfRuP4pSZxJRJh6kj6Y48WRqVv4N1tRk <worker#1> cob: Loading object of type xyz.radicle.id at 0656c217f917c3e06234771e9ecae53aba5e173e.
1790425824 z6Mkt67GdsW7715MEfRuP4pSZxJRJh6kj6Y48WRqVv4N1tRk <service> service: Fetched rad:z42hL2jL4XNk6K8oHQaSWfMgCL7ji from z6MknSLrJoTcukLrE435hVNQT4JUhbvWLX4kUzqkEStBU8Vi successfully
1790425824 z6Mkt67GdsW7715MEfRuP4pSZxJRJh6kj6Y48WRqVv4N1tRk <service> service: Ref updated: * 0000000..0656c21 refs/namespaces/z6MknSLrJoTcukLrE435hVNQT4JUhbvWLX4kUzqkEStBU8Vi/refs/rad/id for rad:z42hL2jL4XNk6K8oHQaSWfMgCL7ji
1790425824 z6Mkt67GdsW7715MEfRuP4pSZxJRJh6kj6Y48WRqVv4N1tRk <service> service: Ref updated: * 0000000..55be805 refs/namespaces/z6MknSLrJoTcukLrE435hVNQT4JUhbvWLX4kUzqkEStBU8Vi/refs/rad/sigrefs for rad:z42hL2jL4XNk6K8oHQaSWfMgCL7ji
1790425824 z6Mkt67GdsW7715MEfRuP4pSZxJRJh6kj6Y48WRqVv4N1tRk <service> service: Ref updated: * 0000000..0656c21 refs/namespaces/z6MknSLrJoTcukLrE435hVNQT4JUhbvWLX4kUzqkEStBU8Vi/refs/cobs/xyz.radicle.id/0656c217f917c3e06234771e9ecae53aba5e173e for rad:z42hL2jL4XNk6K8oHQaSWfMgCL7ji
1790425824 z6Mkt67GdsW7715MEfRuP4pSZxJRJh6kj6Y48WRqVv4N1tRk <service> service: Ref updated: * 0000000..f2de534 refs/namespaces/z6MknSLrJoTcukLrE435hVNQT4JUhbvWLX4kUzqkEStBU8Vi/refs/heads/master for rad:z42hL2jL4XNk6K8oHQaSWfMgCL7ji
1790425824 z6Mkt67GdsW7715MEfRuP4pSZxJRJh6kj6Y48WRqVv4N1tRk <service> service: Ref updated: * 0000000..0656c21 refs/namespaces/z6MknSLrJoTcukLrE435hVNQT4JUhbvWLX4kUzqkEStBU8Vi/refs/rad/root for rad:z42hL2jL4XNk6K8oHQaSWfMgCL7ji
1790425824 z6Mkt67GdsW7715MEfRuP4pSZxJRJh6kj6Y48WRqVv4N1tRk <service> service: Updating and announcing inventory for cloned repository rad:z42hL2jL4XNk6K8oHQaSWfMgCL7ji..
1790425824 z6Mkt67GdsW7715MEfRuP4pSZxJRJh6kj6Y48WRqVv4N1tRk <service> service: Sending inventory announcement of z6Mkt67GdsW7715MEfRuP4pSZxJRJh6kj6Y48WRqVv4N1tRk with 1 item(s) to z6MknSLrJoTcukLrE435hVNQT4JUhbvWLX4kUzqkEStBU8Vi (t=1790425824669)
1790425824 z6Mkt67GdsW7715MEfRuP4pSZxJRJh6kj6Y48WRqVv4N1tRk <service> service: Sending refs announcement of z6Mkt67GdsW7715MEfRuP4pSZxJRJh6kj6Y48WRqVv4N1tRk for rad:z42hL2jL4XNk6K8oHQaSWfMgCL7ji with 1 remote(s) to z6MknSLrJoTcukLrE435hVNQT4JUhbvWLX4kUzqkEStBU8Vi (t=1790425824670)
1790425824 z6MknSLrJoTcukLrE435hVNQT4JUhbvWLX4kUzqkEStBU8Vi <service> service: Received inventory announcement of z6Mkt67GdsW7715MEfRuP4pSZxJRJh6kj6Y48WRqVv4N1tRk with 1 item(s) from z6Mkt67GdsW7715MEfRuP4pSZxJRJh6kj6Y48WRqVv4N1tRk (t=1790425824669)
1790425824 z6MknSLrJoTcukLrE435hVNQT4JUhbvWLX4kUzqkEStBU8Vi <service> service: Stored announcement from z6Mkt67GdsW7715MEfRuP4pSZxJRJh6kj6Y48WRqVv4N1tRk to be broadcast in 0 millisecond(s) (t=1790425824669)
1790425824 z6MknSLrJoTcukLrE435hVNQT4JUhbvWLX4kUzqkEStBU8Vi <service> service: Routing table updated for rad:z42hL2jL4XNk6K8oHQaSWfMgCL7ji with seed z6Mkt67GdsW7715MEfRuP4pSZxJRJh6kj6Y48WRqVv4N1tRk
1790425824 z6MknSLrJoTcukLrE435hVNQT4JUhbvWLX4kUzqkEStBU8Vi <service> service: Received refs announcement of z6Mkt67GdsW7715MEfRuP4pSZxJRJh6kj6Y48WRqVv4N1tRk for rad:z42hL2jL4XNk6K8oHQaSWfMgCL7ji with 1 remote(s) from z6Mkt67GdsW7715MEfRuP4pSZxJRJh6kj6Y48WRqVv4N1tRk (t=1790425824670)
1790425824 z6MknSLrJoTcukLrE435hVNQT4JUhbvWLX4kUzqkEStBU8Vi <service> service: Stored announcement from z6Mkt67GdsW7715MEfRuP4pSZxJRJh6kj6Y48WRqVv4N1tRk to be broadcast in 0 millisecond(s) (t=1790425824670)
1790425824 z6MknSLrJoTcukLrE435hVNQT4JUhbvWLX4kUzqkEStBU8Vi <service> service: Refs announcement of z6Mkt67GdsW7715MEfRuP4pSZxJRJh6kj6Y48WRqVv4N1tRk for rad:z42hL2jL4XNk6K8oHQaSWfMgCL7ji contains our own remote at 55be80540a7e9f10478fbc846913f2a6a19abe1d (t=1790425824670)
1790425824 z6MknSLrJoTcukLrE435hVNQT4JUhbvWLX4kUzqkEStBU8Vi <service> service: Updating sync status of z6Mkt67GdsW7715MEfRuP4pSZxJRJh6kj6Y48WRqVv4N1tRk for rad:z42hL2jL4XNk6K8oHQaSWfMgCL7ji to 55be80540a7e9f10478fbc846913f2a6a19abe1d
1790425824 z6MknSLrJoTcukLrE435hVNQT4JUhbvWLX4kUzqkEStBU8Vi <service> service: Skipping fetch for rad:z42hL2jL4XNk6K8oHQaSWfMgCL7ji, all refs are already in storage
1790425824 test: rad-clone:25: `cd /tmp/.tmpwcuRtb/bob/work/heartwood`..
1790425824 test: rad-clone:26: `ls ` @ /tmp/.tmpwcuRtb/bob/work/heartwood
1790425824 test: rad-clone:28: `cat README` @ /tmp/.tmpwcuRtb/bob/work/heartwood
1790425824 test: rad-clone:30: `git status` @ /tmp/.tmpwcuRtb/bob/work/heartwood
1790425824 test: rad-clone:40: `git branch --remotes` @ /tmp/.tmpwcuRtb/bob/work/heartwood
1790425824 test: rad-clone:49: `git remote -v` @ /tmp/.tmpwcuRtb/bob/work/heartwood
1790425824 test: rad-clone:59: `git log -n 1` @ /tmp/.tmpwcuRtb/bob/work/heartwood
1790425824 test: rad-clone:69: `rad ls --seeded` @ /tmp/.tmpwcuRtb/bob/work/heartwood
1790425824 test: git-push:2: `git checkout -b alice/1` @ /tmp/.tmpwcuRtb/alice/work
1790425824 test: git-push:3: `git commit -m Alice's commit --allow-empty -s` @ /tmp/.tmpwcuRtb/alice/work
1790425824 test: git-push:8: `git push rad HEAD:alice/1` @ /tmp/.tmpwcuRtb/alice/work
1790425824 test: git-push:16: `git commit --amend -m Alice's amended commit --allow-empty -s` @ /tmp/.tmpwcuRtb/alice/work
1790425824 test: git-push:19: `git push rad HEAD:alice/1` @ /tmp/.tmpwcuRtb/alice/work
1790425824 test: git-push:32: `git push -o no-sync rad +HEAD:alice/1` @ /tmp/.tmpwcuRtb/alice/work
1790425824 test: git-push:40: `git branch -r -vv` @ /tmp/.tmpwcuRtb/alice/work
1790425824 test: git-push:48: `git ls-remote rad://z42hL2jL4XNk6K8oHQaSWfMgCL7ji/z6MknSLrJoTcukLrE435hVNQT4JUhbvWLX4kUzqkEStBU8Vi refs/heads/*` @ /tmp/.tmpwcuRtb/alice/work
1790425825 test: git-push:56: `git ls-remote rad` @ /tmp/.tmpwcuRtb/alice/work
1790425825 test: git-push:62: `rad sync --announce` @ /tmp/.tmpwcuRtb/alice/work
1790425825 z6MknSLrJoTcukLrE435hVNQT4JUhbvWLX4kUzqkEStBU8Vi <control> control: Received `{"command":"status"}` on control socket
1790425825 z6MknSLrJoTcukLrE435hVNQT4JUhbvWLX4kUzqkEStBU8Vi <control> control: Received `{"command":"seedsFor","rid":"rad:z42hL2jL4XNk6K8oHQaSWfMgCL7ji","namespaces":["z6MknSLrJoTcukLrE435hVNQT4JUhbvWLX4kUzqkEStBU8Vi"]}` on control socket
1790425825 z6MknSLrJoTcukLrE435hVNQT4JUhbvWLX4kUzqkEStBU8Vi <service> service: Received command Seeds(rad:z42hL2jL4XNk6K8oHQaSWfMgCL7ji)
1790425825 z6MknSLrJoTcukLrE435hVNQT4JUhbvWLX4kUzqkEStBU8Vi <service> service: Found 1 connected seed(s) and 1 disconnected seed(s) for rad:z42hL2jL4XNk6K8oHQaSWfMgCL7ji
1790425825 z6MknSLrJoTcukLrE435hVNQT4JUhbvWLX4kUzqkEStBU8Vi <control> control: Received `{"command":"subscribe"}` on control socket
1790425825 z6MknSLrJoTcukLrE435hVNQT4JUhbvWLX4kUzqkEStBU8Vi <control> control: Received `{"command":"announceRefsFor","rid":"rad:z42hL2jL4XNk6K8oHQaSWfMgCL7ji","namespaces":["z6MknSLrJoTcukLrE435hVNQT4JUhbvWLX4kUzqkEStBU8Vi"]}` on control socket
1790425825 z6MknSLrJoTcukLrE435hVNQT4JUhbvWLX4kUzqkEStBU8Vi <service> service: Received command AnnounceRefs(rad:z42hL2jL4XNk6K8oHQaSWfMgCL7ji)
1790425825 z6MknSLrJoTcukLrE435hVNQT4JUhbvWLX4kUzqkEStBU8Vi <service> service: Announcing refs rad:z42hL2jL4XNk6K8oHQaSWfMgCL7ji/z6MknSLrJoTcukLrE435hVNQT4JUhbvWLX4kUzqkEStBU8Vi @ 16651be0b4e2f69fdafb27d29c12844578159d61 to peers (t=1790425825023)..
1790425825 z6MknSLrJoTcukLrE435hVNQT4JUhbvWLX4kUzqkEStBU8Vi <service> service: Saved local sync status for rad:z42hL2jL4XNk6K8oHQaSWfMgCL7ji..
1790425825 z6MknSLrJoTcukLrE435hVNQT4JUhbvWLX4kUzqkEStBU8Vi <service> service: Sending refs announcement of z6MknSLrJoTcukLrE435hVNQT4JUhbvWLX4kUzqkEStBU8Vi for rad:z42hL2jL4XNk6K8oHQaSWfMgCL7ji with 1 remote(s) to z6Mkt67GdsW7715MEfRuP4pSZxJRJh6kj6Y48WRqVv4N1tRk (t=1790425825023)
1790425825 z6Mkt67GdsW7715MEfRuP4pSZxJRJh6kj6Y48WRqVv4N1tRk <service> service: Received refs announcement of z6MknSLrJoTcukLrE435hVNQT4JUhbvWLX4kUzqkEStBU8Vi for rad:z42hL2jL4XNk6K8oHQaSWfMgCL7ji with 1 remote(s) from z6MknSLrJoTcukLrE435hVNQT4JUhbvWLX4kUzqkEStBU8Vi (t=1790425825023)
1790425825 z6Mkt67GdsW7715MEfRuP4pSZxJRJh6kj6Y48WRqVv4N1tRk <service> service: Stored announcement from z6MknSLrJoTcukLrE435hVNQT4JUhbvWLX4kUzqkEStBU8Vi to be broadcast in 0 millisecond(s) (t=1790425825023)
1790425825 z6Mkt67GdsW7715MEfRuP4pSZxJRJh6kj6Y48WRqVv4N1tRk <service> service: Starting fetch for rad:z42hL2jL4XNk6K8oHQaSWfMgCL7ji from z6MknSLrJoTcukLrE435hVNQT4JUhbvWLX4kUzqkEStBU8Vi
1790425825 z6Mkt67GdsW7715MEfRuP4pSZxJRJh6kj6Y48WRqVv4N1tRk <service> service: Fetch initiated for rad:z42hL2jL4XNk6K8oHQaSWfMgCL7ji with z6MknSLrJoTcukLrE435hVNQT4JUhbvWLX4kUzqkEStBU8Vi [outbound connected] (1 remote(s))..
1790425825 z6Mkt67GdsW7715MEfRuP4pSZxJRJh6kj6Y48WRqVv4N1tRk <service> wire: Opened new stream with id 20 for rad:z42hL2jL4XNk6K8oHQaSWfMgCL7ji and remote z6MknSLrJoTcukLrE435hVNQT4JUhbvWLX4kUzqkEStBU8Vi
1790425825 z6MknSLrJoTcukLrE435hVNQT4JUhbvWLX4kUzqkEStBU8Vi <service> wire: Received `open` command for stream 20 from z6Mkt67GdsW7715MEfRuP4pSZxJRJh6kj6Y48WRqVv4N1tRk
1790425825 z6Mkt67GdsW7715MEfRuP4pSZxJRJh6kj6Y48WRqVv4N1tRk <worker#7> worker: Worker processing outgoing fetch for rad:z42hL2jL4XNk6K8oHQaSWfMgCL7ji
1790425825 z6Mkt67GdsW7715MEfRuP4pSZxJRJh6kj6Y48WRqVv4N1tRk <worker#7> worker: z6Mkt67GdsW7715MEfRuP4pSZxJRJh6kj6Y48WRqVv4N1tRk pulling from z6MknSLrJoTcukLrE435hVNQT4JUhbvWLX4kUzqkEStBU8Vi
1790425825 z6MknSLrJoTcukLrE435hVNQT4JUhbvWLX4kUzqkEStBU8Vi <worker#1> worker: Worker processing incoming fetch for z6Mkt67GdsW7715MEfRuP4pSZxJRJh6kj6Y48WRqVv4N1tRk on stream 20..
1790425825 z6MknSLrJoTcukLrE435hVNQT4JUhbvWLX4kUzqkEStBU8Vi <worker#1> worker: Spawning upload-pack process for rad:z42hL2jL4XNk6K8oHQaSWfMgCL7ji on stream 20..
1790425825 z6Mkt67GdsW7715MEfRuP4pSZxJRJh6kj6Y48WRqVv4N1tRk <worker#7> radicle_fetch::state: Fetched rad/id (2ms)
1790425825 z6Mkt67GdsW7715MEfRuP4pSZxJRJh6kj6Y48WRqVv4N1tRk <worker#7> radicle_fetch::state: Fetched data for 1 remote(s) (7ms)
1790425825 z6Mkt67GdsW7715MEfRuP4pSZxJRJh6kj6Y48WRqVv4N1tRk <worker#7> radicle_fetch::state: Fetched data refs for 0 remotes (9ms)
1790425825 z6Mkt67GdsW7715MEfRuP4pSZxJRJh6kj6Y48WRqVv4N1tRk <worker#7> radicle_fetch::state: Sent done signal to remote z6MknSLrJoTcukLrE435hVNQT4JUhbvWLX4kUzqkEStBU8Vi
1790425825 z6MknSLrJoTcukLrE435hVNQT4JUhbvWLX4kUzqkEStBU8Vi <service> wire: Received `end-of-file` on stream 20 from z6Mkt67GdsW7715MEfRuP4pSZxJRJh6kj6Y48WRqVv4N1tRk
1790425825 z6MknSLrJoTcukLrE435hVNQT4JUhbvWLX4kUzqkEStBU8Vi <upload-pack> worker: Exiting upload-pack reader thread for rad:z42hL2jL4XNk6K8oHQaSWfMgCL7ji
1790425825 z6Mkt67GdsW7715MEfRuP4pSZxJRJh6kj6Y48WRqVv4N1tRk <worker#7> radicle_fetch::state: Validated 1 remote(s) (9ms)
1790425825 z6MknSLrJoTcukLrE435hVNQT4JUhbvWLX4kUzqkEStBU8Vi <worker#1> worker: Upload pack finished (13ms)
1790425825 z6MknSLrJoTcukLrE435hVNQT4JUhbvWLX4kUzqkEStBU8Vi <worker#1> worker: Upload process on stream 20 exited with result Ok(())
1790425825 z6MknSLrJoTcukLrE435hVNQT4JUhbvWLX4kUzqkEStBU8Vi <service> wire: Stream 20 of z6Mkt67GdsW7715MEfRuP4pSZxJRJh6kj6Y48WRqVv4N1tRk closing with 0 byte(s) sent and 0 byte(s) received
1790425825 z6MknSLrJoTcukLrE435hVNQT4JUhbvWLX4kUzqkEStBU8Vi <service> wire: Peer z6Mkt67GdsW7715MEfRuP4pSZxJRJh6kj6Y48WRqVv4N1tRk fetched rad:z42hL2jL4XNk6K8oHQaSWfMgCL7ji from us successfully
1790425825 z6Mkt67GdsW7715MEfRuP4pSZxJRJh6kj6Y48WRqVv4N1tRk <service> wire: Received `close` command for stream 20 from z6MknSLrJoTcukLrE435hVNQT4JUhbvWLX4kUzqkEStBU8Vi
1790425825 z6Mkt67GdsW7715MEfRuP4pSZxJRJh6kj6Y48WRqVv4N1tRk <service> wire: Stream 20 of z6MknSLrJoTcukLrE435hVNQT4JUhbvWLX4kUzqkEStBU8Vi closed with 0 byte(s) sent and 0 byte(s) received
1790425825 z6Mkt67GdsW7715MEfRuP4pSZxJRJh6kj6Y48WRqVv4N1tRk <worker#7> radicle_fetch::state: Applied updates (10ms)
1790425825 z6Mkt67GdsW7715MEfRuP4pSZxJRJh6kj6Y48WRqVv4N1tRk <worker#7> radicle_fetch: Finished pull of rad:z42hL2jL4XNk6K8oHQaSWfMgCL7ji (15ms)
1790425825 z6Mkt67GdsW7715MEfRuP4pSZxJRJh6kj6Y48WRqVv4N1tRk <worker#7> storage: Obtained identity COB root commit '0656c217f917c3e06234771e9ecae53aba5e173e' via reference 'refs/rad/root' in namespace of founder 'did:key:z6MknSLrJoTcukLrE435hVNQT4JUhbvWLX4kUzqkEStBU8Vi' of identity document 'rad:z42hL2jL4XNk6K8oHQaSWfMgCL7ji'.
1790425825 z6Mkt67GdsW7715MEfRuP4pSZxJRJh6kj6Y48WRqVv4N1tRk <worker#7> cob: Loading object of type xyz.radicle.id at 0656c217f917c3e06234771e9ecae53aba5e173e.
1790425825 z6Mkt67GdsW7715MEfRuP4pSZxJRJh6kj6Y48WRqVv4N1tRk <worker#7> storage: Setting ref: refs/rad/id -> 0656c217f917c3e06234771e9ecae53aba5e173e
1790425825 z6Mkt67GdsW7715MEfRuP4pSZxJRJh6kj6Y48WRqVv4N1tRk <worker#7> cob: Loading object of type xyz.radicle.id at 0656c217f917c3e06234771e9ecae53aba5e173e.
1790425825 z6Mkt67GdsW7715MEfRuP4pSZxJRJh6kj6Y48WRqVv4N1tRk <service> service: Fetched rad:z42hL2jL4XNk6K8oHQaSWfMgCL7ji from z6MknSLrJoTcukLrE435hVNQT4JUhbvWLX4kUzqkEStBU8Vi successfully
1790425825 z6Mkt67GdsW7715MEfRuP4pSZxJRJh6kj6Y48WRqVv4N1tRk <service> service: Ref updated: ~ 55be805..16651be refs/namespaces/z6MknSLrJoTcukLrE435hVNQT4JUhbvWLX4kUzqkEStBU8Vi/refs/rad/sigrefs for rad:z42hL2jL4XNk6K8oHQaSWfMgCL7ji
1790425825 z6Mkt67GdsW7715MEfRuP4pSZxJRJh6kj6Y48WRqVv4N1tRk <service> service: Ref updated: * 0000000..145e1e6 refs/namespaces/z6MknSLrJoTcukLrE435hVNQT4JUhbvWLX4kUzqkEStBU8Vi/refs/heads/alice/1 for rad:z42hL2jL4XNk6K8oHQaSWfMgCL7ji
1790425825 z6Mkt67GdsW7715MEfRuP4pSZxJRJh6kj6Y48WRqVv4N1tRk <service> service: Sending refs announcement of z6Mkt67GdsW7715MEfRuP4pSZxJRJh6kj6Y48WRqVv4N1tRk for rad:z42hL2jL4XNk6K8oHQaSWfMgCL7ji with 1 remote(s) to z6MknSLrJoTcukLrE435hVNQT4JUhbvWLX4kUzqkEStBU8Vi (t=1790425825052)
1790425825 z6MknSLrJoTcukLrE435hVNQT4JUhbvWLX4kUzqkEStBU8Vi <service> service: Received refs announcement of z6Mkt67GdsW7715MEfRuP4pSZxJRJh6kj6Y48WRqVv4N1tRk for rad:z42hL2jL4XNk6K8oHQaSWfMgCL7ji with 1 remote(s) from z6Mkt67GdsW7715MEfRuP4pSZxJRJh6kj6Y48WRqVv4N1tRk (t=1790425825052)
1790425825 z6MknSLrJoTcukLrE435hVNQT4JUhbvWLX4kUzqkEStBU8Vi <service> service: Stored announcement from z6Mkt67GdsW7715MEfRuP4pSZxJRJh6kj6Y48WRqVv4N1tRk to be broadcast in 0 millisecond(s) (t=1790425825052)
1790425825 z6MknSLrJoTcukLrE435hVNQT4JUhbvWLX4kUzqkEStBU8Vi <service> service: Refs announcement of z6Mkt67GdsW7715MEfRuP4pSZxJRJh6kj6Y48WRqVv4N1tRk for rad:z42hL2jL4XNk6K8oHQaSWfMgCL7ji contains our own remote at 16651be0b4e2f69fdafb27d29c12844578159d61 (t=1790425825052)
1790425825 z6MknSLrJoTcukLrE435hVNQT4JUhbvWLX4kUzqkEStBU8Vi <service> service: Updating sync status of z6Mkt67GdsW7715MEfRuP4pSZxJRJh6kj6Y48WRqVv4N1tRk for rad:z42hL2jL4XNk6K8oHQaSWfMgCL7ji to 16651be0b4e2f69fdafb27d29c12844578159d61
1790425825 z6MknSLrJoTcukLrE435hVNQT4JUhbvWLX4kUzqkEStBU8Vi <service> service: Skipping fetch for rad:z42hL2jL4XNk6K8oHQaSWfMgCL7ji, all refs are already in storage
1790425825 test: git-push:69: `git push rad :master` @ /tmp/.tmpwcuRtb/alice/work
1790425825 test: git-push:77: `git push -o alien rad HEAD:alice/2` @ /tmp/.tmpwcuRtb/alice/work
1790425825 test: git-push:84: `git commit -m Something good --allow-empty -s` @ /tmp/.tmpwcuRtb/alice/work
1790425825 test: git-push:88: `git push -o no-sync rad ddcc1f164eacfd7dba41da9bff3261da3ee79fd3:refs/heads/alice/2` @ /tmp/.tmpwcuRtb/alice/work
1790425825 test: git-fetch:2: `cd /tmp/.tmpwcuRtb/bob/work/heartwood`..
1790425825 test: git-fetch:3: `git branch -r` @ /tmp/.tmpwcuRtb/bob/work/heartwood
1790425825 test: git-fetch:9: `git ls-remote alice@z6MknSLrJoTcukLrE435hVNQT4JUhbvWLX4kUzqkEStBU8Vi refs/heads/*` @ /tmp/.tmpwcuRtb/bob/work/heartwood
1790425825 test: git-fetch:15: `git fetch alice@z6MknSLrJoTcukLrE435hVNQT4JUhbvWLX4kUzqkEStBU8Vi` @ /tmp/.tmpwcuRtb/bob/work/heartwood
1790425825 test: git-fetch:21: `git branch -r` @ /tmp/.tmpwcuRtb/bob/work/heartwood
thread 'commands::git::git_push_and_fetch' (27717) panicked at crates/radicle-cli-test/src/lib.rs:504:36:
[31m--- Expected[0m
[32m++++ actual: stdout[0m
[2m 1[0m [31m-[0m [31m alice@z6MknSLrJoTcukLrE435hVNQT4JUhbvWLX4kUzqkEStBU8Vi/HEAD -> alice@z6MknSLrJoTcukLrE435hVNQT4JUhbvWLX4kUzqkEStBU8Vi/master
[0m[2m 2[0m [2m 1[0m [2m|[0m [2m alice@z6MknSLrJoTcukLrE435hVNQT4JUhbvWLX4kUzqkEStBU8Vi/alice/1
[0m[2m 3[0m [2m 2[0m [2m|[0m [2m alice@z6MknSLrJoTcukLrE435hVNQT4JUhbvWLX4kUzqkEStBU8Vi/master
[0m[2m 4[0m [2m 3[0m [2m|[0m [2m rad/master
[0m
note: run with `RUST_BACKTRACE=1` environment variable to display a backtrace
1790425825 test: Node z6Mkt67GdsW7715MEfRuP4pSZxJRJh6kj6Y48WRqVv4N1tRk shutting down..
1790425825 commands::git::git_push_and_fetch reactor::controller: Initiating reactor shutdown…
1790425825 z6Mkt67GdsW7715MEfRuP4pSZxJRJh6kj6Y48WRqVv4N1tRk <control> control: Received `{"command":"shutdown"}` on control socket
1790425825 z6Mkt67GdsW7715MEfRuP4pSZxJRJh6kj6Y48WRqVv4N1tRk <control> control: Shutdown requested..
1790425825 z6Mkt67GdsW7715MEfRuP4pSZxJRJh6kj6Y48WRqVv4N1tRk <service> reactor: Shutdown
1790425825 z6Mkt67GdsW7715MEfRuP4pSZxJRJh6kj6Y48WRqVv4N1tRk <runtime> pool: Worker pool shutting down..
1790425825 z6Mkt67GdsW7715MEfRuP4pSZxJRJh6kj6Y48WRqVv4N1tRk <runtime> node: Node shutdown completed for z6Mkt67GdsW7715MEfRuP4pSZxJRJh6kj6Y48WRqVv4N1tRk
1790425825 test: Node z6MknSLrJoTcukLrE435hVNQT4JUhbvWLX4kUzqkEStBU8Vi shutting down..
1790425825 commands::git::git_push_and_fetch reactor::controller: Initiating reactor shutdown…
1790425825 z6MknSLrJoTcukLrE435hVNQT4JUhbvWLX4kUzqkEStBU8Vi <service> reactor: Shutdown
1790425825 z6MknSLrJoTcukLrE435hVNQT4JUhbvWLX4kUzqkEStBU8Vi <control> control: Received `{"command":"shutdown"}` on control socket
1790425825 z6MknSLrJoTcukLrE435hVNQT4JUhbvWLX4kUzqkEStBU8Vi <control> control: Shutdown requested..
1790425825 z6MknSLrJoTcukLrE435hVNQT4JUhbvWLX4kUzqkEStBU8Vi <runtime> pool: Worker pool shutting down..
1790425825 z6MknSLrJoTcukLrE435hVNQT4JUhbvWLX4kUzqkEStBU8Vi <runtime> node: Node shutdown completed for z6MknSLrJoTcukLrE435hVNQT4JUhbvWLX4kUzqkEStBU8Vi
failures:
commands::git::git_push_and_fetch
test result: FAILED. 122 passed; 1 failed; 3 ignored; 0 measured; 0 filtered out; finished in 75.78s
error: test failed, to rerun pass `-p radicle-cli --test commands`
Running unittests src/lib.rs (target/debug/deps/radicle_cli_test-abde74eb136ebe85)
running 3 tests
test tests::test_parse ... ok
test tests::test_run ... ok
test tests::test_example_spaced_brackets ... ok
test result: ok. 3 passed; 0 failed; 0 ignored; 0 measured; 0 filtered out; finished in 0.00s
Running unittests src/lib.rs (target/debug/deps/radicle_cob-9020a582e8a16531)
running 9 tests
test object::tests::test_serde ... ok
test tests::git::roundtrip ... ok
test tests::git::list_cobs ... ok
test tests::git::update_cob ... ok
test tests::invalid_parse_refstr ... ok
test type_name::test::invalid_typenames ... ok
test type_name::test::valid_typenames ... ok
test tests::parse_refstr ... ok
test tests::git::traverse_cobs ... ok
test result: ok. 9 passed; 0 failed; 0 ignored; 0 measured; 0 filtered out; finished in 0.01s
Running unittests src/lib.rs (target/debug/deps/radicle_core-c6d24468dd71b428)
running 4 tests
test repo::test::valid ... ok
test repo::test::invalid ... ok
test repo::test::assert_prop_roundtrip_parse ... ok
test repo::serde_impls::test::assert_prop_roundtrip_serde_json ... ok
test result: ok. 4 passed; 0 failed; 0 ignored; 0 measured; 0 filtered out; finished in 0.00s
Running unittests src/lib.rs (target/debug/deps/radicle_crypto-16f31f5bdb1e3f77)
running 12 tests
test ssh::agent::test::test_agent_encoding_sign ... ok
test ssh::agent::test::test_agent_encoding_remove ... ok
test ssh::fmt::test::test_key ... ok
test ssh::fmt::test::test_fingerprint ... ok
test tests::did_key_sample ... ok
test ssh::keystore::tests::test_init_no_passphrase ... ok
test tests::diffie_hellman_fixture ... ok
test tests::diffie_hellman ... ok
test tests::prop_encode_decode ... ok
test tests::prop_key_equality ... ok
test ssh::keystore::tests::test_signer ... ok
test ssh::keystore::tests::test_init_passphrase ... ok
test result: ok. 12 passed; 0 failed; 0 ignored; 0 measured; 0 filtered out; finished in 0.81s
Running unittests src/lib.rs (target/debug/deps/radicle_dag-b0910ecd42e75440)
running 20 tests
test tests::test_contains ... ok
test tests::test_dependencies ... ok
test tests::test_cycle ... ok
test tests::test_diamond ... ok
test tests::test_fold_diamond ... ok
test tests::test_fold_multiple_roots ... ok
test tests::test_fold_reject ... ok
test tests::test_fold_sorting_1 ... ok
test tests::test_fold_sorting_2 ... ok
test tests::test_complex ... ok
test tests::test_len ... ok
test tests::test_get ... ok
test tests::test_is_empty ... ok
test tests::test_merge_1 ... ok
test tests::test_merge_2 ... ok
test tests::test_prune_1 ... ok
test tests::test_prune_2 ... ok
test tests::test_remove ... ok
test tests::test_siblings ... ok
test tests::test_prune_by_sorting ... ok
test result: ok. 20 passed; 0 failed; 0 ignored; 0 measured; 0 filtered out; finished in 0.00s
Running unittests src/lib.rs (target/debug/deps/radicle_fetch-c2452365fbd588f3)
running 0 tests
test result: ok. 0 passed; 0 failed; 0 ignored; 0 measured; 0 filtered out; finished in 0.00s
Running unittests src/lib.rs (target/debug/deps/radicle_git_metadata-73a4cc73bbef2b23)
running 24 tests
test commit::parse::test::error::invalid_author ... ok
test commit::parse::test::error::invalid_committer ... ok
test commit::parse::test::error::invalid_format_continuation_without_preceding_header ... ok
test commit::parse::test::error::invalid_parent ... ok
test commit::parse::test::error::invalid_tree ... ok
test commit::parse::test::error::missing_header_body_separator ... ok
test commit::parse::test::error::missing_author ... ok
test commit::parse::test::error::missing_committer ... ok
test commit::parse::test::error::missing_tree_wrong_first_line ... ok
test commit::parse::test::error::missing_tree_empty_header ... ok
test commit::parse::test::success::commit_gpgsig_is_preserved_and_strip_removes_it ... ok
test commit::parse::test::success::commit_last_paragraph_kept_in_message_when_not_all_trailers ... ok
test commit::parse::test::success::commit_with_single_parent ... ok
test commit::parse::test::success::commit_with_extra_headers ... ok
test commit::parse::test::success::commit_with_multiline_gpgsig ... ok
test commit::parse::test::success::commit_with_trailers ... ok
test commit::parse::test::success::merge_commit ... ok
test commit::parse::test::success::root_commit ... ok
test commit::parse::test::success::roundtrip ... ok
test commit::parse::test::unit::body_last_paragraph_not_trailers_stays_in_message ... ok
test commit::parse::test::unit::body_no_paragraph_separator_means_no_trailers ... ok
test commit::parse::test::unit::trailers_accepts_empty_input ... ok
test commit::parse::test::unit::trailers_rejects_line_without_separator ... ok
test commit::parse::test::unit::trailers_rejects_invalid_token_chars ... ok
test result: ok. 24 passed; 0 failed; 0 ignored; 0 measured; 0 filtered out; finished in 0.00s
Running unittests src/lib.rs (target/debug/deps/radicle_git_ref_format-f8dbe786042836b5)
running 9 tests
test test::component ... ok
test test::qualified ... ok
test test::component_invalid - should panic ... ok
test test::pattern ... ok
test test::qualified_invalid - should panic ... ok
test test::qualified_pattern ... ok
test test::refname ... ok
test test::qualified_pattern_invalid - should panic ... ok
test test::refname_invalid - should panic ... ok
test result: ok. 9 passed; 0 failed; 0 ignored; 0 measured; 0 filtered out; finished in 0.00s
Running unittests src/lib.rs (target/debug/deps/radicle_localtime-9c62c7314f35ce4d)
running 1 test
test serde_impls::test::test_localtime ... ok
test result: ok. 1 passed; 0 failed; 0 ignored; 0 measured; 0 filtered out; finished in 0.00s
Running unittests src/lib.rs (target/debug/deps/radicle_log-fc4d87322da5fd7c)
running 0 tests
test result: ok. 0 passed; 0 failed; 0 ignored; 0 measured; 0 filtered out; finished in 0.00s
Running unittests src/lib.rs (target/debug/deps/radicle_node-d2d1a7de4eed55a3)
running 87 tests
test reactor::timer::tests::test_next ... ok
test reactor::timer::tests::test_wake ... ok
test reactor::timer::tests::test_wake_exact ... ok
test control::tests::test_control_socket ... ok
test fingerprint::tests::matching ... ok
test control::tests::test_seed_unseed ... ok
test tests::announcement_rebroadcast ... ok
test tests::announcement_rebroadcast_timestamp_filtered ... ok
test tests::announcement_rebroadcast_deduplicates ... ok
test tests::connection_kept_alive ... ok
test tests::announcement_relay ... ok
test tests::disconnecting_unresponsive_peer ... ok
test tests::e2e::fetch_does_not_contain_rad_sigrefs_parent ... ok
test tests::e2e::clone_without_founder_namespace ... ok
test tests::e2e::missing_default_branch ... ok
test tests::e2e::public_to_private_to_public_replay ... ok
test tests::e2e::test_block_active_connection ... ok
test tests::e2e::missing_delegate_default_branch ... ok
test tests::e2e::test_background_foreground_fetch ... ok
test tests::e2e::test_block_prevents_connection ... ok
test tests::e2e::test_block_prevents_fetch ... ok
test tests::e2e::test_channel_reader_limit ... ok
test tests::e2e::test_catchup_on_refs_announcements ... ok
test tests::e2e::test_clone ... ok
test tests::e2e::test_connection_crossing ... ok
test tests::e2e::test_dont_fetch_owned_refs ... ok
test tests::e2e::test_fetch_emits_canonical_ref_update_partial_glob ... ok
test tests::e2e::test_concurrent_fetches ... ok
test tests::e2e::test_fetch_followed_remotes ... ok
test tests::announcement_message_amplification ... ok
test tests::e2e::test_fetch_unseeded ... ok
test tests::e2e::test_fetch_preserve_owned_refs ... ok
test tests::e2e::test_fetch_up_to_date ... ok
test tests::e2e::test_inventory_sync_basic ... ok
test tests::e2e::test_fetch_emits_canonical_ref_update ... ok
test tests::e2e::test_large_fetch ... ok
test tests::e2e::test_migrated_clone ... ok
test tests::e2e::test_missing_remote ... ok
test tests::e2e::test_multiple_offline_inits ... ok
test tests::e2e::test_non_fast_forward_identity_doc ... ok
test tests::e2e::test_non_fast_forward_sigrefs ... ok
test tests::e2e::test_outdated_delegate_sigrefs ... ok
test tests::e2e::test_outdated_sigrefs ... ok
test tests::e2e::test_replication ... ok
test tests::e2e::test_replication_invalid ... ok
test tests::e2e::test_replication_ref_in_sigrefs ... ok
test tests::e2e::test_inventory_sync_bridge ... ok
test tests::fetch_missing_inventory_on_gossip ... ok
test tests::fetch_missing_inventory_on_schedule ... ok
test tests::inbound_connection ... ok
test tests::inventory_decode ... ok
test tests::init_and_seed ... ok
test tests::e2e::test_inventory_sync_ring ... ok
test tests::e2e::test_inventory_sync_star ... ok
test tests::inventory_relay_bad_timestamp ... ok
test tests::inventory_relay ... ok
test tests::maintain_connections_failed_attempt ... ok
test tests::inventory_sync ... ok
test tests::maintain_connections_same_second_loop ... ok
test tests::maintain_connections_transient ... ok
test tests::maintain_connections ... ok
test tests::orphaned_fetch_blocks_repo_from_all_nodes ... ok
test tests::outbound_connection ... ok
test tests::persistent_peer_connect ... ok
test tests::persistent_peer_reconnect_attempt ... ok
test tests::persistent_peer_reconnect_success ... ok
test tests::ping_response ... ok
test tests::queued_fetch_from_ann_same_rid ... ok
test tests::queued_fetch_from_command_same_rid ... ok
test tests::queued_fetch_max_capacity ... ok
test tests::redundant_connect ... ok
test tests::refs_announcement_fetch_trusted_no_inventory ... ok
test tests::refs_announcement_followed ... ok
test tests::refs_announcement_no_subscribe ... ok
test tests::inventory_pruning ... ok
test tests::refs_announcement_offline ... ok
test tests::refs_announcement_relay_private ... ok
test tests::refs_announcement_relay_public ... ok
test tests::refs_announcement_subscribe_private ... ok
test tests::seeding ... ok
test wire::test::test_inventory_ann_with_extension ... ok
test wire::test::test_pong_message_with_extension ... ok
test tests::seed_repo_subscribe ... ok
test wire::test::worker_result_clears_active_when_peer_connected ... ok
test tests::refs_synced_event ... ok
test wire::test::worker_result_clears_active_when_peer_disconnecting ... ok
test tests::prop_inventory_exchange_dense ... ok
test result: ok. 87 passed; 0 failed; 0 ignored; 0 measured; 0 filtered out; finished in 15.85s
Running unittests src/main.rs (target/debug/deps/radicle_node-ba2db260d168a4c6)
running 0 tests
test result: ok. 0 passed; 0 failed; 0 ignored; 0 measured; 0 filtered out; finished in 0.00s
Running unittests src/lib.rs (target/debug/deps/radicle_oid-902c7d6f046f549b)
running 10 tests
test fmt::test::gix ... ok
test fmt::test::fixture ... ok
test fmt::test::zero ... ok
test git2::test::zero ... ok
test gix::test::zero ... ok
test str::test::fixture ... ok
test fmt::test::git2 ... ok
test str::test::git2_roundtrip ... ok
test str::test::zero ... ok
test str::test::gix_roundtrip ... ok
test result: ok. 10 passed; 0 failed; 0 ignored; 0 measured; 0 filtered out; finished in 0.00s
Running unittests src/lib.rs (target/debug/deps/radicle_protocol-ebec3acf3d927628)
running 100 tests
test deserializer::test::test_decode_next ... ok
test deserializer::test::test_unparsed ... ok
test deserializer::test::prop_decode_next ... ok
test fetcher::service::tests::test_fetch_coalescing_different_refs ... ok
test fetcher::test::queue::properties::capacity::capacity_reached_returns_same_item ... ok
test fetcher::test::queue::properties::dequeue::drained_queue_returns_none ... ok
test fetcher::test::queue::properties::dequeue::empty_queue_returns_none ... ok
test fetcher::test::queue::properties::dequeue::enables_reenqueue ... ok
test fetcher::test::queue::properties::capacity::bounded ... ok
test fetcher::test::queue::properties::equality::reflexive ... ok
test fetcher::test::queue::properties::capacity::rejection ... ok
test fetcher::test::queue::properties::equality::symmetric ... ok
test fetcher::test::queue::properties::fifo::interleaved_operations ... ok
test fetcher::test::queue::properties::equality::transitive ... ok
test fetcher::test::queue::properties::fifo::ordering ... ok
test fetcher::test::queue::properties::merge::different_rid_accepted ... ok
test fetcher::test::queue::properties::merge::does_not_increase_queue_length ... ok
test fetcher::test::queue::properties::merge::longer_timeout_preserved ... ok
test fetcher::test::queue::properties::merge::combines_refs ... ok
test fetcher::test::queue::properties::merge::empty_refs_fetches_all ... ok
test fetcher::test::queue::unit::capacity_takes_precedence_over_merge_for_new_items ... ok
test fetcher::test::queue::unit::empty_refs_items_can_be_equal ... ok
test fetcher::test::queue::unit::max_timeout_accepted ... ok
test fetcher::test::queue::unit::merge_preserves_position_in_queue ... ok
test fetcher::test::queue::unit::zero_timeout_accepted ... ok
test fetcher::test::state::command::cancel::cancellation_is_isolated ... ok
test fetcher::test::state::command::cancel::non_existent_returns_unexpected ... ok
test fetcher::test::state::command::cancel::ongoing_and_queued ... ok
test fetcher::test::state::command::cancel::single_ongoing ... ok
test fetcher::test::state::command::fetch::fetch_after_previous_completed ... ok
test fetcher::test::state::command::fetch::fetch_at_capacity_enqueues ... ok
test fetcher::test::state::command::fetch::fetch_different_repo_same_node_within_capacity ... ok
test fetcher::test::state::command::fetch::fetch_duplicate_returns_already_fetching ... ok
test fetcher::test::queue::properties::merge::succeed_when_at_capacity ... ok
test fetcher::test::state::command::fetch::fetch_queue_merge_empty_refs_fetches_all ... ok
test fetcher::test::state::command::fetch::fetch_queue_merge_takes_longer_timeout ... ok
test fetcher::test::state::command::fetch::fetch_queue_merges_already_queued ... ok
test fetcher::test::state::command::fetch::fetch_queue_rejected_capacity_reached ... ok
test fetcher::test::state::command::fetch::fetch_same_repo_different_nodes_queues_second ... ok
test fetcher::test::state::command::fetch::fetch_same_repo_different_refs_enqueues ... ok
test fetcher::test::state::command::fetch::fetch_start_first_fetch_for_node ... ok
test fetcher::test::state::command::fetched::complete_one_of_multiple ... ok
test fetcher::test::state::command::fetched::complete_then_dequeue_fifo ... ok
test fetcher::test::state::command::fetched::non_existent_returns_not_found ... ok
test fetcher::test::state::command::fetched::complete_single_ongoing ... ok
test fetcher::test::state::command::fetched::stale_from_does_not_clear_active ... ok
test fetcher::test::state::concurrent::fetched_then_cancel ... ok
test fetcher::test::state::concurrent::interleaved_operations ... ok
test fetcher::test::state::config::min_queue_size ... ok
test fetcher::test::state::dequeue::cannot_dequeue_while_node_at_capacity ... ok
test fetcher::test::state::dequeue::empty_queue_returns_none ... ok
test fetcher::test::state::dequeue::maintains_fifo_order ... ok
test fetcher::test::state::invariant::queue_integrity_after_merge ... ok
test fetcher::test::state::config::high_concurrency ... ok
test fetcher::test::state::multinode::independent_queues ... ok
test service::filter::test::compatible ... ok
test service::filter::test::test_parameters ... ok
test fetcher::test::state::multinode::high_count ... ok
test fetcher::test::queue::properties::capacity::restored_after_dequeue ... ok
test service::limiter::test::test_limiter_different_rates ... ok
test service::limiter::test::test_limiter_multi ... ok
test service::limiter::test::test_limiter_refill ... ok
test service::gossip::store::test::test_announced ... ok
test service::filter::test::test_sizes ... ok
test service::message::tests::test_inventory_limit ... ok
test service::message::tests::prop_refs_announcement_signing ... ok
test wire::frame::test::test_encode_git_large ... ok
test wire::frame::test::test_stream_id ... ok
test service::message::tests::test_ref_remote_limit ... ok
test wire::message::tests::prop_roundtrip_address ... ok
test fetcher::test::queue::properties::merge::same_rid_merges_anywhere_in_queue ... ok
test wire::message::tests::prop_roundtrip_message ... ok
test wire::message::tests::test_inv_ann_max_size ... ok
test wire::message::tests::test_node_ann_max_size ... ok
test wire::message::tests::test_ping_encode_size_overflow - should panic ... ok
test wire::message::tests::test_pingpong_encode_max_size ... ok
test wire::message::tests::test_pong_encode_size_overflow - should panic ... ok
test wire::message::tests::prop_zero_bytes_encode_decode ... ok
test wire::tests::prop_oid ... ok
test wire::message::tests::test_refs_ann_max_size ... ok
test wire::tests::prop_roundtrip_publickey ... ok
test wire::tests::prop_roundtrip_filter ... ok
test wire::tests::prop_roundtrip_repoid ... ok
test wire::tests::prop_roundtrip_tuple ... ok
test wire::tests::prop_roundtrip_u16 ... ok
test wire::tests::prop_roundtrip_u32 ... ok
test wire::tests::prop_roundtrip_u64 ... ok
test wire::tests::prop_roundtrip_refs ... ok
test wire::tests::prop_roundtrip_vec ... ok
test wire::tests::prop_signature ... ok
test wire::tests::test_alias ... ok
test wire::tests::test_bounded_vec_limit ... ok
test wire::tests::prop_string ... ok
test wire::tests::test_filter_invalid ... ok
test wire::tests::test_string ... ok
test wire::varint::test::test_encode_overflow - should panic ... ok
test wire::varint::test::prop_roundtrip_varint ... ok
test wire::varint::test::test_encoding ... ok
test service::message::tests::test_node_announcement_validate ... ok
test wire::message::tests::prop_message_decoder ... ok
test result: ok. 100 passed; 0 failed; 0 ignored; 0 measured; 0 filtered out; finished in 0.37s
Running unittests src/main.rs (target/debug/deps/git_remote_rad-d348b2c7ced84625)
running 12 tests
test protocol::tests::test_capabilities ... ok
test protocol::tests::test_empty ... ok
test protocol::tests::test_fetch_whitespace ... ok
test protocol::tests::test_invalid ... ok
test protocol::tests::test_fetch ... ok
test protocol::tests::test_list ... ok
test protocol::tests::test_list_for_push ... ok
test protocol::tests::test_option ... ok
test protocol::tests::test_push_delete ... ok
test protocol::tests::test_option_whitespace_preservation ... ok
test protocol::tests::test_push ... ok
test protocol::tests::test_push_force ... ok
test result: ok. 12 passed; 0 failed; 0 ignored; 0 measured; 0 filtered out; finished in 0.00s
Running unittests src/main.rs (target/debug/deps/radicle_schemars-cdbb515601af1c25)
running 0 tests
test result: ok. 0 passed; 0 failed; 0 ignored; 0 measured; 0 filtered out; finished in 0.00s
Running unittests src/lib.rs (target/debug/deps/radicle_signals-89dc8d5b58cd3239)
running 0 tests
test result: ok. 0 passed; 0 failed; 0 ignored; 0 measured; 0 filtered out; finished in 0.00s
Running unittests src/lib.rs (target/debug/deps/radicle_surf-7eeab6538a1ee941)
running 41 tests
test test::code_browsing::test_commit_history ... ok
test test::code_browsing::test_commit_signature ... ok
test test::diff::test_both_missing_eof_newline ... ok
test test::code_browsing::browse_repo_lazily ... ok
test test::code_browsing::iterate_root_dir_recursive ... ok
test test::diff::test_diff ... ok
test test::diff::test_diff_file ... ok
test test::diff::test_diff_of_rev ... ok
test test::diff::test_new_missing_eof_newline ... ok
test test::diff::test_none_missing_eof_newline ... ok
test test::diff::test_old_missing_eof_newline ... ok
test test::diff::test_initial_diff ... ok
test test::code_browsing::test_file_history ... ok
test test::file_system::directory::directory_find_file_and_directory ... ok
test test::file_system::directory::directory_find_entry ... ok
test test::file_system::directory::directory_size ... ok
test test::file_system::directory::directory_last_commit ... ok
test test::file_system::directory::file_last_commit ... ok
test test::last_commit::binary_file ... ok
test test::diff::test_branch_diff ... ok
test test::last_commit::folder_svelte ... ok
test test::last_commit::can_get_last_commit_for_special_filenames ... ok
test test::last_commit::readme_missing_and_memory ... ok
test test::last_commit::root ... ok
test test::last_commit::nest_directory ... ok
test test::namespace::me_namespace ... ok
test test::namespace::golden_namespace ... ok
test test::namespace::switch_to_banana ... ok
test test::namespace::silver_namespace ... ok
test test::reference::test_branches ... ok
test test::reference::test_tag_snapshot ... ok
test test::rev::commit ... ok
test test::rev::_master ... ok
test test::reference::test_namespaces ... ok
test test::rev::commit_parents ... ok
test test::rev::tag ... ok
test test::submodule::test_submodule_bare ... ignored, segfault
test test::rev::commit_short ... ok
test test::threading::basic_test ... ok
test test::file_system::directory::directory_with_bracket_in_name ... ok
test test::submodule::test_submodule ... ok
test result: ok. 40 passed; 0 failed; 1 ignored; 0 measured; 0 filtered out; finished in 5.13s
Running unittests src/lib.rs (target/debug/deps/radicle_systemd-07432556807b819e)
running 0 tests
test result: ok. 0 passed; 0 failed; 0 ignored; 0 measured; 0 filtered out; finished in 0.00s
Running unittests src/lib.rs (target/debug/deps/radicle_term-48a9911d7b9aa22b)
running 22 tests
test ansi::tests::wrapping ... ok
test ansi::tests::no_color_disables_colors_not_styles ... ok
test cell::test::test_width ... ok
test element::test::test_spaced ... ok
test element::test::test_width ... ok
test element::test::test_truncate ... ok
test table::test::test_table ... ok
test ansi::tests::colors_enabled ... ok
test ansi::tests::colors_disabled ... ok
test table::test::test_table_border_maximized ... ok
test table::test::test_table_border ... ok
test table::test::test_table_truncate ... ok
test table::test::test_table_unicode ... ok
test table::test::test_table_border_truncated ... ok
test table::test::test_table_unicode_truncate ... ok
test table::test::test_truncate ... ok
test textarea::test::test_wrapping_code_block ... ok
test textarea::test::test_wrapping ... ok
test textarea::test::test_wrapping_fenced_block ... ok
test vstack::test::test_vstack ... ok
test vstack::test::test_vstack_maximize ... ok
test textarea::test::test_wrapping_paragraphs ... ok
test result: ok. 22 passed; 0 failed; 0 ignored; 0 measured; 0 filtered out; finished in 0.00s
Running unittests src/lib.rs (target/debug/deps/radicle_windows-76d8fb89c31a649a)
running 0 tests
test result: ok. 0 passed; 0 failed; 0 ignored; 0 measured; 0 filtered out; finished in 0.00s
Doc-tests radicle
running 1 test
test crates/radicle/src/cob/patch/encoding/review.rs - cob::patch::encoding::review::Review (line 23) ... ignored
test result: ok. 0 passed; 0 failed; 1 ignored; 0 measured; 0 filtered out; finished in 0.00s
Doc-tests radicle_address
running 0 tests
test result: ok. 0 passed; 0 failed; 0 ignored; 0 measured; 0 filtered out; finished in 0.00s
Doc-tests radicle_cli
running 0 tests
test result: ok. 0 passed; 0 failed; 0 ignored; 0 measured; 0 filtered out; finished in 0.00s
Doc-tests radicle_cli_test
running 0 tests
test result: ok. 0 passed; 0 failed; 0 ignored; 0 measured; 0 filtered out; finished in 0.00s
Doc-tests radicle_cob
running 1 test
test crates/radicle-cob/src/backend/stable.rs - backend::stable::with_advanced_timestamp (line 56) ... ignored
test result: ok. 0 passed; 0 failed; 1 ignored; 0 measured; 0 filtered out; finished in 0.00s
all doctests ran in 0.09s; merged doctests compilation took 0.08s
Doc-tests radicle_core
running 0 tests
test result: ok. 0 passed; 0 failed; 0 ignored; 0 measured; 0 filtered out; finished in 0.00s
Doc-tests radicle_crypto
running 0 tests
test result: ok. 0 passed; 0 failed; 0 ignored; 0 measured; 0 filtered out; finished in 0.00s
Doc-tests radicle_dag
running 0 tests
test result: ok. 0 passed; 0 failed; 0 ignored; 0 measured; 0 filtered out; finished in 0.00s
Doc-tests radicle_fetch
running 0 tests
test result: ok. 0 passed; 0 failed; 0 ignored; 0 measured; 0 filtered out; finished in 0.00s
Doc-tests radicle_git_metadata
running 0 tests
test result: ok. 0 passed; 0 failed; 0 ignored; 0 measured; 0 filtered out; finished in 0.00s
Doc-tests radicle_git_ref_format
running 3 tests
test crates/radicle-git-ref-format/src/deriv.rs - deriv::Namespaced (line 279) ... ok
test crates/radicle-git-ref-format/src/deriv.rs - deriv::Qualified<'a>::from_components (line 30) ... ok
test crates/radicle-git-ref-format/src/refspec.rs - refspec::NamespacedPattern (line 467) ... ok
test result: ok. 3 passed; 0 failed; 0 ignored; 0 measured; 0 filtered out; finished in 0.00s
all doctests ran in 0.15s; merged doctests compilation took 0.14s
Doc-tests radicle_localtime
running 0 tests
test result: ok. 0 passed; 0 failed; 0 ignored; 0 measured; 0 filtered out; finished in 0.00s
Doc-tests radicle_log
running 0 tests
test result: ok. 0 passed; 0 failed; 0 ignored; 0 measured; 0 filtered out; finished in 0.00s
Doc-tests radicle_node
running 0 tests
test result: ok. 0 passed; 0 failed; 0 ignored; 0 measured; 0 filtered out; finished in 0.00s
Doc-tests radicle_oid
running 0 tests
test result: ok. 0 passed; 0 failed; 0 ignored; 0 measured; 0 filtered out; finished in 0.00s
Doc-tests radicle_protocol
running 6 tests
test crates/radicle-protocol/src/bounded.rs - bounded::BoundedVec<T,N>::truncate (line 50) ... ok
test crates/radicle-protocol/src/bounded.rs - bounded::BoundedVec<T,N>::push (line 122) ... ok
test crates/radicle-protocol/src/bounded.rs - bounded::BoundedVec<T,N>::max (line 96) ... ok
test crates/radicle-protocol/src/bounded.rs - bounded::BoundedVec<T,N>::collect_from (line 30) ... ok
test crates/radicle-protocol/src/bounded.rs - bounded::BoundedVec<T,N>::unbound (line 149) ... ok
test crates/radicle-protocol/src/bounded.rs - bounded::BoundedVec<T,N>::with_capacity (line 66) ... ok
test result: ok. 6 passed; 0 failed; 0 ignored; 0 measured; 0 filtered out; finished in 0.00s
all doctests ran in 0.42s; merged doctests compilation took 0.40s
Doc-tests radicle_signals
running 0 tests
test result: ok. 0 passed; 0 failed; 0 ignored; 0 measured; 0 filtered out; finished in 0.00s
Doc-tests radicle_surf
running 4 tests
test crates/radicle-surf/src/glob.rs - glob::Glob<Local>::branches (line 175) ... ignored
test crates/radicle-surf/src/glob.rs - glob::Glob<Remote>::branches (line 249) ... ignored
test crates/radicle-surf/src/namespace.rs - namespace::Namespace::to_namespaced (line 48) ... ignored
test crates/radicle-surf/src/namespace.rs - namespace::Namespace::to_namespaced_pattern (line 75) ... ignored
test result: ok. 0 passed; 0 failed; 4 ignored; 0 measured; 0 filtered out; finished in 0.00s
all doctests ran in 0.09s; merged doctests compilation took 0.08s
Doc-tests radicle_systemd
running 0 tests
test result: ok. 0 passed; 0 failed; 0 ignored; 0 measured; 0 filtered out; finished in 0.00s
Doc-tests radicle_term
running 1 test
test crates/radicle-term/src/table.rs - table (line 4) ... ok
test result: ok. 1 passed; 0 failed; 0 ignored; 0 measured; 0 filtered out; finished in 0.00s
all doctests ran in 0.16s; merged doctests compilation took 0.15s
Doc-tests radicle_windows
running 0 tests
test result: ok. 0 passed; 0 failed; 0 ignored; 0 measured; 0 filtered out; finished in 0.00s
error: 1 target failed:
`-p radicle-cli --test commands`
Exit code: 101
{
"response": "finished",
"result": "failure"
}