rad:z3gqcJUoA1n9HaHKufZs5FCSGazv5 heartwood17e5b779feffa8a3789f24df75b3475ef0e78db1
{
"request": "trigger",
"version": 1,
"event_type": "patch",
"repository": {
"id": "rad:z3gqcJUoA1n9HaHKufZs5FCSGazv5",
"name": "heartwood",
"description": "Radicle Heartwood Protocol & Stack",
"private": false,
"default_branch": "master",
"delegates": [
"did:key:z6MksFqXN3Yhqk8pTJdUGLwATkRfQvwZXPqR2qMEhbS9wzpT",
"did:key:z6MkireRatUThvd3qzfKht1S44wpm4FEWSSa4PRMTSQZ3voM",
"did:key:z6MkkPvBfjP4bQmco5Dm7UGsX2ruDBieEHi8n9DVJWX5sTEz"
]
},
"action": "Created",
"patch": {
"id": "414b9b739bbea5cfe5960998e5fc5d7750e47c25",
"author": {
"id": "did:key:z6MkraQdTVaw2sZyQM3tGr6D1PpQPYuQjPEGqbttQfELnVj4",
"alias": "metaclips"
},
"title": "cli/completion: Add shell completion for cli",
"state": {
"status": "merged",
"conflicts": []
},
"before": "0ec084fc232f0df8c1bbcbb89ce8394e8a81d988",
"after": "17e5b779feffa8a3789f24df75b3475ef0e78db1",
"commits": [
"17e5b779feffa8a3789f24df75b3475ef0e78db1",
"8b3116d61f109635e17e3c7754e37ca9844702e1",
"e8cae473af92a0bf8fd16c70a5a353a333bfd7db",
"c723514540e925ca57a8bf1e9f5c4d8dd36fb7c3"
],
"target": "7e1cb406bb935c3de008d2171e8961f57b4336ea",
"labels": [],
"assignees": [],
"revisions": [
{
"id": "414b9b739bbea5cfe5960998e5fc5d7750e47c25",
"author": {
"id": "did:key:z6MkraQdTVaw2sZyQM3tGr6D1PpQPYuQjPEGqbttQfELnVj4",
"alias": "metaclips"
},
"description": "Add shell completions for Bash, Elvish, Fish, PowerShell, and Zsh using the clap_complete crate",
"base": "6cfed884bf37cba1e0d8e97fa8b0e94df4a04b1f",
"oid": "feeeaba3258338ab783aa4d6d3dc72f4ea3dc3d3",
"timestamp": 1762117347
},
{
"id": "7ef847a9ec39fe5de3ab84fb36ece6667b6ba076",
"author": {
"id": "did:key:z6MkraQdTVaw2sZyQM3tGr6D1PpQPYuQjPEGqbttQfELnVj4",
"alias": "metaclips"
},
"description": "Changes:\n- Rebase\n- Introduce `Completion` subcommand via the `clap` derivation\n- Introduce `print_completions` helper\n- Add documentation for installing static completions",
"base": "7ccdd4c810355ca2fe50243f1074229ccc191032",
"oid": "6e3fdea50f2827dda9549439f8e226d0c88bdfb5",
"timestamp": 1762258414
},
{
"id": "e3e25fb74b7fa3814644a2775dcb3308230a189c",
"author": {
"id": "did:key:z6MkraQdTVaw2sZyQM3tGr6D1PpQPYuQjPEGqbttQfELnVj4",
"alias": "metaclips"
},
"description": "",
"base": "c268e809e9dafb9f1d2879fb781d501dbcf61902",
"oid": "b0e1008e3d0ca4ac37b2f859edcf0959b62c2a05",
"timestamp": 1762267700
},
{
"id": "a5227cf890bb8338a3a04f90a60bff74b2664985",
"author": {
"id": "did:key:z6MkraQdTVaw2sZyQM3tGr6D1PpQPYuQjPEGqbttQfELnVj4",
"alias": "metaclips"
},
"description": "Update shell command `rad completion` to `rad completions`",
"base": "6d0c571ea9998dd98bf10cc191848029f5210d8a",
"oid": "a7a574e71e98d64b074b2fefb5f77d3bb8a7d355",
"timestamp": 1762894261
},
{
"id": "1fb89c37b6fde33aee6c8b0389eb3079126f373c",
"author": {
"id": "did:key:z6MkraQdTVaw2sZyQM3tGr6D1PpQPYuQjPEGqbttQfELnVj4",
"alias": "metaclips"
},
"description": "clap/completion: remove completion command from readme",
"base": "6d0c571ea9998dd98bf10cc191848029f5210d8a",
"oid": "8ed5d684ac3467de168dfaee15cf2b46a33f582e",
"timestamp": 1763459378
},
{
"id": "fb9bbea3f3a5e4ef234cf8381889d2226d78246d",
"author": {
"id": "did:key:z6MkraQdTVaw2sZyQM3tGr6D1PpQPYuQjPEGqbttQfELnVj4",
"alias": "metaclips"
},
"description": "",
"base": "0ec084fc232f0df8c1bbcbb89ce8394e8a81d988",
"oid": "17e5b779feffa8a3789f24df75b3475ef0e78db1",
"timestamp": 1764321390
},
{
"id": "f2d9445a05594838d925cfb5b4ebf45668830447",
"author": {
"id": "did:key:z6MkraQdTVaw2sZyQM3tGr6D1PpQPYuQjPEGqbttQfELnVj4",
"alias": "metaclips"
},
"description": "Squash, rebase.",
"base": "7e5a1ababcbf3885e4dc8381b158e19190b29bf5",
"oid": "93d2ed8c61694ace1a085ef0c3bd8e4b950a2cff",
"timestamp": 1764360471
}
]
}
}
{
"response": "triggered",
"run_id": {
"id": "6989eb60-7fff-4e24-bd61-87efceef9c87"
},
"info_url": "https://cci.rad.levitte.org//6989eb60-7fff-4e24-bd61-87efceef9c87.html"
}
Started at: 2026-09-09 00:14:59.372414+02:00
Commands:
$ rad clone rad:z3gqcJUoA1n9HaHKufZs5FCSGazv5 .
✓ Creating checkout in ./...
✓ Remote cloudhead@z6MksFqXN3Yhqk8pTJdUGLwATkRfQvwZXPqR2qMEhbS9wzpT added
✓ Remote-tracking branch cloudhead@z6MksFqXN3Yhqk8pTJdUGLwATkRfQvwZXPqR2qMEhbS9wzpT/master created for z6MksFqXN3Yhqk8pTJdUGLwATkRfQvwZXPqR2qMEhbS9wzpT
✓ Remote fintohaps@z6MkireRatUThvd3qzfKht1S44wpm4FEWSSa4PRMTSQZ3voM added
✓ Remote-tracking branch fintohaps@z6MkireRatUThvd3qzfKht1S44wpm4FEWSSa4PRMTSQZ3voM/master created for z6MkireRatUThvd3qzfKht1S44wpm4FEWSSa4PRMTSQZ3voM
✓ Remote lorenz@z6MkkPvBfjP4bQmco5Dm7UGsX2ruDBieEHi8n9DVJWX5sTEz added
✓ Remote-tracking branch lorenz@z6MkkPvBfjP4bQmco5Dm7UGsX2ruDBieEHi8n9DVJWX5sTEz/master created for z6MkkPvBfjP4bQmco5Dm7UGsX2ruDBieEHi8n9DVJWX5sTEz
✓ Repository successfully cloned under /opt/radcis/ci.rad.levitte.org/cci/state/6989eb60-7fff-4e24-bd61-87efceef9c87/w/
╭────────────────────────────────────╮
│ heartwood │
│ Radicle Heartwood Protocol & Stack │
│ 189 issues · 39 patches │
╰────────────────────────────────────╯
Run `cd ./.` to go to the repository directory.
Exit code: 0
$ rad patch checkout 414b9b739bbea5cfe5960998e5fc5d7750e47c25
✓ Switched to branch patch/414b9b7 at revision fb9bbea
✓ Branch patch/414b9b7 setup to track rad/patches/414b9b739bbea5cfe5960998e5fc5d7750e47c25
Exit code: 0
$ git config advice.detachedHead false
Exit code: 0
$ git checkout 17e5b779feffa8a3789f24df75b3475ef0e78db1
HEAD is now at 17e5b779 cli/completion: hide completion command
Exit code: 0
$ rad patch show 414b9b739bbea5cfe5960998e5fc5d7750e47c25 -p
╭──────────────────────────────────────────────────────────────────────────────────╮
│ Title cli/completion: Add shell completion for cli │
│ Patch 414b9b739bbea5cfe5960998e5fc5d7750e47c25 │
│ Author metaclips z6MkraQ…fELnVj4 │
│ Head 17e5b779feffa8a3789f24df75b3475ef0e78db1 │
│ Base 0ec084fc232f0df8c1bbcbb89ce8394e8a81d988 │
│ Target master │
│ Branches patch/414b9b7 │
│ Commits ahead 4, behind 655 │
│ Status merged │
│ │
│ Add shell completions for Bash, Elvish, Fish, PowerShell, and Zsh using the │
│ clap_complete crate │
├──────────────────────────────────────────────────────────────────────────────────┤
│ 17e5b77 cli/completion: hide completion command │
│ 8b3116d clap/completion: remove completion command from readme │
│ e8cae47 cli/completion: change rad completion to completions │
│ c723514 cli/completion: static shell completion for `rad` │
├──────────────────────────────────────────────────────────────────────────────────┤
│ ● Revision 414b9b7 @ 6cfed88..feeeaba by metaclips z6MkraQ…fELnVj4 10 months ago │
│ ↑ Revision 7ef847a @ 7ccdd4c..6e3fdea by fintohaps z6Mkire…SQZ3voM 10 months ago │
│ ↑ Revision e3e25fb @ c268e80..b0e1008 by metaclips z6MkraQ…fELnVj4 10 months ago │
│ ↑ Revision a5227cf @ 6d0c571..a7a574e by metaclips z6MkraQ…fELnVj4 9 months ago │
│ ↑ Revision 1fb89c3 @ 6d0c571..8ed5d68 by metaclips z6MkraQ…fELnVj4 9 months ago │
│ ↑ Revision fb9bbea @ 0ec084f..17e5b77 by metaclips z6MkraQ…fELnVj4 9 months ago │
│ ↑ Revision f2d9445 @ 7e5a1ab..93d2ed8 by lorenz z6MkkPv…WX5sTEz 9 months ago │
│ └─ ✓ merged by lorenz z6MkkPv…WX5sTEz │
╰──────────────────────────────────────────────────────────────────────────────────╯
commit 17e5b779feffa8a3789f24df75b3475ef0e78db1
Author: Michael Uti <utimichael9@gmail.com>
Date: Fri Nov 28 10:14:32 2025 +0100
cli/completion: hide completion command
diff --git a/crates/radicle-cli/src/main.rs b/crates/radicle-cli/src/main.rs
index 052883893d..e0e68e9ddf 100644
--- a/crates/radicle-cli/src/main.rs
+++ b/crates/radicle-cli/src/main.rs
@@ -99,6 +99,7 @@ enum Command {
},
/// Print static completions information for a given shell
+ #[command(hide = true)]
Completions {
/// The type of shell to provide static completions for
shell: clap_complete::Shell,
commit 8b3116d61f109635e17e3c7754e37ca9844702e1
Author: Michael Uti <utimichael9@gmail.com>
Date: Tue Nov 18 10:49:14 2025 +0100
clap/completion: remove completion command from readme
diff --git a/README.md b/README.md
index 87acd608cd..daf3eed6cc 100644
--- a/README.md
+++ b/README.md
@@ -53,47 +53,6 @@ Or directly from our seed node:
--git https://seed.radicle.xyz/z3gqcJUoA1n9HaHKufZs5FCSGazv5.git \
crates/radicle-cli crates/radicle-node crates/radicle-remote-helper
-## `rad` Shell Completions
-
-A `rad completions` subcommand is provided to generate static completions for your favorite shell.
-
-### Bash
-
-```
-echo 'source <(rad completions bash)' >> ~/.bashrc
-```
-
-### Zsh
-
-```
-echo 'source <(rad completions zsh)' >> ~/.zshrc
-```
-
-### Fish
-
-```
-rad completions fish > ~/.config/fish/completions/rad.fish
-```
-
-### PowerShell
-
-```
-Add-Content $PROFILE "`nInvoke-Expression (rad completions powershell | Out-String)"
-```
-
-### Elvish
-
-Add to `~/.elvish/rc.elv` (or `~/.config/elvish/rc.elv`)
-```
-eval (rad completions elvish | slurp)
-```
-
-Or save to a file and source it
-```
-rad completions elvish > ~/.elvish/lib/rad.elv
-echo 'use rad' >> ~/.elvish/rc.elv
-```
-
## Running
*Systemd* unit files are provided for the node under the `/systemd` folder.
commit e8cae473af92a0bf8fd16c70a5a353a333bfd7db
Author: Michael Uti <utimichael9@gmail.com>
Date: Tue Nov 11 21:45:45 2025 +0100
cli/completion: change rad completion to completions
diff --git a/README.md b/README.md
index a6e497c7ce..87acd608cd 100644
--- a/README.md
+++ b/README.md
@@ -55,42 +55,42 @@ Or directly from our seed node:
## `rad` Shell Completions
-A `rad completion` subcommand is provided to generate static completions for your favorite shell.
+A `rad completions` subcommand is provided to generate static completions for your favorite shell.
### Bash
```
-echo 'source <(rad completion bash)' >> ~/.bashrc
+echo 'source <(rad completions bash)' >> ~/.bashrc
```
### Zsh
```
-echo 'source <(rad completion zsh)' >> ~/.zshrc
+echo 'source <(rad completions zsh)' >> ~/.zshrc
```
### Fish
```
-rad completion fish > ~/.config/fish/completions/rad.fish
+rad completions fish > ~/.config/fish/completions/rad.fish
```
### PowerShell
```
-Add-Content $PROFILE "`nInvoke-Expression (rad completion powershell | Out-String)"
+Add-Content $PROFILE "`nInvoke-Expression (rad completions powershell | Out-String)"
```
### Elvish
Add to `~/.elvish/rc.elv` (or `~/.config/elvish/rc.elv`)
```
-eval (rad completion elvish | slurp)
+eval (rad completions elvish | slurp)
```
Or save to a file and source it
```
-rad completion elvish > ~/.elvish/lib/rad.elv
+rad completions elvish > ~/.elvish/lib/rad.elv
echo 'use rad' >> ~/.elvish/rc.elv
```
diff --git a/crates/radicle-cli/examples/rad-help.md b/crates/radicle-cli/examples/rad-help.md
index f2d1c5ddea..c4df43ccdf 100644
--- a/crates/radicle-cli/examples/rad-help.md
+++ b/crates/radicle-cli/examples/rad-help.md
@@ -41,7 +41,7 @@ Commands:
unseed Remove repository seeding policies
watch Wait for some state to be updated
version Print the version information of the CLI
- completion Print static completion information for a given shell
+ completions Print static completions information for a given shell
help Print this message or the help of the given subcommand(s)
Options:
diff --git a/crates/radicle-cli/src/main.rs b/crates/radicle-cli/src/main.rs
index 4d9e366fbb..052883893d 100644
--- a/crates/radicle-cli/src/main.rs
+++ b/crates/radicle-cli/src/main.rs
@@ -98,8 +98,8 @@ enum Command {
json: bool,
},
- /// Print static completion information for a given shell
- Completion {
+ /// Print static completions information for a given shell
+ Completions {
/// The type of shell to provide static completions for
shell: clap_complete::Shell,
},
@@ -182,7 +182,7 @@ fn run_command(command: Command, ctx: impl term::Context) -> Result<(), anyhow::
Command::Unseed(args) => unseed::run(args, ctx),
Command::Watch(args) => watch::run(args, ctx),
Command::Version { json } => write_version(json),
- Command::Completion { shell } => {
+ Command::Completions { shell } => {
print_completions(shell, &mut CliArgs::command());
Ok(())
}
commit c723514540e925ca57a8bf1e9f5c4d8dd36fb7c3
Author: Fintan Halpenny <fintan.halpenny@gmail.com>
Date: Tue Nov 4 11:13:11 2025 +0000
cli/completion: static shell completion for `rad`
This introduces the use of `clap_completion` for generation static completions.
The shells that are supported are the ones that are included in `clap_complete`:
- `bash`,
- `elvish`,
- `zsh`,
- `fish`, and
- `powershell`.
For each of these shells, document the installation of the completions via the
`README.md` of `heartwood`.
diff --git a/Cargo.lock b/Cargo.lock
index fa8b2533eb..b9936bacde 100644
--- a/Cargo.lock
+++ b/Cargo.lock
@@ -477,6 +477,15 @@ dependencies = [
"strsim",
]
+[[package]]
+name = "clap_complete"
+version = "4.5.60"
+source = "registry+https://github.com/rust-lang/crates.io-index"
+checksum = "8e602857739c5a4291dfa33b5a298aeac9006185229a700e5810a3ef7272d971"
+dependencies = [
+ "clap",
+]
+
[[package]]
name = "clap_derive"
version = "4.5.41"
@@ -2819,6 +2828,7 @@ dependencies = [
"anyhow",
"chrono",
"clap",
+ "clap_complete",
"dunce",
"human-panic",
"itertools",
diff --git a/README.md b/README.md
index daf3eed6cc..a6e497c7ce 100644
--- a/README.md
+++ b/README.md
@@ -53,6 +53,47 @@ Or directly from our seed node:
--git https://seed.radicle.xyz/z3gqcJUoA1n9HaHKufZs5FCSGazv5.git \
crates/radicle-cli crates/radicle-node crates/radicle-remote-helper
+## `rad` Shell Completions
+
+A `rad completion` subcommand is provided to generate static completions for your favorite shell.
+
+### Bash
+
+```
+echo 'source <(rad completion bash)' >> ~/.bashrc
+```
+
+### Zsh
+
+```
+echo 'source <(rad completion zsh)' >> ~/.zshrc
+```
+
+### Fish
+
+```
+rad completion fish > ~/.config/fish/completions/rad.fish
+```
+
+### PowerShell
+
+```
+Add-Content $PROFILE "`nInvoke-Expression (rad completion powershell | Out-String)"
+```
+
+### Elvish
+
+Add to `~/.elvish/rc.elv` (or `~/.config/elvish/rc.elv`)
+```
+eval (rad completion elvish | slurp)
+```
+
+Or save to a file and source it
+```
+rad completion elvish > ~/.elvish/lib/rad.elv
+echo 'use rad' >> ~/.elvish/rc.elv
+```
+
## Running
*Systemd* unit files are provided for the node under the `/systemd` folder.
diff --git a/crates/radicle-cli/Cargo.toml b/crates/radicle-cli/Cargo.toml
index 99ef3354b9..58f0f83f3c 100644
--- a/crates/radicle-cli/Cargo.toml
+++ b/crates/radicle-cli/Cargo.toml
@@ -17,6 +17,7 @@ path = "src/main.rs"
anyhow = "1"
chrono = { workspace = true, features = ["clock", "std"] }
clap = { version = "4.5.44", features = ["derive"] }
+clap_complete = "4.5"
dunce = { workspace = true }
human-panic.workspace = true
itertools.workspace = true
diff --git a/crates/radicle-cli/examples/rad-help.md b/crates/radicle-cli/examples/rad-help.md
index a2589de225..f2d1c5ddea 100644
--- a/crates/radicle-cli/examples/rad-help.md
+++ b/crates/radicle-cli/examples/rad-help.md
@@ -12,36 +12,37 @@ Do you have feedback?
Usage: rad <COMMAND>
Commands:
- auth Manage identities and profiles
- block Block repositories or nodes from being seeded or followed
- checkout Checkout a repository into the local directory
- clean Remove all remotes from a repository
- clone Clone a Radicle repository
- config Manage your local Radicle configuration
- debug Write out information to help debug your Radicle node remotely
- follow Manage node follow policies
- fork Create a fork of a repository
- id Manage repository identities
- inbox Manage your Radicle notifications
- init Initialize a Radicle repository
- inspect Inspect a Radicle repository
- issue Manage issues
- ls List repositories
- node Control and query the Radicle Node
- patch Manage patches
- path Display the Radicle home path
- publish Publish a repository to the network
- remote Manage a repository's remotes
- seed Manage repository seeding policies
- self Show information about your identity and device
- stats Displays aggregated repository and node metrics
- sync Sync repositories to the network
- unblock Unblock repositories or nodes to allow them to be seeded or followed
- unfollow Unfollow a peer
- unseed Remove repository seeding policies
- watch Wait for some state to be updated
- version Print the version information of the CLI
- help Print this message or the help of the given subcommand(s)
+ auth Manage identities and profiles
+ block Block repositories or nodes from being seeded or followed
+ checkout Checkout a repository into the local directory
+ clean Remove all remotes from a repository
+ clone Clone a Radicle repository
+ config Manage your local Radicle configuration
+ debug Write out information to help debug your Radicle node remotely
+ follow Manage node follow policies
+ fork Create a fork of a repository
+ id Manage repository identities
+ inbox Manage your Radicle notifications
+ init Initialize a Radicle repository
+ inspect Inspect a Radicle repository
+ issue Manage issues
+ ls List repositories
+ node Control and query the Radicle Node
+ patch Manage patches
+ path Display the Radicle home path
+ publish Publish a repository to the network
+ remote Manage a repository's remotes
+ seed Manage repository seeding policies
+ self Show information about your identity and device
+ stats Displays aggregated repository and node metrics
+ sync Sync repositories to the network
+ unblock Unblock repositories or nodes to allow them to be seeded or followed
+ unfollow Unfollow a peer
+ unseed Remove repository seeding policies
+ watch Wait for some state to be updated
+ version Print the version information of the CLI
+ completion Print static completion information for a given shell
+ help Print this message or the help of the given subcommand(s)
Options:
-h, --help
diff --git a/crates/radicle-cli/src/main.rs b/crates/radicle-cli/src/main.rs
index b407931b6e..4d9e366fbb 100644
--- a/crates/radicle-cli/src/main.rs
+++ b/crates/radicle-cli/src/main.rs
@@ -7,7 +7,7 @@ use std::{io::ErrorKind, process};
use anyhow::anyhow;
use clap::builder::styling::AnsiColor;
use clap::builder::Styles;
-use clap::{Parser, Subcommand};
+use clap::{CommandFactory as _, Parser, Subcommand};
use radicle::version::Version;
use radicle_cli::commands::*;
@@ -98,6 +98,12 @@ enum Command {
json: bool,
},
+ /// Print static completion information for a given shell
+ Completion {
+ /// The type of shell to provide static completions for
+ shell: clap_complete::Shell,
+ },
+
#[command(external_subcommand)]
External(Vec<OsString>),
}
@@ -176,10 +182,23 @@ fn run_command(command: Command, ctx: impl term::Context) -> Result<(), anyhow::
Command::Unseed(args) => unseed::run(args, ctx),
Command::Watch(args) => watch::run(args, ctx),
Command::Version { json } => write_version(json),
+ Command::Completion { shell } => {
+ print_completions(shell, &mut CliArgs::command());
+ Ok(())
+ }
Command::External(args) => ExternalCommand::new(args).run(),
}
}
+fn print_completions<G: clap_complete::Generator>(generator: G, cmd: &mut clap::Command) {
+ clap_complete::generate(
+ generator,
+ cmd,
+ cmd.get_name().to_string(),
+ &mut io::stdout(),
+ );
+}
+
struct ExternalCommand {
command: OsString,
args: Vec<OsString>,
Exit code: 0
shell: 'export RUSTDOCFLAGS=''-D warnings'' cargo --version rustc --version cargo fmt --check cargo clippy --all-targets --workspace -- --deny warnings cargo build --all-targets --workspace cargo doc --workspace --no-deps --all-features cargo test --workspace --no-fail-fast '
Commands:
$ podman run --name 6989eb60-7fff-4e24-bd61-87efceef9c87 -v /opt/radcis/ci.rad.levitte.org/cci/state/6989eb60-7fff-4e24-bd61-87efceef9c87/s:/6989eb60-7fff-4e24-bd61-87efceef9c87/s:ro -v /opt/radcis/ci.rad.levitte.org/cci/state/6989eb60-7fff-4e24-bd61-87efceef9c87/w:/6989eb60-7fff-4e24-bd61-87efceef9c87/w -w /6989eb60-7fff-4e24-bd61-87efceef9c87/w -v /opt/radcis/ci.rad.levitte.org/.radicle:/${id}/.radicle:ro -e RAD_HOME=/${id}/.radicle rust:trixie bash /6989eb60-7fff-4e24-bd61-87efceef9c87/s/script.sh
+ export 'RUSTDOCFLAGS=-D warnings'
+ RUSTDOCFLAGS='-D warnings'
+ cargo --version
info: syncing channel updates for '1.90-x86_64-unknown-linux-gnu'
info: latest update on 2025-09-18, rust version 1.90.0 (1159e78c4 2025-09-14)
info: downloading component 'cargo'
info: downloading component 'clippy'
info: downloading component 'rust-docs'
info: downloading component 'rust-src'
info: downloading component 'rust-std'
info: downloading component 'rustc'
info: downloading component 'rustfmt'
info: installing component 'cargo'
info: installing component 'clippy'
info: installing component 'rust-docs'
info: installing component 'rust-src'
info: installing component 'rust-std'
info: installing component 'rustc'
info: installing component 'rustfmt'
cargo 1.90.0 (840b83a10 2025-07-30)
+ rustc --version
rustc 1.90.0 (1159e78c4 2025-09-14)
+ cargo fmt --check
+ cargo clippy --all-targets --workspace -- --deny warnings
Updating crates.io index
Downloading crates ...
Downloaded aead v0.5.2
Downloaded adler2 v2.0.0
Downloaded amplify_derive v4.0.0
Downloaded addr2line v0.24.2
Downloaded data-encoding-macro v0.1.14
Downloaded base64ct v1.6.0
Downloaded form_urlencoded v1.2.1
Downloaded filetime v0.2.23
Downloaded getrandom v0.3.3
Downloaded ff v0.13.0
Downloaded fastrand v2.3.0
Downloaded lock_api v0.4.14
Downloaded ghash v0.5.1
Downloaded gix-revision v0.35.0
Downloaded clap_lex v0.7.5
Downloaded multibase v0.9.1
Downloaded normalize-line-endings v0.3.0
Downloaded num v0.4.3
Downloaded gix-hashtable v0.9.0
Downloaded home v0.5.9
Downloaded num-complex v0.4.6
Downloaded num-rational v0.4.2
Downloaded outref v0.5.2
Downloaded num-integer v0.1.46
Downloaded pbkdf2 v0.12.2
Downloaded localtime v1.3.1
Downloaded gix-prompt v0.11.1
Downloaded gix-shallow v0.5.0
Downloaded gix-sec v0.12.0
Downloaded matchers v0.1.0
Downloaded human-panic v2.0.3
Downloaded rand_chacha v0.3.1
Downloaded radicle-std-ext v0.1.1
Downloaded phf v0.11.3
Downloaded scopeguard v1.2.0
Downloaded scrypt v0.11.0
Downloaded sha1 v0.10.6
Downloaded snapbox-macros v0.3.8
Downloaded sqlite3-sys v0.15.2
Downloaded sec1 v0.7.3
Downloaded sqlite v0.32.0
Downloaded signature v2.2.0
Downloaded spki v0.7.3
Downloaded sval_json v2.14.1
Downloaded sha2 v0.10.8
Downloaded sem_safe v0.2.0
Downloaded sval_buffer v2.14.1
Downloaded ssh-cipher v0.2.0
Downloaded memchr v2.7.2
Downloaded tinyvec_macros v0.1.1
Downloaded rsa v0.9.6
Downloaded utf8parse v0.2.1
Downloaded num-bigint-dig v0.8.4
Downloaded value-bag-serde1 v1.11.1
Downloaded yoke-derive v0.7.5
Downloaded xattr v1.3.1
Downloaded zerofrom-derive v0.1.6
Downloaded unicode-width v0.1.11
Downloaded vsimd v0.8.0
Downloaded typenum v1.17.0
Downloaded yoke v0.7.5
Downloaded zerovec-derive v0.10.3
Downloaded tinyvec v1.6.0
Downloaded tree-sitter-language v0.1.2
Downloaded unicode-ident v1.0.12
Downloaded uuid v1.16.0
Downloaded write16 v1.0.0
Downloaded value-bag v1.11.1
Downloaded ssh-key v0.6.6
Downloaded tree-sitter-go v0.23.4
Downloaded chrono v0.4.38
Downloaded tracing-log v0.2.0
Downloaded unicode-segmentation v1.11.0
Downloaded unit-prefix v0.5.1
Downloaded tree-sitter-html v0.23.2
Downloaded walkdir v2.5.0
Downloaded unicode-normalization v0.1.23
Downloaded zerocopy v0.7.35
Downloaded zeroize v1.7.0
Downloaded num-traits v0.2.19
Downloaded tar v0.4.40
Downloaded zlib-rs v0.5.2
Downloaded serde_derive v1.0.219
Downloaded unicode-width v0.2.1
Downloaded vcpkg v0.2.15
Downloaded schemars v1.0.4
Downloaded url v2.5.4
Downloaded tree-sitter-rust v0.23.2
Downloaded zerovec v0.10.4
Downloaded rustix v1.0.7
Downloaded winnow v0.7.13
Downloaded git2 v0.19.0
Downloaded tree-sitter-bash v0.23.3
Downloaded tracing-subscriber v0.3.19
Downloaded syn v1.0.109
Downloaded icu_properties_data v1.5.1
Downloaded jsonschema v0.30.0
Downloaded tree-sitter-ruby v0.23.1
Downloaded regex-automata v0.4.9
Downloaded object v0.36.7
Downloaded syn v2.0.106
Downloaded hashbrown v0.15.5
Downloaded hashbrown v0.14.3
Downloaded tree-sitter-md v0.3.2
Downloaded itertools v0.14.0
Downloaded idna v1.0.3
Downloaded rustix v0.38.34
Downloaded sha1-checked v0.10.0
Downloaded regex-syntax v0.8.5
Downloaded libm v0.2.8
Downloaded inquire v0.7.5
Downloaded gix-pack v0.60.0
Downloaded tree-sitter-typescript v0.23.2
Downloaded icu_collections v1.5.0
Downloaded sha3 v0.10.8
Downloaded toml v0.9.5
Downloaded sharded-slab v0.1.7
Downloaded regex-syntax v0.6.29
Downloaded tree-sitter-c v0.23.2
Downloaded libc v0.2.174
Downloaded jiff v0.2.15
Downloaded referencing v0.30.0
Downloaded pretty_assertions v1.4.0
Downloaded indexmap v2.2.6
Downloaded regex v1.11.1
Downloaded tokio v1.47.1
Downloaded heapless v0.8.0
Downloaded bloomy v1.2.0
Downloaded gix-odb v0.70.0
Downloaded tempfile v3.23.0
Downloaded signals_receipts v0.2.0
Downloaded jiff-static v0.2.15
Downloaded indicatif v0.18.0
Downloaded tree-sitter-python v0.23.4
Downloaded tree-sitter v0.24.4
Downloaded icu_normalizer_data v1.5.1
Downloaded p384 v0.13.0
Downloaded smallvec v1.15.1
Downloaded thread_local v1.1.9
Downloaded portable-atomic v1.11.0
Downloaded gix-ref v0.53.1
Downloaded gix-object v0.50.2
Downloaded thiserror-impl v2.0.12
Downloaded thiserror-impl v1.0.69
Downloaded thiserror v1.0.69
Downloaded serde_json v1.0.140
Downloaded icu_provider v1.5.0
Downloaded icu_properties v1.5.1
Downloaded icu_normalizer v1.5.0
Downloaded gix-protocol v0.51.0
Downloaded gix-diff v0.53.0
Downloaded tracing v0.1.41
Downloaded test-log v0.2.18
Downloaded systemd-journal-logger v2.2.2
Downloaded synstructure v0.13.1
Downloaded sval_nested v2.14.1
Downloaded radicle-surf v0.25.0
Downloaded proc-macro-error2 v2.0.1
Downloaded once_cell v1.21.3
Downloaded litrs v0.4.1
Downloaded gix-path v0.10.20
Downloaded uuid-simd v0.8.0
Downloaded universal-hash v0.5.1
Downloaded structured-logger v1.0.4
Downloaded regex-automata v0.1.10
Downloaded p521 v0.13.3
Downloaded unicode-display-width v0.3.0
Downloaded tree-sitter-json v0.24.8
Downloaded tree-sitter-highlight v0.24.4
Downloaded clap_builder v4.5.44
Downloaded gix-transport v0.48.0
Downloaded tracing-core v0.1.34
Downloaded icu_locid v1.5.0
Downloaded hmac v0.12.1
Downloaded libz-rs-sys v0.5.2
Downloaded yansi v0.5.1
Downloaded writeable v0.5.5
Downloaded tree-sitter-css v0.23.1
Downloaded serde-untagged v0.1.7
Downloaded schemars_derive v1.0.4
Downloaded log v0.4.27
Downloaded rand v0.8.5
Downloaded prodash v30.0.1
Downloaded zerofrom v0.1.6
Downloaded version_check v0.9.4
Downloaded value-bag-sval2 v1.11.1
Downloaded utf8_iter v1.0.4
Downloaded icu_locid_transform_data v1.5.1
Downloaded tree-sitter-toml-ng v0.6.0
Downloaded primeorder v0.13.6
Downloaded pkcs8 v0.10.2
Downloaded emojis v0.6.4
Downloaded utf16_iter v1.0.5
Downloaded typeid v1.0.3
Downloaded toml_writer v1.0.2
Downloaded toml_datetime v0.7.0
Downloaded tinystr v0.7.6
Downloaded timeago v0.4.2
Downloaded thiserror v2.0.12
Downloaded test-log-macros v0.2.18
Downloaded sval_serde v2.14.1
Downloaded sval_ref v2.14.1
Downloaded socket2 v0.5.7
Downloaded similar v2.5.0
Downloaded signal-hook-registry v1.4.5
Downloaded signal-hook v0.3.18
Downloaded serde v1.0.219
Downloaded pkg-config v0.3.30
Downloaded mio v1.0.4
Downloaded litemap v0.7.5
Downloaded lexopt v0.3.0
Downloaded fraction v0.15.3
Downloaded sval_dynamic v2.14.1
Downloaded sval v2.14.1
Downloaded spin v0.9.8
Downloaded p256 v0.13.2
Downloaded sqlite3-src v0.5.1
Downloaded icu_locid_transform v1.5.0
Downloaded gix-url v0.32.0
Downloaded gix-tempfile v18.0.0
Downloaded crossterm v0.25.0
Downloaded ryu v1.0.17
Downloaded streaming-iterator v0.1.9
Downloaded snapbox v0.4.17
Downloaded proc-macro2 v1.0.101
Downloaded parking_lot v0.12.5
Downloaded mio v0.8.11
Downloaded gix-features v0.43.1
Downloaded der v0.7.9
Downloaded rustc-demangle v0.1.26
Downloaded num-bigint v0.4.6
Downloaded gix-traverse v0.47.0
Downloaded iana-time-zone v0.1.60
Downloaded sval_fmt v2.14.1
Downloaded subtle v2.5.0
Downloaded strsim v0.11.1
Downloaded stable_deref_trait v1.2.0
Downloaded ssh-encoding v0.2.0
Downloaded shlex v1.3.0
Downloaded gix-fs v0.16.1
Downloaded parking_lot_core v0.9.12
Downloaded maybe-async v0.2.10
Downloaded gix-config-value v0.15.1
Downloaded socks5-client v0.4.1
Downloaded signal-hook-mio v0.2.4
Downloaded serde_spanned v1.0.0
Downloaded serde_fmt v1.0.3
Downloaded serde_derive_internals v0.29.1
Downloaded rand_core v0.6.4
Downloaded quote v1.0.41
Downloaded qcheck v1.0.0
Downloaded polyval v0.6.2
Downloaded pkcs1 v0.7.5
Downloaded jobserver v0.1.31
Downloaded group v0.13.0
Downloaded gix-hash v0.19.0
Downloaded siphasher v1.0.1
Downloaded siphasher v0.3.11
Downloaded signature v1.6.4
Downloaded same-file v1.0.6
Downloaded shell-words v1.1.0
Downloaded ref-cast-impl v1.0.24
Downloaded ref-cast v1.0.24
Downloaded pem-rfc7468 v0.7.0
Downloaded opaque-debug v0.3.1
Downloaded fancy-regex v0.14.0
Downloaded crossterm v0.29.0
Downloaded proc-macro-error-attr2 v2.0.0
Downloaded ppv-lite86 v0.2.17
Downloaded paste v1.0.15
Downloaded miniz_oxide v0.8.8
Downloaded arc-swap v1.7.1
Downloaded salsa20 v0.10.2
Downloaded rfc6979 v0.4.0
Downloaded poly1305 v0.8.0
Downloaded pin-project-lite v0.2.16
Downloaded num-iter v0.1.45
Downloaded num-cmp v0.1.0
Downloaded lazy_static v1.5.0
Downloaded hash32 v0.3.1
Downloaded overload v0.1.1
Downloaded radicle-git-ext v0.10.0
Downloaded phf_shared v0.11.3
Downloaded os_info v3.12.0
Downloaded idna_adapter v1.2.0
Downloaded gix-command v0.6.2
Downloaded qcheck-macros v1.0.0
Downloaded percent-encoding v2.3.1
Downloaded inout v0.1.3
Downloaded gix-actor v0.35.4
Downloaded bytes v1.10.1
Downloaded gix-date v0.10.5
Downloaded git-ref-format-macro v0.5.0
Downloaded clap v4.5.44
Downloaded gix-revwalk v0.21.0
Downloaded gix-packetline v0.19.1
Downloaded gix-refspec v0.31.0
Downloaded gix-commitgraph v0.29.0
Downloaded keccak v0.1.5
Downloaded gix-validate v0.10.0
Downloaded gix-trace v0.1.13
Downloaded elliptic-curve v0.13.8
Downloaded gix-utils v0.3.0
Downloaded diff v0.1.13
Downloaded cc v1.2.2
Downloaded gix-quote v0.6.0
Downloaded clap_derive v4.5.41
Downloaded blowfish v0.9.1
Downloaded bitflags v2.9.1
Downloaded base64 v0.21.7
Downloaded memmap2 v0.9.8
Downloaded itoa v1.0.11
Downloaded env_logger v0.11.8
Downloaded ecdsa v0.16.9
Downloaded ctr v0.9.2
Downloaded crossbeam-utils v0.8.19
Downloaded crossbeam-channel v0.5.15
Downloaded console v0.16.0
Downloaded backtrace v0.3.75
Downloaded nu-ansi-term v0.46.0
Downloaded icu_provider_macros v1.5.0
Downloaded either v1.11.0
Downloaded displaydoc v0.2.5
Downloaded anstream v0.6.13
Downloaded ed25519 v1.5.3
Downloaded data-encoding v2.5.0
Downloaded cipher v0.4.4
Downloaded chacha20 v0.9.1
Downloaded bitflags v1.3.2
Downloaded erased-serde v0.4.6
Downloaded email_address v0.2.9
Downloaded derive_more v2.0.1
Downloaded convert_case v0.7.1
Downloaded chacha20poly1305 v0.10.1
Downloaded bytesize v2.0.1
Downloaded nonempty v0.9.0
Downloaded noise-framework v0.4.0
Downloaded newline-converter v0.3.0
Downloaded gix-lock v18.0.0
Downloaded git-ref-format-core v0.5.0
Downloaded cypheraddr v0.4.0
Downloaded bytecount v0.6.8
Downloaded heck v0.5.0
Downloaded gix-negotiate v0.21.0
Downloaded gimli v0.31.1
Downloaded fast-glob v0.3.3
Downloaded env_filter v0.1.3
Downloaded ec25519 v0.1.0
Downloaded dyn-clone v1.0.17
Downloaded data-encoding-macro-internal v0.1.12
Downloaded block-padding v0.3.3
Downloaded base-x v0.2.11
Downloaded borrow-or-share v0.2.2
Downloaded bit-set v0.8.0
Downloaded amplify_syn v2.0.1
Downloaded gix-credentials v0.30.0
Downloaded gix-chunk v0.4.11
Downloaded faster-hex v0.10.0
Downloaded equivalent v1.0.1
Downloaded dunce v1.0.5
Downloaded ct-codecs v1.1.1
Downloaded crypto-common v0.1.6
Downloaded crypto-bigint v0.5.5
Downloaded crc32fast v1.5.0
Downloaded cpufeatures v0.2.12
Downloaded colored v2.1.0
Downloaded cbc v0.1.2
Downloaded autocfg v1.2.0
Downloaded getrandom v0.2.15
Downloaded fxhash v0.2.1
Downloaded fluent-uri v0.3.2
Downloaded cyphernet v0.5.2
Downloaded const-oid v0.9.6
Downloaded bit-vec v0.8.0
Downloaded base16ct v0.2.0
Downloaded git-ref-format v0.5.0
Downloaded colorchoice v1.0.0
Downloaded clap_complete v4.5.60
Downloaded cfg-if v1.0.0
Downloaded block-buffer v0.10.4
Downloaded bcrypt-pbkdf v0.10.0
Downloaded base32 v0.4.0
Downloaded anyhow v1.0.82
Downloaded anstyle-query v1.0.2
Downloaded anstyle-parse v0.2.3
Downloaded anstyle v1.0.11
Downloaded escargot v0.5.10
Downloaded errno v0.3.13
Downloaded document-features v0.2.11
Downloaded digest v0.10.7
Downloaded cyphergraphy v0.3.0
Downloaded generic-array v0.14.7
Downloaded flate2 v1.1.1
Downloaded bstr v1.12.0
Downloaded ascii v1.1.0
Downloaded amplify_num v0.5.2
Downloaded derive_more-impl v2.0.1
Downloaded byteorder v1.5.0
Downloaded base64 v0.22.1
Downloaded aho-corasick v1.1.3
Downloaded ahash v0.8.11
Downloaded aes-gcm v0.10.3
Downloaded amplify v4.6.0
Downloaded aes v0.8.4
Downloaded linux-raw-sys v0.4.13
Downloaded libgit2-sys v0.17.0+1.8.1
Downloaded linux-raw-sys v0.9.4
Downloaded libz-sys v1.1.16
Compiling libc v0.2.174
Compiling proc-macro2 v1.0.101
Compiling unicode-ident v1.0.12
Compiling quote v1.0.41
Checking cfg-if v1.0.0
Compiling version_check v0.9.4
Compiling shlex v1.3.0
Checking memchr v2.7.2
Compiling typenum v1.17.0
Checking getrandom v0.2.15
Compiling jobserver v0.1.31
Compiling generic-array v0.14.7
Compiling syn v2.0.106
Compiling cc v1.2.2
Checking rand_core v0.6.4
Compiling serde v1.0.219
Checking aho-corasick v1.1.3
Checking crypto-common v0.1.6
Checking regex-syntax v0.8.5
Checking smallvec v1.15.1
Checking subtle v2.5.0
Checking stable_deref_trait v1.2.0
Checking once_cell v1.21.3
Checking cpufeatures v0.2.12
Compiling parking_lot_core v0.9.12
Checking scopeguard v1.2.0
Checking fastrand v2.3.0
Checking lock_api v0.4.14
Checking block-buffer v0.10.4
Compiling thiserror v2.0.12
Checking digest v0.10.7
Checking regex-automata v0.4.9
Checking parking_lot v0.12.5
Compiling crc32fast v1.5.0
Checking tinyvec_macros v0.1.1
Checking byteorder v1.5.0
Checking tinyvec v1.6.0
Compiling typeid v1.0.3
Checking bitflags v2.9.1
Checking gix-trace v0.1.13
Checking unicode-normalization v0.1.23
Checking home v0.5.9
Compiling synstructure v0.13.1
Checking gix-utils v0.3.0
Checking zlib-rs v0.5.2
Checking bstr v1.12.0
Checking same-file v1.0.6
Checking walkdir v2.5.0
Checking prodash v30.0.1
Checking itoa v1.0.11
Compiling heapless v0.8.0
Checking libz-rs-sys v0.5.2
Checking hash32 v0.3.1
Checking zeroize v1.7.0
Checking flate2 v1.1.1
Compiling icu_locid_transform_data v1.5.1
Compiling serde_derive v1.0.219
Compiling thiserror-impl v2.0.12
Compiling zerofrom-derive v0.1.6
Compiling yoke-derive v0.7.5
Compiling zerovec-derive v0.10.3
Checking gix-validate v0.10.0
Checking zerofrom v0.1.6
Checking gix-path v0.10.20
Checking yoke v0.7.5
Checking gix-features v0.43.1
Compiling displaydoc v0.2.5
Compiling pkg-config v0.3.30
Checking writeable v0.5.5
Checking zerovec v0.10.4
Compiling thiserror v1.0.69
Checking litemap v0.7.5
Checking faster-hex v0.10.0
Compiling icu_provider_macros v1.5.0
Compiling thiserror-impl v1.0.69
Checking tinystr v0.7.6
Compiling rustix v1.0.7
Checking icu_locid v1.5.0
Compiling icu_properties_data v1.5.1
Checking sha1 v0.10.6
Checking icu_provider v1.5.0
Checking block-padding v0.3.3
Checking linux-raw-sys v0.9.4
Compiling icu_normalizer_data v1.5.1
Checking icu_locid_transform v1.5.0
Checking inout v0.1.3
Checking sha1-checked v0.10.0
Checking icu_collections v1.5.0
Compiling getrandom v0.3.3
Compiling syn v1.0.109
Checking icu_properties v1.5.1
Checking erased-serde v0.4.6
Checking serde_fmt v1.0.3
Checking gix-hash v0.19.0
Checking value-bag-serde1 v1.11.1
Checking cipher v0.4.4
Checking value-bag v1.11.1
Checking write16 v1.0.0
Checking log v0.4.27
Checking utf16_iter v1.0.5
Checking utf8_iter v1.0.4
Checking percent-encoding v2.3.1
Checking icu_normalizer v1.5.0
Checking form_urlencoded v1.2.1
Checking sha2 v0.10.8
Compiling vcpkg v0.2.15
Checking idna_adapter v1.2.0
Checking universal-hash v0.5.1
Checking idna v1.0.3
Checking opaque-debug v0.3.1
Checking tempfile v3.23.0
Checking url v2.5.4
Compiling autocfg v1.2.0
Compiling libz-sys v1.1.16
Compiling num-traits v0.2.19
Compiling libgit2-sys v0.17.0+1.8.1
Checking signature v1.6.4
Checking equivalent v1.0.1
Checking hashbrown v0.14.3
Compiling serde_json v1.0.140
Checking ed25519 v1.5.3
Compiling amplify_syn v2.0.1
Checking indexmap v2.2.6
Checking aead v0.5.2
Checking ct-codecs v1.1.1
Checking ascii v1.1.0
Checking amplify_num v0.5.2
Checking ryu v1.0.17
Compiling ref-cast v1.0.24
Compiling amplify_derive v4.0.0
Checking ec25519 v0.1.0
Checking poly1305 v0.8.0
Checking git-ref-format-core v0.5.0
Checking chacha20 v0.9.1
Compiling ref-cast-impl v1.0.24
Checking amplify v4.6.0
Checking polyval v0.6.2
Compiling sqlite3-src v0.5.1
Checking cyphergraphy v0.3.0
Checking hmac v0.12.1
Checking keccak v0.1.5
Checking base64ct v1.6.0
Checking dyn-clone v1.0.17
Checking pbkdf2 v0.12.2
Checking sha3 v0.10.8
Checking pem-rfc7468 v0.7.0
Checking ghash v0.5.1
Checking aes v0.8.4
Checking ctr v0.9.2
Checking rand v0.8.5
Compiling data-encoding v2.5.0
Compiling crossbeam-utils v0.8.19
Checking base32 v0.4.0
Checking cypheraddr v0.4.0
Compiling data-encoding-macro-internal v0.1.12
Checking qcheck v1.0.0
Checking aes-gcm v0.10.3
Checking ssh-encoding v0.2.0
Checking chacha20poly1305 v0.10.1
Checking blowfish v0.9.1
Checking cbc v0.1.2
Compiling serde_derive_internals v0.29.1
Checking data-encoding-macro v0.1.14
Checking ssh-cipher v0.2.0
Checking bcrypt-pbkdf v0.10.0
Checking noise-framework v0.4.0
Compiling schemars_derive v1.0.4
Checking socks5-client v0.4.1
Checking base-x v0.2.11
Checking signature v2.2.0
Checking ssh-key v0.6.6
Checking multibase v0.9.1
Checking cyphernet v0.5.2
Checking crossbeam-channel v0.5.15
Checking schemars v1.0.4
Checking radicle-ssh v0.10.0 (/6989eb60-7fff-4e24-bd61-87efceef9c87/w/crates/radicle-ssh)
Checking jiff v0.2.15
Checking lazy_static v1.5.0
Checking nonempty v0.9.0
Checking anstyle-query v1.0.2
Checking siphasher v1.0.1
Checking radicle-git-metadata v0.1.0 (/6989eb60-7fff-4e24-bd61-87efceef9c87/w/crates/radicle-git-metadata)
Checking radicle-dag v0.10.0 (/6989eb60-7fff-4e24-bd61-87efceef9c87/w/crates/radicle-dag)
Checking winnow v0.7.13
Checking utf8parse v0.2.1
Checking hashbrown v0.15.5
Checking gix-date v0.10.5
Checking gix-actor v0.35.4
Checking gix-hashtable v0.9.0
Checking anstyle-parse v0.2.3
Checking radicle-git-ref-format v0.1.0 (/6989eb60-7fff-4e24-bd61-87efceef9c87/w/crates/radicle-git-ref-format)
Checking colorchoice v1.0.0
Checking anstyle v1.0.11
Checking base64 v0.21.7
Checking iana-time-zone v0.1.60
Checking chrono v0.4.38
Checking anstream v0.6.13
Checking gix-object v0.50.2
Checking colored v2.1.0
Checking serde-untagged v0.1.7
Checking bytesize v2.0.1
Checking localtime v1.3.1
Checking memmap2 v0.9.8
Checking tree-sitter-language v0.1.2
Checking dunce v1.0.5
Checking fast-glob v0.3.3
Checking gix-chunk v0.4.11
Checking gix-fs v0.16.1
Checking gix-commitgraph v0.29.0
Checking gix-tempfile v18.0.0
Checking gix-revwalk v0.21.0
Checking mio v1.0.4
Checking gix-quote v0.6.0
Checking sem_safe v0.2.0
Checking errno v0.3.13
Checking either v1.11.0
Checking shell-words v1.1.0
Checking signals_receipts v0.2.0
Checking gix-command v0.6.2
Compiling object v0.36.7
Compiling signal-hook v0.3.18
Checking gix-lock v18.0.0
Checking gix-url v0.32.0
Checking gix-config-value v0.15.1
Checking gix-sec v0.12.0
Checking signal-hook-registry v1.4.5
Compiling rustix v0.38.34
Checking gimli v0.31.1
Checking adler2 v2.0.0
Checking miniz_oxide v0.8.8
Checking gix-prompt v0.11.1
Checking addr2line v0.24.2
Checking radicle-signals v0.11.0 (/6989eb60-7fff-4e24-bd61-87efceef9c87/w/crates/radicle-signals)
Checking gix-traverse v0.47.0
Checking gix-revision v0.35.0
Checking gix-diff v0.53.0
Checking mio v0.8.11
Checking gix-packetline v0.19.1
Compiling tree-sitter v0.24.4
Compiling linux-raw-sys v0.4.13
Checking rustc-demangle v0.1.26
Compiling unicode-segmentation v1.11.0
Compiling anyhow v1.0.82
Compiling convert_case v0.7.1
Checking backtrace v0.3.75
Checking gix-transport v0.48.0
Checking signal-hook-mio v0.2.4
Checking gix-pack v0.60.0
Checking gix-refspec v0.31.0
Checking gix-credentials v0.30.0
Checking gix-shallow v0.5.0
Checking gix-ref v0.53.1
Checking gix-negotiate v0.21.0
Compiling maybe-async v0.2.10
Checking regex v1.11.1
Compiling proc-macro-error-attr2 v2.0.0
Checking arc-swap v1.7.1
Compiling portable-atomic v1.11.0
Checking gix-odb v0.70.0
Compiling proc-macro-error2 v2.0.1
Checking gix-protocol v0.51.0
Compiling xattr v1.3.1
Compiling derive_more-impl v2.0.1
Compiling filetime v0.2.23
Checking uuid v1.16.0
Checking bitflags v1.3.2
Checking unicode-width v0.2.1
Checking sqlite3-sys v0.15.2
Checking sqlite v0.32.0
Checking bytes v1.10.1
Checking radicle-crypto v0.14.0 (/6989eb60-7fff-4e24-bd61-87efceef9c87/w/crates/radicle-crypto)
Compiling litrs v0.4.1
Checking console v0.16.0
Checking crossterm v0.25.0
Compiling document-features v0.2.11
Checking derive_more v2.0.1
Compiling tar v0.4.40
Compiling git-ref-format-macro v0.5.0
Checking newline-converter v0.3.0
Checking snapbox-macros v0.3.8
Checking salsa20 v0.10.2
Checking fxhash v0.2.1
Checking unit-prefix v0.5.1
Checking clap_lex v0.7.5
Checking similar v2.5.0
Checking siphasher v0.3.11
Checking streaming-iterator v0.1.9
Compiling heck v0.5.0
Checking normalize-line-endings v0.3.0
Checking strsim v0.11.1
Checking unicode-width v0.1.11
Checking snapbox v0.4.17
Checking inquire v0.7.5
Checking clap_builder v4.5.44
Compiling clap_derive v4.5.41
Checking bloomy v1.2.0
Checking indicatif v0.18.0
Compiling radicle-surf v0.25.0
Checking scrypt v0.11.0
Checking git-ref-format v0.5.0
Checking crossterm v0.29.0
Checking unicode-display-width v0.3.0
Checking systemd-journal-logger v2.2.2
Checking toml_datetime v0.7.0
Checking serde_spanned v1.0.0
Compiling tree-sitter-toml-ng v0.6.0
Compiling tree-sitter-bash v0.23.3
Compiling tree-sitter-python v0.23.4
Compiling tree-sitter-typescript v0.23.2
Compiling tree-sitter-json v0.24.8
Compiling tree-sitter-rust v0.23.2
Compiling tree-sitter-go v0.23.4
Compiling tree-sitter-c v0.23.2
Compiling tree-sitter-html v0.23.2
Compiling tree-sitter-md v0.3.2
Compiling tree-sitter-ruby v0.23.1
Compiling tree-sitter-css v0.23.1
Checking toml_writer v1.0.2
Checking radicle-std-ext v0.1.1
Checking pin-project-lite v0.2.16
Checking toml v0.9.5
Checking tokio v1.47.1
Checking clap v4.5.44
Checking os_info v3.12.0
Compiling radicle-cli v0.17.0 (/6989eb60-7fff-4e24-bd61-87efceef9c87/w/crates/radicle-cli)
Checking yansi v0.5.1
Compiling radicle-node v0.16.0 (/6989eb60-7fff-4e24-bd61-87efceef9c87/w/crates/radicle-node)
Checking diff v0.1.13
Checking pretty_assertions v1.4.0
Checking human-panic v2.0.3
Checking clap_complete v4.5.60
Checking structured-logger v1.0.4
Checking radicle-systemd v0.11.0 (/6989eb60-7fff-4e24-bd61-87efceef9c87/w/crates/radicle-systemd)
Checking tree-sitter-highlight v0.24.4
Checking itertools v0.14.0
Checking num-integer v0.1.46
Compiling qcheck-macros v1.0.0
Checking socket2 v0.5.7
Checking lexopt v0.3.0
Compiling escargot v0.5.10
Checking timeago v0.4.2
Checking num-bigint v0.4.6
Compiling ahash v0.8.11
Checking num-iter v0.1.45
Checking num-complex v0.4.6
Checking env_filter v0.1.3
Checking zerocopy v0.7.35
Checking num-rational v0.4.2
Checking bit-vec v0.8.0
Checking borrow-or-share v0.2.2
Checking num v0.4.3
Checking fluent-uri v0.3.2
Checking bit-set v0.8.0
Checking env_logger v0.11.8
Checking phf_shared v0.11.3
Compiling test-log-macros v0.2.18
Checking outref v0.5.2
Checking vsimd v0.8.0
Compiling radicle-remote-helper v0.14.0 (/6989eb60-7fff-4e24-bd61-87efceef9c87/w/crates/radicle-remote-helper)
Compiling paste v1.0.15
Checking uuid-simd v0.8.0
Checking test-log v0.2.18
Checking referencing v0.30.0
Checking phf v0.11.3
Checking fancy-regex v0.14.0
Checking fraction v0.15.3
Checking email_address v0.2.9
Checking base64 v0.22.1
Checking bytecount v0.6.8
Checking num-cmp v0.1.0
Checking emojis v0.6.4
Checking jsonschema v0.30.0
Checking git2 v0.19.0
Checking radicle-oid v0.1.0 (/6989eb60-7fff-4e24-bd61-87efceef9c87/w/crates/radicle-oid)
Checking radicle-git-ext v0.10.0
Checking radicle-term v0.16.0 (/6989eb60-7fff-4e24-bd61-87efceef9c87/w/crates/radicle-term)
Checking radicle-cob v0.17.0 (/6989eb60-7fff-4e24-bd61-87efceef9c87/w/crates/radicle-cob)
Checking radicle v0.20.0 (/6989eb60-7fff-4e24-bd61-87efceef9c87/w/crates/radicle)
Checking radicle-fetch v0.16.0 (/6989eb60-7fff-4e24-bd61-87efceef9c87/w/crates/radicle-fetch)
Checking radicle-cli-test v0.13.0 (/6989eb60-7fff-4e24-bd61-87efceef9c87/w/crates/radicle-cli-test)
Checking radicle-schemars v0.6.0 (/6989eb60-7fff-4e24-bd61-87efceef9c87/w/crates/radicle-schemars)
Checking radicle-protocol v0.4.0 (/6989eb60-7fff-4e24-bd61-87efceef9c87/w/crates/radicle-protocol)
Finished `dev` profile [unoptimized + debuginfo] target(s) in 49.69s
+ cargo build --all-targets --workspace
Compiling libc v0.2.174
Compiling cfg-if v1.0.0
Compiling shlex v1.3.0
Compiling memchr v2.7.2
Compiling typenum v1.17.0
Compiling serde v1.0.219
Compiling generic-array v0.14.7
Compiling aho-corasick v1.1.3
Compiling jobserver v0.1.31
Compiling getrandom v0.2.15
Compiling cc v1.2.2
Compiling rand_core v0.6.4
Compiling crypto-common v0.1.6
Compiling regex-syntax v0.8.5
Compiling smallvec v1.15.1
Compiling subtle v2.5.0
Compiling stable_deref_trait v1.2.0
Compiling once_cell v1.21.3
Compiling cpufeatures v0.2.12
Compiling fastrand v2.3.0
Compiling scopeguard v1.2.0
Compiling regex-automata v0.4.9
Compiling lock_api v0.4.14
Compiling parking_lot_core v0.9.12
Compiling block-buffer v0.10.4
Compiling digest v0.10.7
Compiling parking_lot v0.12.5
Compiling thiserror v2.0.12
Compiling bitflags v2.9.1
Compiling tinyvec_macros v0.1.1
Compiling byteorder v1.5.0
Compiling tinyvec v1.6.0
Compiling crc32fast v1.5.0
Compiling gix-trace v0.1.13
Compiling typeid v1.0.3
Compiling home v0.5.9
Compiling erased-serde v0.4.6
Compiling serde_fmt v1.0.3
Compiling unicode-normalization v0.1.23
Compiling zlib-rs v0.5.2
Compiling value-bag-serde1 v1.11.1
Compiling same-file v1.0.6
Compiling walkdir v2.5.0
Compiling gix-utils v0.3.0
Compiling zerofrom v0.1.6
Compiling value-bag v1.11.1
Compiling prodash v30.0.1
Compiling bstr v1.12.0
Compiling log v0.4.27
Compiling gix-validate v0.10.0
Compiling yoke v0.7.5
Compiling gix-path v0.10.20
Compiling zerovec v0.10.4
Compiling itoa v1.0.11
Compiling hash32 v0.3.1
Compiling zeroize v1.7.0
Compiling heapless v0.8.0
Compiling tinystr v0.7.6
Compiling litemap v0.7.5
Compiling writeable v0.5.5
Compiling libz-rs-sys v0.5.2
Compiling icu_locid v1.5.0
Compiling flate2 v1.1.1
Compiling gix-features v0.43.1
Compiling faster-hex v0.10.0
Compiling icu_provider v1.5.0
Compiling icu_locid_transform_data v1.5.1
Compiling sha1 v0.10.6
Compiling block-padding v0.3.3
Compiling linux-raw-sys v0.9.4
Compiling thiserror v1.0.69
Compiling icu_locid_transform v1.5.0
Compiling inout v0.1.3
Compiling sha1-checked v0.10.0
Compiling icu_properties_data v1.5.1
Compiling icu_collections v1.5.0
Compiling gix-hash v0.19.0
Compiling icu_properties v1.5.1
Compiling cipher v0.4.4
Compiling rustix v1.0.7
Compiling icu_normalizer_data v1.5.1
Compiling utf16_iter v1.0.5
Compiling utf8_iter v1.0.4
Compiling write16 v1.0.0
Compiling getrandom v0.3.3
Compiling percent-encoding v2.3.1
Compiling sha2 v0.10.8
Compiling form_urlencoded v1.2.1
Compiling libz-sys v1.1.16
Compiling universal-hash v0.5.1
Compiling opaque-debug v0.3.1
Compiling libgit2-sys v0.17.0+1.8.1
Compiling hashbrown v0.14.3
Compiling signature v1.6.4
Compiling icu_normalizer v1.5.0
Compiling equivalent v1.0.1
Compiling indexmap v2.2.6
Compiling idna_adapter v1.2.0
Compiling idna v1.0.3
Compiling ed25519 v1.5.3
Compiling url v2.5.4
Compiling tempfile v3.23.0
Compiling aead v0.5.2
Compiling ascii v1.1.0
Compiling amplify_num v0.5.2
Compiling ryu v1.0.17
Compiling ct-codecs v1.1.1
Compiling serde_json v1.0.140
Compiling ec25519 v0.1.0
Compiling num-traits v0.2.19
Compiling amplify v4.6.0
Compiling poly1305 v0.8.0
Compiling chacha20 v0.9.1
Compiling git-ref-format-core v0.5.0
Compiling ref-cast v1.0.24
Compiling cyphergraphy v0.3.0
Compiling polyval v0.6.2
Compiling sqlite3-src v0.5.1
Compiling hmac v0.12.1
Compiling base64ct v1.6.0
Compiling keccak v0.1.5
Compiling dyn-clone v1.0.17
Compiling sha3 v0.10.8
Compiling pem-rfc7468 v0.7.0
Compiling pbkdf2 v0.12.2
Compiling ghash v0.5.1
Compiling ctr v0.9.2
Compiling aes v0.8.4
Compiling rand v0.8.5
Compiling base32 v0.4.0
Compiling qcheck v1.0.0
Compiling cypheraddr v0.4.0
Compiling aes-gcm v0.10.3
Compiling ssh-encoding v0.2.0
Compiling chacha20poly1305 v0.10.1
Compiling blowfish v0.9.1
Compiling cbc v0.1.2
Compiling data-encoding v2.5.0
Compiling ssh-cipher v0.2.0
Compiling data-encoding-macro v0.1.14
Compiling bcrypt-pbkdf v0.10.0
Compiling noise-framework v0.4.0
Compiling socks5-client v0.4.1
Compiling crossbeam-utils v0.8.19
Compiling base-x v0.2.11
Compiling signature v2.2.0
Compiling ssh-key v0.6.6
Compiling crossbeam-channel v0.5.15
Compiling multibase v0.9.1
Compiling cyphernet v0.5.2
Compiling schemars v1.0.4
Compiling radicle-ssh v0.10.0 (/6989eb60-7fff-4e24-bd61-87efceef9c87/w/crates/radicle-ssh)
Compiling jiff v0.2.15
Compiling lazy_static v1.5.0
Compiling nonempty v0.9.0
Compiling anstyle-query v1.0.2
Compiling siphasher v1.0.1
Compiling radicle-git-metadata v0.1.0 (/6989eb60-7fff-4e24-bd61-87efceef9c87/w/crates/radicle-git-metadata)
Compiling radicle-dag v0.10.0 (/6989eb60-7fff-4e24-bd61-87efceef9c87/w/crates/radicle-dag)
Compiling winnow v0.7.13
Compiling hashbrown v0.15.5
Compiling gix-date v0.10.5
Compiling utf8parse v0.2.1
Compiling anstyle-parse v0.2.3
Compiling gix-actor v0.35.4
Compiling gix-hashtable v0.9.0
Compiling radicle-git-ref-format v0.1.0 (/6989eb60-7fff-4e24-bd61-87efceef9c87/w/crates/radicle-git-ref-format)
Compiling colorchoice v1.0.0
Compiling anstyle v1.0.11
Compiling iana-time-zone v0.1.60
Compiling base64 v0.21.7
Compiling chrono v0.4.38
Compiling anstream v0.6.13
Compiling gix-object v0.50.2
Compiling colored v2.1.0
Compiling serde-untagged v0.1.7
Compiling bytesize v2.0.1
Compiling localtime v1.3.1
Compiling memmap2 v0.9.8
Compiling tree-sitter-language v0.1.2
Compiling fast-glob v0.3.3
Compiling dunce v1.0.5
Compiling gix-chunk v0.4.11
Compiling adler2 v2.0.0
Compiling gix-commitgraph v0.29.0
Compiling gix-fs v0.16.1
Compiling gix-revwalk v0.21.0
Compiling gix-tempfile v18.0.0
Compiling mio v1.0.4
Compiling gix-quote v0.6.0
Compiling sem_safe v0.2.0
Compiling errno v0.3.13
Compiling shell-words v1.1.0
Compiling either v1.11.0
Compiling unicode-segmentation v1.11.0
Compiling gix-command v0.6.2
Compiling signals_receipts v0.2.0
Compiling gix-lock v18.0.0
Compiling gix-url v0.32.0
Compiling gix-config-value v0.15.1
Compiling gix-sec v0.12.0
Compiling signal-hook-registry v1.4.5
Compiling gimli v0.31.1
Compiling signal-hook v0.3.18
Compiling gix-prompt v0.11.1
Compiling radicle-signals v0.11.0 (/6989eb60-7fff-4e24-bd61-87efceef9c87/w/crates/radicle-signals)
Compiling object v0.36.7
Compiling addr2line v0.24.2
Compiling gix-revision v0.35.0
Compiling gix-traverse v0.47.0
Compiling miniz_oxide v0.8.8
Compiling gix-diff v0.53.0
Compiling gix-packetline v0.19.1
Compiling mio v0.8.11
Compiling tree-sitter v0.24.4
Compiling sqlite3-sys v0.15.2
Compiling rustc-demangle v0.1.26
Compiling sqlite v0.32.0
Compiling radicle-crypto v0.14.0 (/6989eb60-7fff-4e24-bd61-87efceef9c87/w/crates/radicle-crypto)
Compiling backtrace v0.3.75
Compiling rustix v0.38.34
Compiling signal-hook-mio v0.2.4
Compiling gix-transport v0.48.0
Compiling gix-pack v0.60.0
Compiling gix-refspec v0.31.0
Compiling gix-credentials v0.30.0
Compiling gix-ref v0.53.1
Compiling gix-shallow v0.5.0
Compiling convert_case v0.7.1
Compiling gix-negotiate v0.21.0
Compiling regex v1.11.1
Compiling arc-swap v1.7.1
Compiling gix-protocol v0.51.0
Compiling gix-odb v0.70.0
Compiling derive_more-impl v2.0.1
Compiling xattr v1.3.1
Compiling uuid v1.16.0
Compiling filetime v0.2.23
Compiling unicode-width v0.2.1
Compiling bytes v1.10.1
Compiling bitflags v1.3.2
Compiling crossterm v0.25.0
Compiling console v0.16.0
Compiling tar v0.4.40
Compiling git-ref-format-macro v0.5.0
Compiling derive_more v2.0.1
Compiling anyhow v1.0.82
Compiling portable-atomic v1.11.0
Compiling newline-converter v0.3.0
Compiling snapbox-macros v0.3.8
Compiling salsa20 v0.10.2
Compiling fxhash v0.2.1
Compiling siphasher v0.3.11
Compiling clap_lex v0.7.5
Compiling unicode-width v0.1.11
Compiling strsim v0.11.1
Compiling unit-prefix v0.5.1
Compiling streaming-iterator v0.1.9
Compiling normalize-line-endings v0.3.0
Compiling similar v2.5.0
Compiling clap_builder v4.5.44
Compiling snapbox v0.4.17
Compiling indicatif v0.18.0
Compiling inquire v0.7.5
Compiling bloomy v1.2.0
Compiling scrypt v0.11.0
Compiling radicle-surf v0.25.0
Compiling crossterm v0.29.0
Compiling git-ref-format v0.5.0
Compiling unicode-display-width v0.3.0
Compiling systemd-journal-logger v2.2.2
Compiling tree-sitter-ruby v0.23.1
Compiling tree-sitter-go v0.23.4
Compiling tree-sitter-python v0.23.4
Compiling tree-sitter-html v0.23.2
Compiling tree-sitter-rust v0.23.2
Compiling tree-sitter-md v0.3.2
Compiling tree-sitter-json v0.24.8
Compiling tree-sitter-c v0.23.2
Compiling tree-sitter-css v0.23.1
Compiling tree-sitter-toml-ng v0.6.0
Compiling tree-sitter-bash v0.23.3
Compiling tree-sitter-typescript v0.23.2
Compiling serde_spanned v1.0.0
Compiling toml_datetime v0.7.0
Compiling radicle-std-ext v0.1.1
Compiling pin-project-lite v0.2.16
Compiling toml_writer v1.0.2
Compiling tokio v1.47.1
Compiling toml v0.9.5
Compiling clap v4.5.44
Compiling os_info v3.12.0
Compiling diff v0.1.13
Compiling radicle-node v0.16.0 (/6989eb60-7fff-4e24-bd61-87efceef9c87/w/crates/radicle-node)
Compiling yansi v0.5.1
Compiling radicle-cli v0.17.0 (/6989eb60-7fff-4e24-bd61-87efceef9c87/w/crates/radicle-cli)
Compiling pretty_assertions v1.4.0
Compiling human-panic v2.0.3
Compiling clap_complete v4.5.60
Compiling structured-logger v1.0.4
Compiling radicle-systemd v0.11.0 (/6989eb60-7fff-4e24-bd61-87efceef9c87/w/crates/radicle-systemd)
Compiling tree-sitter-highlight v0.24.4
Compiling itertools v0.14.0
Compiling num-integer v0.1.46
Compiling socket2 v0.5.7
Compiling lexopt v0.3.0
Compiling timeago v0.4.2
Compiling escargot v0.5.10
Compiling num-bigint v0.4.6
Compiling num-iter v0.1.45
Compiling num-complex v0.4.6
Compiling env_filter v0.1.3
Compiling num-rational v0.4.2
Compiling bit-vec v0.8.0
Compiling zerocopy v0.7.35
Compiling borrow-or-share v0.2.2
Compiling fluent-uri v0.3.2
Compiling ahash v0.8.11
Compiling num v0.4.3
Compiling bit-set v0.8.0
Compiling env_logger v0.11.8
Compiling phf_shared v0.11.3
Compiling vsimd v0.8.0
Compiling radicle-remote-helper v0.14.0 (/6989eb60-7fff-4e24-bd61-87efceef9c87/w/crates/radicle-remote-helper)
Compiling outref v0.5.2
Compiling phf v0.11.3
Compiling uuid-simd v0.8.0
Compiling test-log v0.2.18
Compiling fancy-regex v0.14.0
Compiling fraction v0.15.3
Compiling referencing v0.30.0
Compiling email_address v0.2.9
Compiling base64 v0.22.1
Compiling bytecount v0.6.8
Compiling num-cmp v0.1.0
Compiling emojis v0.6.4
Compiling jsonschema v0.30.0
Compiling git2 v0.19.0
Compiling radicle-oid v0.1.0 (/6989eb60-7fff-4e24-bd61-87efceef9c87/w/crates/radicle-oid)
Compiling radicle-cob v0.17.0 (/6989eb60-7fff-4e24-bd61-87efceef9c87/w/crates/radicle-cob)
Compiling radicle-git-ext v0.10.0
Compiling radicle-term v0.16.0 (/6989eb60-7fff-4e24-bd61-87efceef9c87/w/crates/radicle-term)
Compiling radicle v0.20.0 (/6989eb60-7fff-4e24-bd61-87efceef9c87/w/crates/radicle)
Compiling radicle-fetch v0.16.0 (/6989eb60-7fff-4e24-bd61-87efceef9c87/w/crates/radicle-fetch)
Compiling radicle-protocol v0.4.0 (/6989eb60-7fff-4e24-bd61-87efceef9c87/w/crates/radicle-protocol)
Compiling radicle-cli-test v0.13.0 (/6989eb60-7fff-4e24-bd61-87efceef9c87/w/crates/radicle-cli-test)
Compiling radicle-schemars v0.6.0 (/6989eb60-7fff-4e24-bd61-87efceef9c87/w/crates/radicle-schemars)
Finished `dev` profile [unoptimized + debuginfo] target(s) in 1m 06s
+ cargo doc --workspace --no-deps --all-features
Checking regex-automata v0.4.9
Compiling syn v1.0.109
Checking idna v1.0.3
Checking radicle-ssh v0.10.0 (/6989eb60-7fff-4e24-bd61-87efceef9c87/w/crates/radicle-ssh)
Checking url v2.5.4
Compiling num-traits v0.2.19
Checking radicle-git-metadata v0.1.0 (/6989eb60-7fff-4e24-bd61-87efceef9c87/w/crates/radicle-git-metadata)
Checking git2 v0.19.0
Checking radicle-dag v0.10.0 (/6989eb60-7fff-4e24-bd61-87efceef9c87/w/crates/radicle-dag)
Checking chrono v0.4.38
Checking bstr v1.12.0
Compiling amplify_syn v2.0.1
Checking gix-validate v0.10.0
Checking gix-path v0.10.20
Checking git-ref-format-core v0.5.0
Compiling data-encoding-macro-internal v0.1.12
Checking gix-features v0.43.1
Compiling amplify_derive v4.0.0
Checking gix-date v0.10.5
Checking gix-hash v0.19.0
Checking radicle-git-ref-format v0.1.0 (/6989eb60-7fff-4e24-bd61-87efceef9c87/w/crates/radicle-git-ref-format)
Checking data-encoding-macro v0.1.14
Checking gix-actor v0.35.4
Checking multibase v0.9.1
Checking gix-hashtable v0.9.0
Checking radicle-oid v0.1.0 (/6989eb60-7fff-4e24-bd61-87efceef9c87/w/crates/radicle-oid)
Checking gix-commitgraph v0.29.0
Checking gix-object v0.50.2
Checking gix-fs v0.16.1
Checking gix-quote v0.6.0
Checking gix-tempfile v18.0.0
Checking gix-command v0.6.2
Checking gix-lock v18.0.0
Checking gix-url v0.32.0
Checking gix-config-value v0.15.1
Checking gix-prompt v0.11.1
Checking radicle-signals v0.11.0 (/6989eb60-7fff-4e24-bd61-87efceef9c87/w/crates/radicle-signals)
Checking gix-revwalk v0.21.0
Checking gix-diff v0.53.0
Checking gix-packetline v0.19.1
Checking gix-revision v0.35.0
Checking gix-traverse v0.47.0
Checking regex v1.11.1
Checking amplify v4.6.0
Checking gix-refspec v0.31.0
Checking gix-pack v0.60.0
Checking tree-sitter v0.24.4
Checking cyphergraphy v0.3.0
Checking gix-transport v0.48.0
Checking cypheraddr v0.4.0
Checking noise-framework v0.4.0
Checking socks5-client v0.4.1
Checking gix-negotiate v0.21.0
Checking cyphernet v0.5.2
Checking gix-credentials v0.30.0
Checking gix-ref v0.53.1
Checking radicle-crypto v0.14.0 (/6989eb60-7fff-4e24-bd61-87efceef9c87/w/crates/radicle-crypto)
Checking git-ref-format v0.5.0
Checking gix-shallow v0.5.0
Checking radicle-cob v0.17.0 (/6989eb60-7fff-4e24-bd61-87efceef9c87/w/crates/radicle-cob)
Checking radicle-git-ext v0.10.0
Checking gix-protocol v0.51.0
Checking uuid v1.16.0
Checking gix-odb v0.70.0
Checking radicle v0.20.0 (/6989eb60-7fff-4e24-bd61-87efceef9c87/w/crates/radicle)
Compiling radicle-cli v0.17.0 (/6989eb60-7fff-4e24-bd61-87efceef9c87/w/crates/radicle-cli)
Checking human-panic v2.0.3
Checking radicle-surf v0.25.0
Checking tree-sitter-toml-ng v0.6.0
Checking radicle-term v0.16.0 (/6989eb60-7fff-4e24-bd61-87efceef9c87/w/crates/radicle-term)
Checking tree-sitter-highlight v0.24.4
Checking radicle-systemd v0.11.0 (/6989eb60-7fff-4e24-bd61-87efceef9c87/w/crates/radicle-systemd)
Documenting radicle-systemd v0.11.0 (/6989eb60-7fff-4e24-bd61-87efceef9c87/w/crates/radicle-systemd)
Documenting radicle v0.20.0 (/6989eb60-7fff-4e24-bd61-87efceef9c87/w/crates/radicle)
Documenting radicle-term v0.16.0 (/6989eb60-7fff-4e24-bd61-87efceef9c87/w/crates/radicle-term)
Documenting radicle-cob v0.17.0 (/6989eb60-7fff-4e24-bd61-87efceef9c87/w/crates/radicle-cob)
Documenting radicle-crypto v0.14.0 (/6989eb60-7fff-4e24-bd61-87efceef9c87/w/crates/radicle-crypto)
Documenting radicle-signals v0.11.0 (/6989eb60-7fff-4e24-bd61-87efceef9c87/w/crates/radicle-signals)
Documenting radicle-oid v0.1.0 (/6989eb60-7fff-4e24-bd61-87efceef9c87/w/crates/radicle-oid)
Documenting radicle-git-ref-format v0.1.0 (/6989eb60-7fff-4e24-bd61-87efceef9c87/w/crates/radicle-git-ref-format)
Documenting radicle-git-metadata v0.1.0 (/6989eb60-7fff-4e24-bd61-87efceef9c87/w/crates/radicle-git-metadata)
Documenting radicle-ssh v0.10.0 (/6989eb60-7fff-4e24-bd61-87efceef9c87/w/crates/radicle-ssh)
Documenting radicle-dag v0.10.0 (/6989eb60-7fff-4e24-bd61-87efceef9c87/w/crates/radicle-dag)
Checking radicle-fetch v0.16.0 (/6989eb60-7fff-4e24-bd61-87efceef9c87/w/crates/radicle-fetch)
Documenting radicle-cli v0.17.0 (/6989eb60-7fff-4e24-bd61-87efceef9c87/w/crates/radicle-cli)
Documenting radicle-cli-test v0.13.0 (/6989eb60-7fff-4e24-bd61-87efceef9c87/w/crates/radicle-cli-test)
Checking radicle-protocol v0.4.0 (/6989eb60-7fff-4e24-bd61-87efceef9c87/w/crates/radicle-protocol)
Documenting radicle-protocol v0.4.0 (/6989eb60-7fff-4e24-bd61-87efceef9c87/w/crates/radicle-protocol)
Documenting radicle-node v0.16.0 (/6989eb60-7fff-4e24-bd61-87efceef9c87/w/crates/radicle-node)
Documenting radicle-schemars v0.6.0 (/6989eb60-7fff-4e24-bd61-87efceef9c87/w/crates/radicle-schemars)
Documenting radicle-fetch v0.16.0 (/6989eb60-7fff-4e24-bd61-87efceef9c87/w/crates/radicle-fetch)
Documenting radicle-remote-helper v0.14.0 (/6989eb60-7fff-4e24-bd61-87efceef9c87/w/crates/radicle-remote-helper)
Finished `dev` profile [unoptimized + debuginfo] target(s) in 11.40s
Generated /6989eb60-7fff-4e24-bd61-87efceef9c87/w/target/doc/radicle/index.html and 18 other files
+ cargo test --workspace --no-fail-fast
Finished `test` profile [unoptimized + debuginfo] target(s) in 0.21s
Running unittests src/lib.rs (target/debug/deps/radicle-3953555018688ae4)
running 239 tests
test canonical::formatter::test::ascii_control_characters ... ok
test canonical::formatter::test::securesystemslib_asserts ... ok
test canonical::formatter::test::ordered_nested_object ... ok
test cob::cache::migrations::_2::tests::test_migration_2 ... ok
test cob::cache::tests::test_check_version ... ok
test cob::cache::migrations::_2::tests::test_patch_json_deserialization ... ok
test cob::cache::tests::test_migrate_to ... ok
test cob::common::test::test_color ... ok
test cob::common::test::test_title ... ok
test cob::common::test::test_emojis ... ok
test cob::identity::test::prop_json_eq_str ... ok
test cob::identity::test::test_identity_reject_concurrent ... ok
test cob::identity::test::test_identity_redact_revision ... ok
test cob::identity::test::test_identity_remove_delegate_concurrent ... ok
test cob::identity::test::test_identity_updates ... ok
test cob::identity::test::test_identity_update_rejected ... ok
test cob::issue::cache::tests::test_counts ... ok
test cob::issue::cache::tests::test_get ... ok
test cob::issue::cache::tests::test_is_empty ... ok
test cob::issue::cache::tests::test_list ... ok
test cob::issue::cache::tests::test_list_by_status ... ok
test cob::issue::cache::tests::test_remove ... ok
test cob::identity::test::test_identity_updates_concurrent ... ok
test cob::identity::test::test_valid_identity ... ok
test cob::issue::test::test_embeds ... ok
test cob::issue::test::test_embeds_edit ... ok
test cob::issue::test::test_invalid_actions ... ok
test cob::issue::test::test_invalid_tx ... ok
test cob::issue::test::test_invalid_cob ... ok
test cob::identity::test::test_identity_updates_concurrent_outdated ... ok
test cob::issue::test::test_invalid_tx_reference ... ok
test cob::issue::test::test_concurrency ... ok
test cob::issue::test::test_issue_all ... ok
test cob::issue::test::test_issue_comment ... ok
test cob::issue::test::test_issue_comment_redact ... ok
test cob::issue::test::test_issue_create_and_assign ... ok
test cob::issue::test::test_issue_create_and_get ... ok
test cob::issue::test::test_issue_create_and_change_state ... ok
test cob::issue::test::test_issue_create_and_unassign ... ok
test cob::issue::test::test_issue_create_and_reassign ... ok
test cob::issue::test::test_issue_edit_description ... ok
test cob::issue::test::test_issue_edit ... ok
test cob::issue::test::test_issue_label ... ok
test cob::issue::test::test_issue_state_serde ... ok
test cob::issue::test::test_ordering ... ok
test cob::patch::actions::test::test_review_edit ... ok
test cob::issue::test::test_issue_multilines ... ok
test cob::issue::test::test_issue_react ... ok
test cob::issue::test::test_issue_reply ... ok
test cob::patch::cache::tests::test_is_empty ... ok
test cob::patch::cache::tests::test_list ... ok
test cob::patch::cache::tests::test_get ... ok
test cob::patch::cache::tests::test_remove ... ok
test cob::patch::encoding::review::test::test_review_deserialize_summary_migration_null_summary ... ok
test cob::patch::encoding::review::test::test_review_deserialize_summary_migration_with_summary ... ok
test cob::patch::encoding::review::test::test_review_deserialize_summary_migration_without_summary ... ok
test cob::patch::encoding::review::test::test_review_deserialize_summary_v2 ... ok
test cob::patch::encoding::review::test::test_review_summary ... ok
test cob::patch::test::test_json ... ok
test cob::patch::test::test_json_serialization ... ok
test cob::patch::cache::tests::test_list_by_status ... ok
test cob::patch::cache::tests::test_counts ... ok
test cob::patch::test::test_patch_create_and_get ... ok
test cob::patch::test::test_patch_merge ... ok
test cob::patch::test::test_patch_discussion ... ok
test cob::patch::test::test_patch_redact ... ok
test cob::patch::test::test_patch_review_comment ... ok
test cob::patch::test::test_patch_review ... ok
test cob::patch::test::test_patch_review_duplicate ... ok
test cob::patch::test::test_patch_review_edit_comment ... ok
test cob::patch::test::test_patch_review_edit ... ok
test cob::patch::test::test_patch_review_remove_summary ... ok
test cob::patch::test::test_reactions_json_serialization ... ok
test cob::patch::test::test_revision_edit_redact ... ok
test cob::patch::test::test_revision_reaction ... ok
test cob::patch::test::test_revision_review_merge_redacted ... ok
test cob::stream::tests::test_all_from ... ok
test cob::patch::test::test_patch_review_revision_redact ... ok
test cob::stream::tests::test_all_from_until ... ok
test cob::stream::tests::test_all_until ... ok
test cob::patch::test::test_patch_update ... ok
test cob::stream::tests::test_regression_from_until ... ok
test cob::thread::tests::test_comment_edit_missing ... ok
test cob::thread::tests::test_comment_edit_redacted ... ok
test cob::stream::tests::test_from_until ... ok
test cob::thread::tests::test_comment_redact_missing ... ok
test cob::thread::tests::test_duplicate_comments ... ok
test cob::thread::tests::test_edit_comment ... ok
test cob::thread::tests::test_redact_comment ... ok
test git::canonical::quorum::test::merge_base_commutative ... ok
test git::canonical::quorum::test::test_merge_bases ... ok
test cob::thread::tests::test_timeline ... ok
test git::canonical::rules::tests::test_deserialization ... ok
test git::canonical::rules::tests::test_deserialize_extensions ... ok
test git::canonical::rules::tests::test_order ... ok
test git::canonical::rules::tests::test_roundtrip ... ok
test git::canonical::rules::tests::test_canonical ... ok
test git::canonical::rules::tests::test_rule_validate_success ... ok
test git::canonical::rules::tests::test_special_branches ... ok
test git::canonical::tests::test_commit_quorum_fork_of_a_fork ... ok
test git::canonical::tests::test_commit_quorum_forked_merge_commits ... ok
test git::canonical::tests::test_commit_quorum_groups ... ok
test git::canonical::tests::test_commit_quorum_linear ... ok
test git::canonical::tests::test_commit_quorum_merges ... ok
test git::canonical::tests::test_commit_quorum_single ... ok
test git::canonical::tests::test_commit_quorum_three_way_fork ... ok
test git::canonical::tests::test_commit_quorum_two_way_fork ... ok
test git::canonical::tests::test_quorum_different_types ... ok
test git::canonical::rules::tests::test_rule_validate_failures ... ok
test git::canonical::tests::test_tag_quorum ... ok
test git::test::test_version_from_str ... ok
test git::test::test_version_ord ... ok
test identity::did::test::test_did_encode_decode ... ok
test identity::did::test::test_did_vectors ... ok
test identity::doc::id::test::prop_from_str ... ok
test cob::patch::cache::tests::test_find_by_revision ... ok
test git::canonical::tests::test_quorum_properties ... ok
test identity::doc::test::test_canonical_example ... ok
test identity::doc::test::test_duplicate_dids ... ok
test identity::doc::test::test_future_version_error ... ok
test identity::doc::test::test_is_valid_version ... ok
test identity::doc::test::test_canonical_doc ... ok
test identity::doc::test::test_not_found ... ok
test identity::doc::test::test_parse_version ... ok
test identity::doc::test::test_visibility_json ... ok
test identity::doc::update::test::test_can_update_crefs ... ok
test identity::doc::update::test::test_cannot_include_default_branch_rule ... ok
test identity::doc::update::test::test_default_branch_rule_exists_after_verification ... ok
test identity::project::test::test_project_name ... ok
test node::address::store::test::test_alias ... ok
test node::address::store::test::test_disconnected ... ok
test node::address::store::test::test_disconnected_ban ... ok
test node::address::store::test::test_empty ... ok
test node::address::store::test::test_entries ... ok
test node::address::store::test::test_get_none ... ok
test node::address::store::test::test_insert_and_get ... ok
test node::address::store::test::test_insert_and_remove ... ok
test node::address::store::test::test_insert_and_update ... ok
test node::address::store::test::test_insert_duplicate ... ok
test node::address::store::test::test_node_aliases ... ok
test node::address::store::test::test_remove_nothing ... ok
test node::command::test::command_result ... ok
test node::config::test::partial ... ok
test node::db::test::test_version ... ok
test node::features::test::test_operations ... ok
test node::notifications::store::test::test_branch_notifications ... ok
test node::notifications::store::test::test_clear ... ok
test node::notifications::store::test::test_cob_notifications ... ok
test node::notifications::store::test::test_counts_by_repo ... ok
test node::notifications::store::test::test_duplicate_notifications ... ok
test node::notifications::store::test::test_notification_status ... ok
test node::policy::store::test::test_follow_and_unfollow_node ... ok
test node::policy::store::test::test_node_aliases ... ok
test node::policy::store::test::test_node_policies ... ok
test node::policy::store::test::test_node_policy ... ok
test node::policy::store::test::test_repo_policies ... ok
test node::policy::store::test::test_repo_policy ... ok
test node::policy::store::test::test_seed_and_unseed_repo ... ok
test node::policy::store::test::test_update_alias ... ok
test node::policy::store::test::test_update_scope ... ok
test node::refs::store::test::test_count ... ok
test node::refs::store::test::test_set_and_delete ... ok
test node::refs::store::test::test_set_and_get ... ok
test node::routing::test::test_count ... ok
test cob::thread::tests::prop_ordering ... ok
test node::routing::test::test_insert_and_get ... ok
test node::routing::test::test_entries ... ok
test node::routing::test::test_insert_and_get_resources ... ok
test node::routing::test::test_insert_and_remove ... ok
test node::routing::test::test_insert_duplicate ... ok
test node::routing::test::test_insert_existing_updated_time ... ok
test node::routing::test::test_len ... ok
test node::routing::test::test_remove_many ... ok
test node::routing::test::test_remove_redundant ... ok
test node::routing::test::test_update_existing_multi ... ok
test node::routing::test::test_prune ... ok
test node::sync::announce::test::all_synced_nodes_are_preferred_seeds ... ok
test node::sync::announce::test::announcer_adapts_target_to_reach ... ok
test identity::doc::test::test_max_delegates ... ok
test node::sync::announce::test::announcer_reached_min_replication_target ... ok
test node::sync::announce::test::announcer_reached_max_replication_target ... ok
test node::sync::announce::test::announcer_preferred_seeds_or_replica_factor ... ok
test node::sync::announce::test::announcer_reached_preferred_seeds ... ok
test node::sync::announce::test::announcer_with_replication_factor_zero_and_preferred_seeds ... ok
test node::sync::announce::test::announcer_synced_with_unknown_node ... ok
test node::sync::announce::test::announcer_timed_out ... ok
test node::sync::announce::test::construct_only_preferred_seeds_provided ... ok
test node::sync::announce::test::cannot_construct_announcer ... ok
test node::sync::announce::test::construct_node_appears_in_multiple_input_sets ... ok
test node::sync::announce::test::invariant_progress_should_match_state ... ok
test node::sync::announce::test::local_node_in_preferred_seeds ... ok
test node::sync::announce::test::local_node_in_multiple_sets ... ok
test node::sync::announce::test::local_node_in_synced_set ... ok
test node::sync::announce::test::local_node_only_in_all_sets_results_in_no_seeds_error ... ok
test node::sync::announce::test::synced_with_local_node_is_ignored ... ok
test node::sync::announce::test::local_node_in_unsynced_set ... ok
test node::sync::announce::test::preferred_seeds_already_synced ... ok
test node::sync::announce::test::timed_out_after_reaching_success ... ok
test node::sync::announce::test::synced_with_same_node_multiple_times ... ok
test node::sync::fetch::test::all_nodes_are_candidates ... ok
test node::sync::fetch::test::ignores_duplicates_and_local_node ... ok
test node::sync::fetch::test::all_nodes_are_fetchable ... ok
test node::sync::fetch::test::could_not_reach_target ... ok
test node::sync::fetch::test::preferred_seeds_target_returned_over_replicas ... ok
test node::sync::fetch::test::reaches_target_of_preferred_seeds ... ok
test node::sync::fetch::test::reaches_target_of_max_replicas ... ok
test node::sync::test::ensure_replicas_construction ... ok
test node::sync::test::replicas_constrain_to ... ok
test node::test::test_alias ... ok
test node::test::test_command_result ... ok
test node::test::test_user_agent ... ok
test node::timestamp::tests::test_timestamp_max ... ok
test node::sync::fetch::test::reaches_target_of_replicas ... ok
test profile::test::canonicalize_home ... ok
test profile::test::test_config ... ok
test rad::tests::test_fork ... ok
test rad::tests::test_checkout ... ok
test rad::tests::test_init ... ok
test serde_ext::test::test_localtime ... ok
test serde_ext::test::test_localtime_ext ... ok
test storage::git::tests::test_references_of ... ok
test profile::config::test::schema ... ok
test storage::git::transport::local::url::test::test_url_parse ... ok
test storage::git::transport::local::url::test::test_url_to_string ... ok
test storage::git::transport::remote::url::test::test_url_parse ... ok
test storage::git::tests::test_sign_refs ... ok
test storage::refs::tests::prop_canonical_roundtrip ... ok
test storage::tests::test_storage ... ok
test test::assert::test::assert_with_message ... ok
test test::assert::test::test_assert_no_move ... ok
test test::assert::test::test_assert_panic_0 - should panic ... ok
test test::assert::test::test_assert_panic_1 - should panic ... ok
test test::assert::test::test_assert_panic_2 - should panic ... ok
test test::assert::test::test_assert_succeed ... ok
test test::assert::test::test_panic_message ... ok
test version::test::test_version ... ok
test storage::git::tests::test_remote_refs ... ok
test storage::refs::tests::test_rid_verification ... ok
test identity::doc::test::prop_encode_decode ... ok
test result: ok. 239 passed; 0 failed; 0 ignored; 0 measured; 0 filtered out; finished in 2.32s
Running unittests src/lib.rs (target/debug/deps/radicle_cli-ecc1df71f0ea5e73)
running 46 tests
test commands::block::args::test::should_not_parse ... ok
test commands::block::args::test::should_parse_rid ... ok
test commands::block::args::test::should_parse_nid ... ok
test commands::clone::args::test::should_parse_rid_non_urn ... ok
test commands::clone::args::test::should_parse_rid_url ... ok
test commands::clone::args::test::should_parse_rid_urn ... ok
test commands::cob::args::test::should_allow_log_json_format ... ok
test commands::cob::args::test::should_allow_show_json_format ... ok
test commands::cob::args::test::should_allow_log_pretty_format ... ok
test commands::fork::args::test::should_not_parse_rid_url ... ok
test commands::cob::args::test::should_allow_update_json_format ... ok
test commands::cob::args::test::should_not_allow_update_pretty_format ... ok
test commands::cob::args::test::should_not_allow_show_pretty_format ... ok
test commands::fork::args::test::should_parse_rid_urn ... ok
test commands::fork::args::test::should_parse_rid_non_urn ... ok
test commands::id::args::test::should_not_parse_into_payload - should panic ... ok
test commands::id::args::test::should_not_clobber_payload_args ... ok
test commands::id::args::test::should_parse_multiple_payloads ... ok
test commands::id::args::test::should_not_parse_single_payload ... ok
test commands::id::args::test::should_not_parse_single_payloads ... ok
test commands::id::args::test::should_parse_into_payload ... ok
test commands::init::args::test::should_not_parse_rid_url ... ok
test commands::init::args::test::should_parse_rid_urn ... ok
test commands::id::args::test::should_parse_single_payload ... ok
test commands::init::args::test::should_parse_rid_non_urn ... ok
test commands::patch::review::builder::tests::test_review_comments_basic ... ok
test commands::patch::review::builder::tests::test_review_comments_before ... ok
test commands::patch::review::builder::tests::test_review_comments_multiline ... ok
test commands::inspect::test::test_tree ... ok
test commands::patch::review::builder::tests::test_review_comments_split_hunk ... ok
test commands::publish::args::test::should_parse_rid_non_urn ... ok
test commands::publish::args::test::should_not_parse_rid_url ... ok
test git::pretty_diff::test::test_pretty ... ignored
test git::unified_diff::test::test_diff_content_encode_decode_content ... ok
test commands::watch::args::test::should_parse_ref_str ... ok
test git::ddiff::tests::diff_encode_decode_ddiff_hunk ... ok
test git::unified_diff::test::test_diff_encode_decode_diff ... ok
test commands::publish::args::test::should_parse_rid_urn ... ok
test terminal::args::test::should_not_parse ... ok
test terminal::args::test::should_parse_nid ... ok
test terminal::format::test::test_bytes ... ok
test terminal::args::test::should_parse_rid ... ok
test terminal::format::test::test_strip_comments ... ok
test terminal::patch::test::test_edit_display_message ... ok
test terminal::patch::test::test_create_display_message ... ok
test terminal::patch::test::test_update_display_message ... ok
test result: ok. 45 passed; 0 failed; 1 ignored; 0 measured; 0 filtered out; finished in 0.01s
Running unittests src/main.rs (target/debug/deps/rad-7a745e3b233df18f)
running 0 tests
test result: ok. 0 passed; 0 failed; 0 ignored; 0 measured; 0 filtered out; finished in 0.00s
Running tests/commands.rs (target/debug/deps/commands-2324a53f2ec1db87)
running 110 tests
test framework_home ... ok
test git_push_amend ... ok
test git_push_and_fetch ... ok
test git_push_canonical_annotated_tags ... ok
test git_push_canonical_lightweight_tags ... ok
test git_push_force_with_lease ... ok
test git_push_diverge ... ok
test rad_auth ... ok
test rad_auth_errors ... ok
test rad_block ... ok
test rad_checkout ... ok
test git_push_rollback ... ok
test git_tag ... ok
test git_push_converge ... ok
test rad_clone ... ok
test rad_clone_bare ... ok
test rad_clean ... ok
test rad_clone_all ... ok
test rad_clone_connect ... ok
test rad_clone_unknown ... ok
test rad_clone_directory ... ok
test rad_cob_multiset ... ok
test rad_cob_log ... ok
test rad_cob_migrate ... ok
test rad_clone_partial_fail ... ok
test rad_cob_operations ... ok
test rad_cob_show ... ok
test rad_cob_update_identity ... ok
test rad_config ... ok
test rad_cob_update ... ok
test rad_diff ... ok
test rad_help ... FAILED
test rad_id_collaboration ... ignored, slow
test rad_id ... ok
test rad_id_conflict ... ok
test rad_id_private ... ok
test rad_id_multi_delegate ... ok
test rad_id_threshold ... ok
test rad_id_unknown_field ... ok
test rad_id_update_delete_field ... ok
test rad_id_threshold_soft_fork ... ok
test rad_init ... ignored, part of many other tests
test rad_init_bare ... ok
test rad_init_detached_head ... ok
test rad_init_existing ... ok
test rad_init_existing_bare ... ok
test rad_init_no_git ... ok
test rad_init_no_seed ... ok
test rad_init_private ... ok
test rad_inbox ... ok
test rad_init_private_clone ... ok
test rad_fork ... ok
test rad_fetch ... ok
test rad_init_private_no_seed ... ok
test rad_init_private_clone_seed ... ok
test rad_init_sync_not_connected ... ok
test rad_init_private_seed ... ok
test rad_init_sync_preferred ... ok
test rad_init_with_existing_remote ... ok
test rad_inspect ... ok
test rad_issue ... ok
test rad_jj_bare ... ok
test rad_jj_colocated_patch ... ok
test rad_issue_list ... ok
test rad_key_mismatch ... ok
test rad_merge_no_ff ... ok
test rad_merge_after_update ... ok
test rad_merge_via_push ... ok
test rad_node_connect ... ok
test rad_node_connect_without_address ... ok
test rad_patch ... ok
test rad_node ... ok
test rad_patch_change_base ... ok
test rad_patch_ahead_behind ... ok
test rad_patch_checkout ... ok
test rad_patch_checkout_revision ... ok
test rad_patch_checkout_force ... ok
test rad_patch_detached_head ... ok
test rad_init_sync_timeout ... ok
test rad_init_sync_and_clone ... ok
test rad_patch_draft ... ok
test rad_patch_diff ... ok
test rad_patch_edit ... ok
test rad_patch_fetch_2 ... FAILED
test rad_patch_merge_draft ... ok
test rad_patch_fetch_1 ... ok
test rad_patch_delete ... ok
test rad_patch_revert_merge ... ok
test rad_patch_update ... ok
test rad_patch_open_explore ... ok
test rad_patch_via_push ... FAILED
test rad_publish ... ok
test rad_review_by_hunk ... ok
test rad_seed_and_follow ... ok
test rad_remote ... ok
test rad_self ... ok
test rad_seed_many ... ok
test rad_sync_without_node ... ok
test rad_push_and_pull_patches ... ok
test rad_unseed ... ok
test rad_warn_old_nodes ... ok
test rad_unseed_many ... ok
test rad_watch ... ok
test rad_sync ... ok
test test_clone_without_seeds ... ok
test test_cob_deletion ... ok
test test_cob_replication ... ok
test rad_workflow ... ok
test rad_patch_pull_update ... ok
test test_replication_via_seed ... ok
failures:
---- rad_help stdout ----
1788905894 test: Using PATH ["/6989eb60-7fff-4e24-bd61-87efceef9c87/w/crates/radicle-cli/target/debug", "/usr/local/cargo/bin", "/usr/local/sbin", "/usr/local/bin", "/usr/sbin", "/usr/bin", "/sbin", "/bin", "/tmp/.tmpRumci8/alice/work"]
1788905894 test: rad-help.md: Running `/6989eb60-7fff-4e24-bd61-87efceef9c87/w/target/debug/rad` with ["--help"] in `/tmp/.tmpRumci8/alice/work`..
thread 'rad_help' panicked at crates/radicle-cli-test/src/lib.rs:503:36:
--- Expected
++++ actual: stdout
1 1 | Radicle is a sovereign code forge built on Git.
2 2 |
3 3 | See `rad <COMMAND> --help` to learn about a specific command.
4 4 |
5 5 | Do you have feedback?
⋮
8 8 | (Messages are automatically posted to the public #feedback channel on Zulip.)
9 9 |
10 10 | Usage: rad <COMMAND>
11 11 |
12 12 | Commands:
13 - auth Manage identities and profiles
14 - block Block repositories or nodes from being seeded or followed
15 - checkout Checkout a repository into the local directory
16 - clean Remove all remotes from a repository
17 - clone Clone a Radicle repository
18 - config Manage your local Radicle configuration
19 - debug Write out information to help debug your Radicle node remotely
20 - follow Manage node follow policies
21 - fork Create a fork of a repository
22 - id Manage repository identities
23 - inbox Manage your Radicle notifications
24 - init Initialize a Radicle repository
25 - inspect Inspect a Radicle repository
26 - issue Manage issues
27 - ls List repositories
28 - node Control and query the Radicle Node
29 - patch Manage patches
30 - path Display the Radicle home path
31 - publish Publish a repository to the network
32 - remote Manage a repository's remotes
33 - seed Manage repository seeding policies
34 - self Show information about your identity and device
35 - stats Displays aggregated repository and node metrics
36 - sync Sync repositories to the network
37 - unblock Unblock repositories or nodes to allow them to be seeded or followed
38 - unfollow Unfollow a peer
39 - unseed Remove repository seeding policies
40 - watch Wait for some state to be updated
41 - version Print the version information of the CLI
42 - completions Print static completions information for a given shell
43 - help Print this message or the help of the given subcommand(s)
13 + auth Manage identities and profiles
14 + block Block repositories or nodes from being seeded or followed
15 + checkout Checkout a repository into the local directory
16 + clean Remove all remotes from a repository
17 + clone Clone a Radicle repository
18 + config Manage your local Radicle configuration
19 + debug Write out information to help debug your Radicle node remotely
20 + follow Manage node follow policies
21 + fork Create a fork of a repository
22 + id Manage repository identities
23 + inbox Manage your Radicle notifications
24 + init Initialize a Radicle repository
25 + inspect Inspect a Radicle repository
26 + issue Manage issues
27 + ls List repositories
28 + node Control and query the Radicle Node
29 + patch Manage patches
30 + path Display the Radicle home path
31 + publish Publish a repository to the network
32 + remote Manage a repository's remotes
33 + seed Manage repository seeding policies
34 + self Show information about your identity and device
35 + stats Displays aggregated repository and node metrics
36 + sync Sync repositories to the network
37 + unblock Unblock repositories or nodes to allow them to be seeded or followed
38 + unfollow Unfollow a peer
39 + unseed Remove repository seeding policies
40 + watch Wait for some state to be updated
41 + version Print the version information of the CLI
42 + help Print this message or the help of the given subcommand(s)
44 43 |
45 44 | Options:
46 45 | -h, --help
47 46 | Print help (see a summary with '-h')
48 47 |
49 48 | -V, --version
50 49 | Print version
Exit status: 0
note: run with `RUST_BACKTRACE=1` environment variable to display a backtrace
---- rad_patch_fetch_2 stdout ----
1788905906 test: Using PATH ["/6989eb60-7fff-4e24-bd61-87efceef9c87/w/crates/radicle-cli/target/debug", "/usr/local/cargo/bin", "/usr/local/sbin", "/usr/local/bin", "/usr/sbin", "/usr/bin", "/sbin", "/bin", "/tmp/.tmpO6gN1B/alice/work"]
1788905906 test: rad-init.md: Running `/6989eb60-7fff-4e24-bd61-87efceef9c87/w/target/debug/rad` with ["init", "--name", "heartwood", "--description", "Radicle Heartwood Protocol & Stack", "--no-confirm", "--public", "-v"] in `/tmp/.tmpO6gN1B/alice/work`..
1788905907 test: rad-init.md: Running `/6989eb60-7fff-4e24-bd61-87efceef9c87/w/target/debug/rad` with ["init"] in `/tmp/.tmpO6gN1B/alice/work`..
1788905907 test: rad-init.md: Running `/6989eb60-7fff-4e24-bd61-87efceef9c87/w/target/debug/rad` with ["ls"] in `/tmp/.tmpO6gN1B/alice/work`..
1788905907 test: rad-init.md: Running `/6989eb60-7fff-4e24-bd61-87efceef9c87/w/target/debug/rad` with ["node", "inventory"] in `/tmp/.tmpO6gN1B/alice/work`..
1788905907 test: Using PATH ["/6989eb60-7fff-4e24-bd61-87efceef9c87/w/crates/radicle-cli/target/debug", "/usr/local/cargo/bin", "/usr/local/sbin", "/usr/local/bin", "/usr/sbin", "/usr/bin", "/sbin", "/bin", "/tmp/.tmpO6gN1B/alice/work"]
1788905907 test: rad-patch-fetch-2.md: Running `git` with ["checkout", "-b", "alice/1", "-q"] in `/tmp/.tmpO6gN1B/alice/work`..
1788905907 test: rad-patch-fetch-2.md: Running `git` with ["commit", "--allow-empty", "-m", "Changes #1", "-q"] in `/tmp/.tmpO6gN1B/alice/work`..
1788905907 test: rad-patch-fetch-2.md: Running `git` with ["push", "rad", "-o", "patch.message=Changes", "HEAD:refs/patches"] in `/tmp/.tmpO6gN1B/alice/work`..
1788905907 test: rad-patch-fetch-2.md: Running `git` with ["checkout", "master", "-q"] in `/tmp/.tmpO6gN1B/alice/work`..
1788905907 test: rad-patch-fetch-2.md: Running `git` with ["branch", "-D", "alice/1", "-q"] in `/tmp/.tmpO6gN1B/alice/work`..
1788905907 test: rad-patch-fetch-2.md: Running `git` with ["update-ref", "-d", "refs/remotes/rad/alice/1"] in `/tmp/.tmpO6gN1B/alice/work`..
1788905907 test: rad-patch-fetch-2.md: Running `git` with ["update-ref", "-d", "refs/remotes/rad/patches/5e2dedcc5d515fcbc1cca483d3376609fe889bfb"] in `/tmp/.tmpO6gN1B/alice/work`..
1788905907 test: rad-patch-fetch-2.md: Running `git` with ["gc", "--prune=now"] in `/tmp/.tmpO6gN1B/alice/work`..
1788905907 test: rad-patch-fetch-2.md: Running `git` with ["branch", "-r"] in `/tmp/.tmpO6gN1B/alice/work`..
1788905907 test: rad-patch-fetch-2.md: Running `git` with ["pull"] in `/tmp/.tmpO6gN1B/alice/work`..
1788905907 test: rad-patch-fetch-2.md: Running `git` with ["branch", "-r"] in `/tmp/.tmpO6gN1B/alice/work`..
thread 'rad_patch_fetch_2' panicked at crates/radicle-cli-test/src/lib.rs:503:36:
--- Expected
++++ actual: stdout
1 - rad/HEAD -> rad/master
2 1 | rad/master
3 2 | rad/patches/5e2dedcc5d515fcbc1cca483d3376609fe889bfb
Exit status: 0
---- rad_patch_via_push stdout ----
1788905908 test: Using PATH ["/6989eb60-7fff-4e24-bd61-87efceef9c87/w/crates/radicle-cli/target/debug", "/usr/local/cargo/bin", "/usr/local/sbin", "/usr/local/bin", "/usr/sbin", "/usr/bin", "/sbin", "/bin", "/tmp/.tmpswjRvJ/alice/work"]
1788905908 test: rad-init.md: Running `/6989eb60-7fff-4e24-bd61-87efceef9c87/w/target/debug/rad` with ["init", "--name", "heartwood", "--description", "Radicle Heartwood Protocol & Stack", "--no-confirm", "--public", "-v"] in `/tmp/.tmpswjRvJ/alice/work`..
1788905908 test: rad-init.md: Running `/6989eb60-7fff-4e24-bd61-87efceef9c87/w/target/debug/rad` with ["init"] in `/tmp/.tmpswjRvJ/alice/work`..
1788905908 test: rad-init.md: Running `/6989eb60-7fff-4e24-bd61-87efceef9c87/w/target/debug/rad` with ["ls"] in `/tmp/.tmpswjRvJ/alice/work`..
1788905908 test: rad-init.md: Running `/6989eb60-7fff-4e24-bd61-87efceef9c87/w/target/debug/rad` with ["node", "inventory"] in `/tmp/.tmpswjRvJ/alice/work`..
1788905908 test: Using PATH ["/6989eb60-7fff-4e24-bd61-87efceef9c87/w/crates/radicle-cli/target/debug", "/usr/local/cargo/bin", "/usr/local/sbin", "/usr/local/bin", "/usr/sbin", "/usr/bin", "/sbin", "/bin", "/tmp/.tmpswjRvJ/alice/work"]
1788905908 test: rad-patch-via-push.md: Running `git` with ["checkout", "-b", "feature/1"] in `/tmp/.tmpswjRvJ/alice/work`..
1788905908 test: rad-patch-via-push.md: Running `git` with ["commit", "-a", "-m", "Add things", "-q", "--allow-empty"] in `/tmp/.tmpswjRvJ/alice/work`..
1788905908 test: rad-patch-via-push.md: Running `git` with ["push", "-o", "patch.message=Add things #1", "-o", "patch.message=See commits for details.", "rad", "HEAD:refs/patches"] in `/tmp/.tmpswjRvJ/alice/work`..
1788905908 test: rad-patch-via-push.md: Running `/6989eb60-7fff-4e24-bd61-87efceef9c87/w/target/debug/rad` with ["patch", "show", "6035d2f582afbe01ff23ea87528ae523d76875b6"] in `/tmp/.tmpswjRvJ/alice/work`..
1788905908 test: rad-patch-via-push.md: Running `git` with ["branch", "-vv"] in `/tmp/.tmpswjRvJ/alice/work`..
1788905908 test: rad-patch-via-push.md: Running `git` with ["status", "--short", "--branch"] in `/tmp/.tmpswjRvJ/alice/work`..
1788905908 test: rad-patch-via-push.md: Running `git` with ["fetch"] in `/tmp/.tmpswjRvJ/alice/work`..
1788905908 test: rad-patch-via-push.md: Running `git` with ["push"] in `/tmp/.tmpswjRvJ/alice/work`..
1788905908 test: rad-patch-via-push.md: Running `git` with ["show-ref"] in `/tmp/.tmpswjRvJ/alice/work`..
thread 'rad_patch_via_push' panicked at crates/radicle-cli-test/src/lib.rs:503:36:
--- Expected
++++ actual: stdout
1 1 | 42d894a83c9c356552a57af09ccdbd5587a99045 refs/heads/feature/1
2 2 | f2de534b5e81d7c6e2dcaf58c3dd91573c0a0354 refs/heads/master
3 - f2de534b5e81d7c6e2dcaf58c3dd91573c0a0354 refs/remotes/rad/HEAD
4 3 | f2de534b5e81d7c6e2dcaf58c3dd91573c0a0354 refs/remotes/rad/master
5 4 | 42d894a83c9c356552a57af09ccdbd5587a99045 refs/remotes/rad/patches/6035d2f582afbe01ff23ea87528ae523d76875b6
Exit status: 0
failures:
rad_help
rad_patch_fetch_2
rad_patch_via_push
test result: FAILED. 105 passed; 3 failed; 2 ignored; 0 measured; 0 filtered out; finished in 76.01s
error: test failed, to rerun pass `-p radicle-cli --test commands`
Running unittests src/lib.rs (target/debug/deps/radicle_cli_test-a59a60940608d3d7)
running 3 tests
test tests::test_parse ... ok
test tests::test_run ... ok
test tests::test_example_spaced_brackets ... ok
test result: ok. 3 passed; 0 failed; 0 ignored; 0 measured; 0 filtered out; finished in 0.00s
Running unittests src/lib.rs (target/debug/deps/radicle_cob-f2b3d6c5d7c0ddda)
running 8 tests
test object::tests::test_serde ... ok
test tests::git::roundtrip ... ok
test tests::git::traverse_cobs ... ok
test tests::invalid_parse_refstr ... ok
test type_name::test::valid_typenames ... ok
test tests::parse_refstr ... ok
test tests::git::list_cobs ... ok
test tests::git::update_cob ... ok
test result: ok. 8 passed; 0 failed; 0 ignored; 0 measured; 0 filtered out; finished in 0.02s
Running unittests src/lib.rs (target/debug/deps/radicle_crypto-c5b263bc947bec6c)
running 12 tests
test ssh::fmt::test::test_fingerprint ... ok
test ssh::fmt::test::test_key ... ok
test ssh::keystore::tests::test_init_no_passphrase ... ok
test ssh::test::test_agent_encoding_remove ... ok
test ssh::test::test_agent_encoding_sign ... ok
test ssh::test::prop_encode_decode_sk ... ok
test tests::prop_encode_decode ... ok
test tests::test_e25519_dh ... ok
test tests::test_encode_decode ... ok
test tests::prop_key_equality ... ok
test ssh::keystore::tests::test_signer ... ok
test ssh::keystore::tests::test_init_passphrase ... ok
test result: ok. 12 passed; 0 failed; 0 ignored; 0 measured; 0 filtered out; finished in 0.82s
Running unittests src/lib.rs (target/debug/deps/radicle_dag-05f7457e7194a495)
running 20 tests
test tests::test_cycle ... ok
test tests::test_dependencies ... ok
test tests::test_contains ... ok
test tests::test_complex ... ok
test tests::test_diamond ... ok
test tests::test_fold_diamond ... ok
test tests::test_fold_multiple_roots ... ok
test tests::test_fold_reject ... ok
test tests::test_fold_sorting_1 ... ok
test tests::test_fold_sorting_2 ... ok
test tests::test_get ... ok
test tests::test_is_empty ... ok
test tests::test_len ... ok
test tests::test_merge_1 ... ok
test tests::test_merge_2 ... ok
test tests::test_remove ... ok
test tests::test_prune_1 ... ok
test tests::test_prune_2 ... ok
test tests::test_prune_by_sorting ... ok
test tests::test_siblings ... ok
test result: ok. 20 passed; 0 failed; 0 ignored; 0 measured; 0 filtered out; finished in 0.00s
Running unittests src/lib.rs (target/debug/deps/radicle_fetch-a7e6b939c4d15a1d)
running 0 tests
test result: ok. 0 passed; 0 failed; 0 ignored; 0 measured; 0 filtered out; finished in 0.00s
Running unittests src/lib.rs (target/debug/deps/radicle_git_metadata-60432466fb6713b9)
running 0 tests
test result: ok. 0 passed; 0 failed; 0 ignored; 0 measured; 0 filtered out; finished in 0.00s
Running unittests src/lib.rs (target/debug/deps/radicle_git_ref_format-35ccca3c145c6922)
running 9 tests
test test::component ... ok
test test::pattern ... ok
test test::qualified ... ok
test test::component_invalid - should panic ... ok
test test::qualified_invalid - should panic ... ok
test test::qualified_pattern ... ok
test test::refname ... ok
test test::qualified_pattern_invalid - should panic ... ok
test test::refname_invalid - should panic ... ok
test result: ok. 9 passed; 0 failed; 0 ignored; 0 measured; 0 filtered out; finished in 0.00s
Running unittests src/lib.rs (target/debug/deps/radicle_node-708988a076a0445f)
running 74 tests
test reactor::timer::tests::test_next ... ok
test reactor::timer::tests::test_wake ... ok
test control::tests::test_control_socket ... ok
test reactor::timer::tests::test_wake_exact ... ok
test fingerprint::tests::matching ... ok
test control::tests::test_seed_unseed ... ok
test tests::e2e::missing_default_branch ... ok
test tests::e2e::missing_delegate_default_branch ... ok
test tests::e2e::test_catchup_on_refs_announcements ... ok
test tests::e2e::test_background_foreground_fetch ... ok
test tests::e2e::test_channel_reader_limit ... ok
test tests::e2e::test_clone ... ok
test tests::e2e::test_dont_fetch_owned_refs ... ok
test tests::e2e::test_connection_crossing ... ok
test tests::e2e::test_fetch_followed_remotes ... ok
test tests::e2e::test_concurrent_fetches ... ok
test tests::e2e::test_fetch_preserve_owned_refs ... ok
test tests::e2e::test_fetch_unseeded ... ok
test tests::e2e::test_fetch_up_to_date ... ok
test tests::e2e::test_inventory_sync_basic ... ok
test tests::e2e::test_fetch_emits_canonical_ref_update ... ok
test tests::e2e::test_large_fetch ... ok
test tests::e2e::test_migrated_clone ... ok
test tests::e2e::test_missing_remote ... ok
test tests::e2e::test_multiple_offline_inits ... ok
test tests::e2e::test_non_fastforward_sigrefs ... ok
test tests::e2e::test_outdated_delegate_sigrefs ... ok
test tests::e2e::test_outdated_sigrefs ... ok
test tests::e2e::test_replication ... ok
test tests::e2e::test_replication_invalid ... ok
test tests::e2e::test_inventory_sync_bridge ... ok
test tests::e2e::test_replication_ref_in_sigrefs ... ok
test tests::e2e::test_inventory_sync_ring ... ok
test tests::e2e::test_inventory_sync_star ... ok
test tests::test_announcement_rebroadcast ... ok
test tests::test_announcement_rebroadcast_duplicates ... ok
test tests::test_announcement_relay ... ok
test tests::test_connection_kept_alive ... ok
test tests::test_announcement_rebroadcast_timestamp_filtered ... ok
test tests::test_disconnecting_unresponsive_peer ... ok
test tests::test_fetch_missing_inventory_on_gossip ... ok
test tests::test_fetch_missing_inventory_on_schedule ... ok
test tests::test_inbound_connection ... ok
test tests::test_inventory_decode ... ok
test tests::test_init_and_seed ... ok
test tests::test_inventory_relay ... ok
test tests::test_inventory_relay_bad_timestamp ... ok
test tests::test_inventory_sync ... ok
test tests::test_maintain_connections ... ok
test tests::test_maintain_connections_failed_attempt ... ok
test tests::test_maintain_connections_transient ... ok
test tests::test_outbound_connection ... ok
test tests::test_persistent_peer_connect ... ok
test tests::test_inventory_pruning ... ok
test tests::test_persistent_peer_reconnect_success ... ok
test tests::test_persistent_peer_reconnect_attempt ... ok
test tests::test_ping_response ... ok
test tests::test_queued_fetch_from_command_same_rid ... ok
test tests::test_queued_fetch_from_ann_same_rid ... ok
test tests::test_redundant_connect ... ok
test tests::test_queued_fetch_max_capacity ... ok
test tests::test_refs_announcement_followed ... ok
test tests::test_refs_announcement_fetch_trusted_no_inventory ... ok
test tests::test_refs_announcement_no_subscribe ... ok
test tests::test_refs_announcement_offline ... ok
test tests::test_refs_announcement_relay_private ... ok
test tests::test_refs_announcement_relay_public ... ok
test tests::test_refs_synced_event ... ok
test tests::test_seeding ... ok
test wire::test::test_inventory_ann_with_extension ... ok
test wire::test::test_pong_message_with_extension ... ok
test tests::test_seed_repo_subscribe ... ok
test tests::prop_inventory_exchange_dense ... ok
test tests::test_announcement_message_amplification ... ok
test result: ok. 74 passed; 0 failed; 0 ignored; 0 measured; 0 filtered out; finished in 17.17s
Running unittests src/main.rs (target/debug/deps/radicle_node-7d312b29a9767116)
running 0 tests
test result: ok. 0 passed; 0 failed; 0 ignored; 0 measured; 0 filtered out; finished in 0.00s
Running unittests src/lib.rs (target/debug/deps/radicle_oid-983809b603f6ef8d)
running 10 tests
test fmt::test::fixture ... ok
test fmt::test::git2 ... ok
test fmt::test::gix ... ok
test fmt::test::zero ... ok
test git2::test::zero ... ok
test gix::test::zero ... ok
test str::test::fixture ... ok
test str::test::git2_roundtrip ... ok
test str::test::zero ... ok
test str::test::gix_roundrip ... ok
test result: ok. 10 passed; 0 failed; 0 ignored; 0 measured; 0 filtered out; finished in 0.00s
Running unittests src/lib.rs (target/debug/deps/radicle_protocol-2bd7009c496516e0)
running 46 tests
test deserializer::test::prop_decode_next ... ok
test deserializer::test::test_decode_next ... ok
test deserializer::test::test_unparsed ... ok
test service::filter::test::compatible ... ok
test service::filter::test::test_parameters ... ok
test service::limiter::test::test_limitter_multi ... ok
test service::limiter::test::test_limitter_refill ... ok
test service::limiter::test::test_limitter_different_rates ... ok
test service::gossip::store::test::test_announced ... ok
test service::filter::test::test_sizes ... ok
test service::message::tests::test_ref_remote_limit ... ok
test wire::frame::test::test_encode_git_large ... ok
test wire::frame::test::test_stream_id ... ok
test service::message::tests::test_inventory_limit ... ok
test wire::message::tests::prop_roundtrip_address ... ok
test service::message::tests::prop_refs_announcement_signing ... ok
test wire::message::tests::prop_roundtrip_message ... ok
test wire::message::tests::test_inv_ann_max_size ... ok
test wire::message::tests::test_node_ann_max_size ... ok
test wire::message::tests::test_ping_encode_size_overflow - should panic ... ok
test wire::message::tests::test_pingpong_encode_max_size ... ok
test wire::message::tests::test_pong_encode_size_overflow - should panic ... ok
test wire::message::tests::prop_zero_bytes_encode_decode ... ok
test wire::tests::prop_oid ... ok
test wire::tests::prop_roundtrip_filter ... ok
test wire::tests::prop_roundtrip_publickey ... ok
test wire::tests::prop_roundtrip_refs ... ok
test wire::tests::prop_roundtrip_repoid ... ok
test wire::tests::prop_roundtrip_signed_refs ... ok
test wire::tests::prop_roundtrip_tuple ... ok
test wire::tests::prop_roundtrip_u16 ... ok
test wire::tests::prop_roundtrip_u32 ... ok
test wire::tests::prop_roundtrip_u64 ... ok
test wire::tests::prop_roundtrip_vec ... ok
test wire::tests::prop_signature ... ok
test wire::tests::prop_string ... ok
test wire::tests::test_alias ... ok
test wire::tests::test_bounded_vec_limit ... ok
test wire::tests::test_filter_invalid ... ok
test wire::tests::test_string ... ok
test wire::varint::test::prop_roundtrip_varint ... ok
test wire::varint::test::test_encode_overflow - should panic ... ok
test wire::varint::test::test_encoding ... ok
test wire::message::tests::test_refs_ann_max_size ... ok
test wire::message::tests::prop_message_decoder ... ok
test service::message::tests::test_node_announcement_validate ... ok
test result: ok. 46 passed; 0 failed; 0 ignored; 0 measured; 0 filtered out; finished in 1.42s
Running unittests src/main.rs (target/debug/deps/git_remote_rad-9b4598e22fb05e53)
running 0 tests
test result: ok. 0 passed; 0 failed; 0 ignored; 0 measured; 0 filtered out; finished in 0.00s
Running unittests src/main.rs (target/debug/deps/radicle_schemars-ce00fa9f23e76096)
running 0 tests
test result: ok. 0 passed; 0 failed; 0 ignored; 0 measured; 0 filtered out; finished in 0.00s
Running unittests src/lib.rs (target/debug/deps/radicle_signals-bb66f1d798396f61)
running 0 tests
test result: ok. 0 passed; 0 failed; 0 ignored; 0 measured; 0 filtered out; finished in 0.00s
Running unittests src/lib.rs (target/debug/deps/radicle_ssh-4a779b564e98a497)
running 0 tests
test result: ok. 0 passed; 0 failed; 0 ignored; 0 measured; 0 filtered out; finished in 0.00s
Running unittests src/lib.rs (target/debug/deps/radicle_systemd-36e3b0b1253d2879)
running 0 tests
test result: ok. 0 passed; 0 failed; 0 ignored; 0 measured; 0 filtered out; finished in 0.00s
Running unittests src/lib.rs (target/debug/deps/radicle_term-c5564f4668a67e22)
running 21 tests
test ansi::tests::colors_disabled ... ok
test ansi::tests::colors_enabled ... ok
test cell::test::test_width ... ok
test ansi::tests::wrapping ... ok
test element::test::test_spaced ... ok
test element::test::test_truncate ... ok
test element::test::test_width ... ok
test table::test::test_table ... ok
test table::test::test_table_border_maximized ... ok
test table::test::test_table_border ... ok
test table::test::test_table_truncate ... ok
test table::test::test_table_unicode ... ok
test table::test::test_table_border_truncated ... ok
test table::test::test_truncate ... ok
test textarea::test::test_wrapping_code_block ... ok
test table::test::test_table_unicode_truncate ... ok
test textarea::test::test_wrapping ... ok
test textarea::test::test_wrapping_fenced_block ... ok
test vstack::test::test_vstack ... ok
test vstack::test::test_vstack_maximize ... ok
test textarea::test::test_wrapping_paragraphs ... ok
test result: ok. 21 passed; 0 failed; 0 ignored; 0 measured; 0 filtered out; finished in 0.00s
Doc-tests radicle
running 1 test
test crates/radicle/src/cob/patch/encoding/review.rs - cob::patch::encoding::review::Review (line 23) ... ignored
test result: ok. 0 passed; 0 failed; 1 ignored; 0 measured; 0 filtered out; finished in 0.00s
Doc-tests radicle_cli
running 0 tests
test result: ok. 0 passed; 0 failed; 0 ignored; 0 measured; 0 filtered out; finished in 0.00s
Doc-tests radicle_cli_test
running 0 tests
test result: ok. 0 passed; 0 failed; 0 ignored; 0 measured; 0 filtered out; finished in 0.00s
Doc-tests radicle_cob
running 1 test
test crates/radicle-cob/src/backend/stable.rs - backend::stable::with_advanced_timestamp (line 56) ... ignored
test result: ok. 0 passed; 0 failed; 1 ignored; 0 measured; 0 filtered out; finished in 0.00s
Doc-tests radicle_crypto
running 0 tests
test result: ok. 0 passed; 0 failed; 0 ignored; 0 measured; 0 filtered out; finished in 0.00s
Doc-tests radicle_dag
running 0 tests
test result: ok. 0 passed; 0 failed; 0 ignored; 0 measured; 0 filtered out; finished in 0.00s
Doc-tests radicle_fetch
running 0 tests
test result: ok. 0 passed; 0 failed; 0 ignored; 0 measured; 0 filtered out; finished in 0.00s
Doc-tests radicle_git_metadata
running 0 tests
test result: ok. 0 passed; 0 failed; 0 ignored; 0 measured; 0 filtered out; finished in 0.00s
Doc-tests radicle_git_ref_format
running 0 tests
test result: ok. 0 passed; 0 failed; 0 ignored; 0 measured; 0 filtered out; finished in 0.00s
Doc-tests radicle_node
running 0 tests
test result: ok. 0 passed; 0 failed; 0 ignored; 0 measured; 0 filtered out; finished in 0.00s
Doc-tests radicle_oid
running 0 tests
test result: ok. 0 passed; 0 failed; 0 ignored; 0 measured; 0 filtered out; finished in 0.00s
Doc-tests radicle_protocol
running 6 tests
test crates/radicle-protocol/src/bounded.rs - bounded::BoundedVec<T,N>::max (line 96) ... ok
test crates/radicle-protocol/src/bounded.rs - bounded::BoundedVec<T,N>::truncate (line 50) ... ok
test crates/radicle-protocol/src/bounded.rs - bounded::BoundedVec<T,N>::push (line 122) ... ok
test crates/radicle-protocol/src/bounded.rs - bounded::BoundedVec<T,N>::collect_from (line 30) ... ok
test crates/radicle-protocol/src/bounded.rs - bounded::BoundedVec<T,N>::with_capacity (line 66) ... ok
test crates/radicle-protocol/src/bounded.rs - bounded::BoundedVec<T,N>::unbound (line 149) ... ok
test result: ok. 6 passed; 0 failed; 0 ignored; 0 measured; 0 filtered out; finished in 0.34s
Doc-tests radicle_signals
running 0 tests
test result: ok. 0 passed; 0 failed; 0 ignored; 0 measured; 0 filtered out; finished in 0.00s
Doc-tests radicle_ssh
running 0 tests
test result: ok. 0 passed; 0 failed; 0 ignored; 0 measured; 0 filtered out; finished in 0.00s
Doc-tests radicle_systemd
running 0 tests
test result: ok. 0 passed; 0 failed; 0 ignored; 0 measured; 0 filtered out; finished in 0.00s
Doc-tests radicle_term
running 1 test
test crates/radicle-term/src/table.rs - table (line 4) ... ok
test result: ok. 1 passed; 0 failed; 0 ignored; 0 measured; 0 filtered out; finished in 0.15s
error: 1 target failed:
`-p radicle-cli --test commands`
Exit code: 101
{
"response": "finished",
"result": "failure"
}