rad:z3gqcJUoA1n9HaHKufZs5FCSGazv5 heartwoodb7de4dde6bac0a685aacdfa74e72b1d2cb81007b
{
"request": "trigger",
"version": 1,
"event_type": "patch",
"repository": {
"id": "rad:z3gqcJUoA1n9HaHKufZs5FCSGazv5",
"name": "heartwood",
"description": "Radicle Heartwood Protocol & Stack",
"private": false,
"default_branch": "master",
"delegates": [
"did:key:z6MksFqXN3Yhqk8pTJdUGLwATkRfQvwZXPqR2qMEhbS9wzpT",
"did:key:z6MkireRatUThvd3qzfKht1S44wpm4FEWSSa4PRMTSQZ3voM",
"did:key:z6MkkPvBfjP4bQmco5Dm7UGsX2ruDBieEHi8n9DVJWX5sTEz"
]
},
"action": "Created",
"patch": {
"id": "d324d675b95f37485144d6e63d6f2aa9d10e0f31",
"author": {
"id": "did:key:z6MkkfM3tPXNPrPevKr3uSiQtHPuwnNhu2yUVjgd2jXVsVz5",
"alias": "sebastinez"
},
"title": "[wip]: Make a CLI example with threshold 2",
"state": {
"status": "archived",
"conflicts": []
},
"before": "9e010068efdc4314dde2c07386303bdeed12b3ee",
"after": "b7de4dde6bac0a685aacdfa74e72b1d2cb81007b",
"commits": [
"b7de4dde6bac0a685aacdfa74e72b1d2cb81007b"
],
"target": "7e1cb406bb935c3de008d2171e8961f57b4336ea",
"labels": [],
"assignees": [],
"revisions": [
{
"id": "d324d675b95f37485144d6e63d6f2aa9d10e0f31",
"author": {
"id": "did:key:z6MkkfM3tPXNPrPevKr3uSiQtHPuwnNhu2yUVjgd2jXVsVz5",
"alias": "sebastinez"
},
"description": "",
"base": "9e010068efdc4314dde2c07386303bdeed12b3ee",
"oid": "b7de4dde6bac0a685aacdfa74e72b1d2cb81007b",
"timestamp": 1751980931
}
]
}
}
{
"response": "triggered",
"run_id": {
"id": "6178c334-7f10-4092-84bc-49e607c34bad"
},
"info_url": "https://cci.rad.levitte.org//6178c334-7f10-4092-84bc-49e607c34bad.html"
}
Started at: 2026-09-08 22:22:12.249029+02:00
Commands:
$ rad clone rad:z3gqcJUoA1n9HaHKufZs5FCSGazv5 .
✓ Creating checkout in ./...
✓ Remote cloudhead@z6MksFqXN3Yhqk8pTJdUGLwATkRfQvwZXPqR2qMEhbS9wzpT added
✓ Remote-tracking branch cloudhead@z6MksFqXN3Yhqk8pTJdUGLwATkRfQvwZXPqR2qMEhbS9wzpT/master created for z6MksFqXN3Yhqk8pTJdUGLwATkRfQvwZXPqR2qMEhbS9wzpT
✓ Remote fintohaps@z6MkireRatUThvd3qzfKht1S44wpm4FEWSSa4PRMTSQZ3voM added
✓ Remote-tracking branch fintohaps@z6MkireRatUThvd3qzfKht1S44wpm4FEWSSa4PRMTSQZ3voM/master created for z6MkireRatUThvd3qzfKht1S44wpm4FEWSSa4PRMTSQZ3voM
✓ Remote lorenz@z6MkkPvBfjP4bQmco5Dm7UGsX2ruDBieEHi8n9DVJWX5sTEz added
✓ Remote-tracking branch lorenz@z6MkkPvBfjP4bQmco5Dm7UGsX2ruDBieEHi8n9DVJWX5sTEz/master created for z6MkkPvBfjP4bQmco5Dm7UGsX2ruDBieEHi8n9DVJWX5sTEz
✓ Repository successfully cloned under /opt/radcis/ci.rad.levitte.org/cci/state/6178c334-7f10-4092-84bc-49e607c34bad/w/
╭────────────────────────────────────╮
│ heartwood │
│ Radicle Heartwood Protocol & Stack │
│ 189 issues · 39 patches │
╰────────────────────────────────────╯
Run `cd ./.` to go to the repository directory.
Exit code: 0
$ rad patch checkout d324d675b95f37485144d6e63d6f2aa9d10e0f31
✓ Switched to branch patch/d324d67 at revision d324d67
✓ Branch patch/d324d67 setup to track rad/patches/d324d675b95f37485144d6e63d6f2aa9d10e0f31
Exit code: 0
$ git config advice.detachedHead false
Exit code: 0
$ git checkout b7de4dde6bac0a685aacdfa74e72b1d2cb81007b
HEAD is now at b7de4dde [wip]: Make a CLI example with threshold 2
Exit code: 0
$ rad patch show d324d675b95f37485144d6e63d6f2aa9d10e0f31 -p
╭────────────────────────────────────────────────────────────────────────────────╮
│ Title [wip]: Make a CLI example with threshold 2 │
│ Patch d324d675b95f37485144d6e63d6f2aa9d10e0f31 │
│ Author sebastinez z6MkkfM…jXVsVz5 │
│ Head b7de4dde6bac0a685aacdfa74e72b1d2cb81007b │
│ Base 9e010068efdc4314dde2c07386303bdeed12b3ee │
│ Target master │
│ Branches patch/d324d67 │
│ Commits ahead 1, behind 1006 │
│ Status archived │
├────────────────────────────────────────────────────────────────────────────────┤
│ b7de4dd [wip]: Make a CLI example with threshold 2 │
├────────────────────────────────────────────────────────────────────────────────┤
│ ● Revision d324d67 @ 9e01006..b7de4dd by sebastinez z6MkkfM…jXVsVz5 1 year ago │
╰────────────────────────────────────────────────────────────────────────────────╯
commit b7de4dde6bac0a685aacdfa74e72b1d2cb81007b
Author: Sebastian Martinez <me@sebastinez.dev>
Date: Tue Jul 8 15:22:05 2025 +0200
[wip]: Make a CLI example with threshold 2
diff --git a/crates/radicle-cli/examples/rad-id-threshold.md b/crates/radicle-cli/examples/rad-id-threshold.md
index fe139debed..b0307fbb51 100644
--- a/crates/radicle-cli/examples/rad-id-threshold.md
+++ b/crates/radicle-cli/examples/rad-id-threshold.md
@@ -195,9 +195,140 @@ $ rad fork
$ rad sync -f
Fetching rad:z42hL2jL4XNk6K8oHQaSWfMgCL7ji from the network, found 2 potential seed(s).
✓ Target met: 2 seed(s)
-🌱 Fetched from z6Mkux1…nVhib7Z
+🌱 Fetched from z6MkuPZ…xEuaPUp
🌱 Fetched from z6Mkt67…v4N1tRk
$ rad inspect --sigrefs
z6MknSLrJoTcukLrE435hVNQT4JUhbvWLX4kUzqkEStBU8Vi ae3c6b77dc1ed51c1c1e6a2772339c2779fa9ba8
z6Mkt67GdsW7715MEfRuP4pSZxJRJh6kj6Y48WRqVv4N1tRk dace6fe948548168a2bb687718949d9b5d9076ee
```
+
+``` ~bob
+$ rad clone rad:z42hL2jL4XNk6K8oHQaSWfMgCL7ji
+✓ Creating checkout in ./heartwood..
+✓ Remote alice@z6MknSLrJoTcukLrE435hVNQT4JUhbvWLX4kUzqkEStBU8Vi added
+✓ Remote-tracking branch alice@z6MknSLrJoTcukLrE435hVNQT4JUhbvWLX4kUzqkEStBU8Vi/master created for z6MknSL…StBU8Vi
+✓ Repository successfully cloned under [..]/heartwood/
+╭────────────────────────────────────╮
+│ heartwood │
+│ Radicle Heartwood Protocol & Stack │
+│ 0 issues · 1 patches │
+╰────────────────────────────────────╯
+Run `cd ./heartwood` to go to the repository directory.
+```
+
+``` ~bob
+$ cd ./heartwood
+$ git push rad master
+```
+
+``` ~alice
+$ rad follow did:key:z6Mkt67GdsW7715MEfRuP4pSZxJRJh6kj6Y48WRqVv4N1tRk
+✓ Follow policy updated for z6Mkt67GdsW7715MEfRuP4pSZxJRJh6kj6Y48WRqVv4N1tRk
+```
+
+``` ~alice
+$ rad id update --title "Increase threshold" --description "Increase threshold to 2" --threshold 2
+✓ Identity revision 2255c2317f3a3ba7b2f0a2322af90bc6485f7744 created
+╭────────────────────────────────────────────────────────────────────────╮
+│ Title Increase threshold │
+│ Revision 2255c2317f3a3ba7b2f0a2322af90bc6485f7744 │
+│ Blob 053541ba7b90534b35dd8718e0ceaa408979b02b │
+│ Author did:key:z6MknSLrJoTcukLrE435hVNQT4JUhbvWLX4kUzqkEStBU8Vi │
+│ State active │
+│ Quorum no │
+│ │
+│ Increase threshold to 2 │
+├────────────────────────────────────────────────────────────────────────┤
+│ ✓ did:key:z6MknSLrJoTcukLrE435hVNQT4JUhbvWLX4kUzqkEStBU8Vi alice (you) │
+│ ? did:key:z6Mkt67GdsW7715MEfRuP4pSZxJRJh6kj6Y48WRqVv4N1tRk bob │
+╰────────────────────────────────────────────────────────────────────────╯
+
+@@ -1,14 +1,14 @@
+ {
+ "payload": {
+ "xyz.radicle.project": {
+ "defaultBranch": "master",
+ "description": "Radicle Heartwood Protocol & Stack",
+ "name": "heartwood"
+ }
+ },
+ "delegates": [
+ "did:key:z6MknSLrJoTcukLrE435hVNQT4JUhbvWLX4kUzqkEStBU8Vi",
+ "did:key:z6Mkt67GdsW7715MEfRuP4pSZxJRJh6kj6Y48WRqVv4N1tRk"
+ ],
+- "threshold": 1
++ "threshold": 2
+ }
+```
+
+``` ~alice
+$ rad sync -a
+✓ Synced with 2 seed(s)
+```
+
+``` ~bob
+$ rad sync
+Fetching rad:z42hL2jL4XNk6K8oHQaSWfMgCL7ji from the network, found 2 potential seed(s).
+✓ Target met: 2 seed(s)
+🌱 Fetched from z6MknSL…StBU8Vi
+🌱 Fetched from z6MkuPZ…xEuaPUp
+✓ Nothing to announce, already in sync with 2 seed(s) (see `rad sync status`)
+$ rad id accept 2255c2317f3a3ba7b2f0a2322af90bc6485f7744
+✓ Revision 2255c2317f3a3ba7b2f0a2322af90bc6485f7744 accepted
+╭────────────────────────────────────────────────────────────────────────╮
+│ Title Increase threshold │
+│ Revision 2255c2317f3a3ba7b2f0a2322af90bc6485f7744 │
+│ Blob 053541ba7b90534b35dd8718e0ceaa408979b02b │
+│ Author did:key:z6MknSLrJoTcukLrE435hVNQT4JUhbvWLX4kUzqkEStBU8Vi │
+│ State accepted │
+│ Quorum yes │
+│ │
+│ Increase threshold to 2 │
+├────────────────────────────────────────────────────────────────────────┤
+│ ✓ did:key:z6MknSLrJoTcukLrE435hVNQT4JUhbvWLX4kUzqkEStBU8Vi alice │
+│ ✓ did:key:z6Mkt67GdsW7715MEfRuP4pSZxJRJh6kj6Y48WRqVv4N1tRk bob (you) │
+╰────────────────────────────────────────────────────────────────────────╯
+```
+
+``` ~alice
+$ git switch master
+Your branch is up to date with 'rad/master'.
+$ touch YOLO
+$ git add YOLO
+$ git commit -v -m "What it says"
+[master 359a556] What it says
+ 1 file changed, 0 insertions(+), 0 deletions(-)
+ create mode 100644 YOLO
+```
+
+``` ~alice (stderr) RAD_SOCKET=/dev/null
+$ git push rad master
+✓ Canonical head updated to 359a55668e3a5d6da510171cb248c59e9c75b360
+To rad://z42hL2jL4XNk6K8oHQaSWfMgCL7ji/z6MknSLrJoTcukLrE435hVNQT4JUhbvWLX4kUzqkEStBU8Vi
+ 3e674d1..359a556 master -> master
+```
+
+``` ~charlie
+$ rad clone rad:z42hL2jL4XNk6K8oHQaSWfMgCL7ji
+✓ Seeding policy updated for rad:z42hL2jL4XNk6K8oHQaSWfMgCL7ji with scope 'all'
+Fetching rad:z42hL2jL4XNk6K8oHQaSWfMgCL7ji from the network, found 1 potential seed(s).
+✓ Target met: 1 seed(s)
+✓ Creating checkout in ./heartwood..
+✓ Remote z6MknSLrJoTcukLrE435hVNQT4JUhbvWLX4kUzqkEStBU8Vi added
+✓ Remote-tracking branch z6MknSLrJoTcukLrE435hVNQT4JUhbvWLX4kUzqkEStBU8Vi/master created for z6MknSL…StBU8Vi
+✓ Remote z6Mkt67GdsW7715MEfRuP4pSZxJRJh6kj6Y48WRqVv4N1tRk added
+✓ Remote-tracking branch z6Mkt67GdsW7715MEfRuP4pSZxJRJh6kj6Y48WRqVv4N1tRk/master created for z6Mkt67…v4N1tRk
+✓ Repository successfully cloned under [..]/heartwood/
+╭────────────────────────────────────╮
+│ heartwood │
+│ Radicle Heartwood Protocol & Stack │
+│ 0 issues · 1 patches │
+╰────────────────────────────────────╯
+Run `cd ./heartwood` to go to the repository directory.
+```
+
+``` ~charlie
+$ cd ./heartwood
+$ git rev-parse master
+3e674d1a1df90807e934f9ae5da2591dd6848a33
+```
\ No newline at end of file
diff --git a/crates/radicle-cli/tests/commands.rs b/crates/radicle-cli/tests/commands.rs
index ee31959463..7275acd03d 100644
--- a/crates/radicle-cli/tests/commands.rs
+++ b/crates/radicle-cli/tests/commands.rs
@@ -541,6 +541,7 @@ fn rad_id_threshold() {
let mut environment = Environment::new();
let alice = environment.node(config::node("alice"));
let bob = environment.node(config::node("bob"));
+ let charlie = environment.node(config::node("charlie"));
let seed = environment.node(config::node("seed"));
let working = tempfile::tempdir().unwrap();
let working = working.path();
@@ -560,6 +561,7 @@ fn rad_id_threshold() {
let mut alice = alice.spawn();
let mut seed = seed.spawn();
let mut bob = bob.spawn();
+ let mut charlie = charlie.spawn();
seed.handle.seed(acme, Scope::All).unwrap();
alice.handle.seed(acme, Scope::Followed).unwrap();
@@ -570,6 +572,7 @@ fn rad_id_threshold() {
alice.connect(&seed).connect(&bob);
bob.connect(&seed);
+ charlie.connect(&seed);
alice.routes_to(&[(acme, seed.id)]);
seed.handle.fetch(acme, alice.id, DEFAULT_TIMEOUT).unwrap();
@@ -590,6 +593,11 @@ fn rad_id_threshold() {
working.join("seed"),
[("RAD_HOME", seed.home.path().display())],
)
+ .home(
+ "charlie",
+ working.join("charlie"),
+ [("RAD_HOME", charlie.home.path().display())],
+ )
.run()
.unwrap();
}
Exit code: 0
shell: 'cargo --version rustc --version cargo fmt --check cargo clippy --all-targets --workspace -- --deny warnings cargo build --all-targets --workspace cargo doc --workspace --no-deps cargo test --workspace --no-fail-fast '
Commands:
$ podman run --name 6178c334-7f10-4092-84bc-49e607c34bad -v /opt/radcis/ci.rad.levitte.org/cci/state/6178c334-7f10-4092-84bc-49e607c34bad/s:/6178c334-7f10-4092-84bc-49e607c34bad/s:ro -v /opt/radcis/ci.rad.levitte.org/cci/state/6178c334-7f10-4092-84bc-49e607c34bad/w:/6178c334-7f10-4092-84bc-49e607c34bad/w -w /6178c334-7f10-4092-84bc-49e607c34bad/w -v /opt/radcis/ci.rad.levitte.org/.radicle:/${id}/.radicle:ro -e RAD_HOME=/${id}/.radicle rust:trixie bash /6178c334-7f10-4092-84bc-49e607c34bad/s/script.sh
+ cargo --version
info: syncing channel updates for '1.85-x86_64-unknown-linux-gnu'
info: latest update on 2025-03-18, rust version 1.85.1 (4eb161250 2025-03-15)
info: downloading component 'cargo'
info: downloading component 'clippy'
info: downloading component 'rust-docs'
info: downloading component 'rust-src'
info: downloading component 'rust-std'
info: downloading component 'rustc'
info: downloading component 'rustfmt'
info: installing component 'cargo'
info: installing component 'clippy'
info: installing component 'rust-docs'
info: installing component 'rust-src'
info: installing component 'rust-std'
info: installing component 'rustc'
info: installing component 'rustfmt'
cargo 1.85.1 (d73d2caf9 2024-12-31)
+ rustc --version
rustc 1.85.1 (4eb161250 2025-03-15)
+ cargo fmt --check
+ cargo clippy --all-targets --workspace -- --deny warnings
Updating crates.io index
Downloading crates ...
Downloaded amplify_derive v4.0.0
Downloaded amplify v4.6.0
Downloaded aho-corasick v1.1.3
Downloaded pbkdf2 v0.12.2
Downloaded parking_lot_core v0.9.9
Downloaded ref-cast v1.0.24
Downloaded pkcs1 v0.7.5
Downloaded pkcs8 v0.10.2
Downloaded git2 v0.19.0
Downloaded shell-words v1.1.0
Downloaded ssh-encoding v0.2.0
Downloaded serde_derive_internals v0.29.1
Downloaded spki v0.7.3
Downloaded thiserror-impl v1.0.69
Downloaded streaming-iterator v0.1.9
Downloaded same-file v1.0.6
Downloaded ssh-cipher v0.2.0
Downloaded ref-cast-impl v1.0.24
Downloaded synstructure v0.13.1
Downloaded serde_derive v1.0.219
Downloaded digest v0.10.7
Downloaded cyphergraphy v0.3.0
Downloaded form_urlencoded v1.2.1
Downloaded siphasher v0.3.11
Downloaded scrypt v0.11.0
Downloaded cfg-if v1.0.0
Downloaded stable_deref_trait v1.2.0
Downloaded getrandom v0.2.15
Downloaded num v0.4.3
Downloaded multibase v0.9.1
Downloaded noise-framework v0.4.0
Downloaded normalize-line-endings v0.3.0
Downloaded gix-commitgraph v0.25.1
Downloaded num-integer v0.1.46
Downloaded opaque-debug v0.3.1
Downloaded gix-negotiate v0.17.0
Downloaded litrs v0.4.1
Downloaded utf16_iter v1.0.5
Downloaded quote v1.0.36
Downloaded cipher v0.4.4
Downloaded keccak v0.1.5
Downloaded itoa v1.0.11
Downloaded idna_adapter v1.2.0
Downloaded universal-hash v0.5.1
Downloaded gix-url v0.28.2
Downloaded inout v0.1.3
Downloaded tree-sitter-language v0.1.2
Downloaded version_check v0.9.4
Downloaded proc-macro2 v1.0.92
Downloaded jobserver v0.1.31
Downloaded utf8parse v0.2.1
Downloaded lexopt v0.3.0
Downloaded serde v1.0.219
Downloaded home v0.5.9
Downloaded localtime v1.3.1
Downloaded gix-tempfile v15.0.0
Downloaded similar v2.5.0
Downloaded group v0.13.0
Downloaded xattr v1.3.1
Downloaded lock_api v0.4.11
Downloaded litemap v0.7.5
Downloaded hmac v0.12.1
Downloaded maybe-async v0.2.10
Downloaded gix-ref v0.49.1
Downloaded icu_locid_transform_data v1.5.1
Downloaded miniz_oxide v0.8.8
Downloaded icu_normalizer_data v1.5.1
Downloaded inquire v0.7.5
Downloaded mio v0.8.11
Downloaded memchr v2.7.2
Downloaded idna v1.0.3
Downloaded hashbrown v0.14.3
Downloaded tree-sitter-python v0.23.4
Downloaded winnow v0.6.26
Downloaded regex v1.11.1
Downloaded tree-sitter-c v0.23.2
Downloaded icu_properties_data v1.5.1
Downloaded vcpkg v0.2.15
Downloaded regex-syntax v0.8.5
Downloaded syn v2.0.89
Downloaded tree-sitter-md v0.3.2
Downloaded rustix v0.38.34
Downloaded tree-sitter-rust v0.23.2
Downloaded rustix v1.0.7
Downloaded tree-sitter-bash v0.23.3
Downloaded bstr v1.9.1
Downloaded p384 v0.13.0
Downloaded syn v1.0.109
Downloaded bloomy v1.2.0
Downloaded p521 v0.13.3
Downloaded zerovec v0.10.4
Downloaded tree-sitter-ruby v0.23.1
Downloaded tree-sitter v0.24.4
Downloaded jsonschema v0.30.0
Downloaded gix-pack v0.56.0
Downloaded zerocopy v0.7.35
Downloaded icu_normalizer v1.5.0
Downloaded unicode-segmentation v1.11.0
Downloaded unicode-normalization v0.1.23
Downloaded mio v1.0.4
Downloaded jiff v0.2.1
Downloaded ssh-key v0.6.6
Downloaded regex-automata v0.4.9
Downloaded tree-sitter-typescript v0.23.2
Downloaded libc v0.2.174
Downloaded log v0.4.21
Downloaded gix-protocol v0.47.0
Downloaded sha3 v0.10.8
Downloaded emojis v0.6.4
Downloaded crossterm v0.29.0
Downloaded yansi v0.5.1
Downloaded url v2.5.4
Downloaded icu_collections v1.5.0
Downloaded tree-sitter-go v0.23.4
Downloaded num-bigint-dig v0.8.4
Downloaded cyphernet v0.5.2
Downloaded writeable v0.5.5
Downloaded indexmap v2.2.6
Downloaded num-bigint v0.4.6
Downloaded icu_locid_transform v1.5.0
Downloaded yoke v0.7.5
Downloaded write16 v1.0.0
Downloaded gix-transport v0.44.0
Downloaded uuid v1.16.0
Downloaded aes v0.8.4
Downloaded icu_properties v1.5.1
Downloaded serde_json v1.0.140
Downloaded rsa v0.9.6
Downloaded icu_provider v1.5.0
Downloaded icu_locid v1.5.0
Downloaded prodash v29.0.2
Downloaded fraction v0.15.3
Downloaded gix-odb v0.66.0
Downloaded crossterm v0.25.0
Downloaded crossbeam-channel v0.5.15
Downloaded gix-quote v0.4.15
Downloaded yoke-derive v0.7.5
Downloaded gix-revwalk v0.17.0
Downloaded num-traits v0.2.19
Downloaded p256 v0.13.2
Downloaded libm v0.2.8
Downloaded socket2 v0.5.7
Downloaded signal-hook v0.3.18
Downloaded unicode-ident v1.0.12
Downloaded linux-raw-sys v0.4.13
Downloaded derive_more-impl v2.0.1
Downloaded gix-trace v0.1.12
Downloaded gix-shallow v0.1.0
Downloaded gix-revision v0.31.1
Downloaded gix-refspec v0.27.0
Downloaded gix-packetline v0.18.4
Downloaded signals_receipts v0.2.0
Downloaded derive_more v2.0.1
Downloaded uuid-simd v0.8.0
Downloaded once_cell v1.21.3
Downloaded tar v0.4.40
Downloaded fancy-regex v0.14.0
Downloaded crypto-bigint v0.5.5
Downloaded chacha20poly1305 v0.10.1
Downloaded gix-path v0.10.15
Downloaded gix-object v0.46.1
Downloaded libgit2-sys v0.17.0+1.8.1
Downloaded unicode-width v0.1.11
Downloaded spin v0.9.8
Downloaded icu_provider_macros v1.5.0
Downloaded gix-traverse v0.43.1
Downloaded iana-time-zone v0.1.60
Downloaded io-reactor v0.5.2
Downloaded gix-diff v0.49.0
Downloaded gix-credentials v0.26.0
Downloaded zeroize v1.7.0
Downloaded tree-sitter-css v0.23.1
Downloaded tempfile v3.10.1
Downloaded gix-validate v0.9.4
Downloaded tree-sitter-html v0.23.2
Downloaded tinyvec v1.6.0
Downloaded smallvec v1.13.2
Downloaded flate2 v1.1.1
Downloaded elliptic-curve v0.13.8
Downloaded num-rational v0.4.2
Downloaded utf8_iter v1.0.4
Downloaded gix-prompt v0.9.1
Downloaded tree-sitter-json v0.24.8
Downloaded nonempty v0.9.0
Downloaded gix-features v0.39.1
Downloaded gix-actor v0.33.2
Downloaded linux-raw-sys v0.9.4
Downloaded zerovec-derive v0.10.3
Downloaded zerofrom-derive v0.1.6
Downloaded unicode-display-width v0.3.0
Downloaded netservices v0.8.0
Downloaded thiserror v2.0.12
Downloaded arc-swap v1.7.1
Downloaded gix-utils v0.1.14
Downloaded gix-sec v0.10.12
Downloaded num-iter v0.1.45
Downloaded walkdir v2.5.0
Downloaded typenum v1.17.0
Downloaded thiserror v1.0.69
Downloaded tree-sitter-highlight v0.24.4
Downloaded num-complex v0.4.6
Downloaded memmap2 v0.9.4
Downloaded sqlite3-src v0.5.1
Downloaded signal-hook-registry v1.4.5
Downloaded signal-hook-mio v0.2.4
Downloaded gix-lock v15.0.1
Downloaded gix-hashtable v0.6.0
Downloaded gix-fs v0.12.1
Downloaded nonempty v0.5.0
Downloaded gix-hash v0.15.1
Downloaded tinyvec_macros v0.1.1
Downloaded tinystr v0.7.6
Downloaded signature v1.6.4
Downloaded ecdsa v0.16.9
Downloaded ec25519 v0.1.0
Downloaded crc32fast v1.4.0
Downloaded ascii v1.1.0
Downloaded subtle v2.5.0
Downloaded gix-command v0.4.1
Downloaded snapbox v0.4.17
Downloaded phf v0.11.3
Downloaded fluent-uri v0.3.2
Downloaded diff v0.1.13
Downloaded cbc v0.1.2
Downloaded blowfish v0.9.1
Downloaded base64ct v1.6.0
Downloaded gix-config-value v0.14.12
Downloaded zerofrom v0.1.6
Downloaded timeago v0.4.2
Downloaded crossbeam-utils v0.8.19
Downloaded tree-sitter-toml-ng v0.6.0
Downloaded thiserror-impl v2.0.12
Downloaded sqlite3-sys v0.15.2
Downloaded sqlite v0.32.0
Downloaded escargot v0.5.10
Downloaded displaydoc v0.2.5
Downloaded gix-chunk v0.4.11
Downloaded vsimd v0.8.0
Downloaded data-encoding v2.5.0
Downloaded const-oid v0.9.6
Downloaded bytesize v2.0.1
Downloaded anstyle-parse v0.2.3
Downloaded amplify_num v0.5.2
Downloaded gix-date v0.9.4
Downloaded outref v0.5.2
Downloaded num-cmp v0.1.0
Downloaded newline-converter v0.3.0
Downloaded lazy_static v1.5.0
Downloaded socks5-client v0.4.1
Downloaded snapbox-macros v0.3.8
Downloaded siphasher v1.0.1
Downloaded sem_safe v0.2.0
Downloaded generic-array v0.14.7
Downloaded data-encoding-macro-internal v0.1.12
Downloaded block-buffer v0.10.4
Downloaded email_address v0.2.9
Downloaded ed25519 v1.5.3
Downloaded chrono v0.4.38
Downloaded byteorder v1.5.0
Downloaded bitflags v1.3.2
Downloaded signature v2.2.0
Downloaded salsa20 v0.10.2
Downloaded bytecount v0.6.8
Downloaded base16ct v0.2.0
Downloaded dyn-clone v1.0.17
Downloaded document-features v0.2.11
Downloaded crypto-common v0.1.6
Downloaded autocfg v1.2.0
Downloaded ctr v0.9.2
Downloaded ct-codecs v1.1.1
Downloaded scopeguard v1.2.0
Downloaded rand_core v0.6.4
Downloaded git-ref-format-core v0.3.1
Downloaded data-encoding-macro v0.1.14
Downloaded block-padding v0.3.3
Downloaded radicle-std-ext v0.1.0
Downloaded percent-encoding v2.3.1
Downloaded fastrand v2.1.0
Downloaded errno v0.3.13
Downloaded ryu v1.0.17
Downloaded libz-sys v1.1.16
Downloaded poly1305 v0.8.0
Downloaded shlex v1.3.0
Downloaded sha1_smol v1.0.0
Downloaded cypheraddr v0.4.0
Downloaded cpufeatures v0.2.12
Downloaded anyhow v1.0.82
Downloaded rfc6979 v0.4.0
Downloaded rand v0.8.5
Downloaded proc-macro-error v1.0.4
Downloaded ghash v0.5.1
Downloaded referencing v0.30.0
Downloaded radicle-surf v0.22.0
Downloaded proc-macro-error-attr v1.0.4
Downloaded pem-rfc7468 v0.7.0
Downloaded anstyle v1.0.6
Downloaded adler2 v2.0.0
Downloaded sec1 v0.7.3
Downloaded rand_chacha v0.3.1
Downloaded radicle-git-ext v0.8.1
Downloaded qcheck-macros v1.0.0
Downloaded qcheck v1.0.0
Downloaded pretty_assertions v1.4.0
Downloaded popol v3.0.0
Downloaded pkg-config v0.3.30
Downloaded phf_shared v0.11.3
Downloaded filetime v0.2.23
Downloaded faster-hex v0.9.0
Downloaded der v0.7.9
Downloaded colorchoice v1.0.0
Downloaded borrow-or-share v0.2.2
Downloaded bitflags v2.9.1
Downloaded bcrypt-pbkdf v0.10.0
Downloaded anstream v0.6.13
Downloaded aes-gcm v0.10.3
Downloaded aead v0.5.2
Downloaded sha2 v0.10.8
Downloaded schemars_derive v1.0.0-alpha.17
Downloaded schemars v1.0.0-alpha.17
Downloaded primeorder v0.13.6
Downloaded ppv-lite86 v0.2.17
Downloaded polyval v0.6.2
Downloaded git-ref-format-macro v0.3.1
Downloaded git-ref-format v0.3.1
Downloaded ff v0.13.0
Downloaded convert_case v0.7.1
Downloaded colored v2.1.0
Downloaded chacha20 v0.9.1
Downloaded cc v1.2.2
Downloaded bit-vec v0.8.0
Downloaded base64 v0.13.1
Downloaded base32 v0.4.0
Downloaded base-x v0.2.11
Downloaded anstyle-query v1.0.2
Downloaded amplify_syn v2.0.1
Downloaded either v1.11.0
Downloaded fxhash v0.2.1
Downloaded equivalent v1.0.1
Downloaded bit-set v0.8.0
Downloaded base64 v0.21.7
Downloaded ahash v0.8.11
Downloaded base64 v0.22.1
Downloaded parking_lot v0.12.3
Compiling libc v0.2.174
Compiling proc-macro2 v1.0.92
Compiling unicode-ident v1.0.12
Checking cfg-if v1.0.0
Compiling shlex v1.3.0
Compiling version_check v0.9.4
Checking memchr v2.7.2
Compiling autocfg v1.2.0
Compiling serde v1.0.219
Compiling quote v1.0.36
Checking getrandom v0.2.15
Checking smallvec v1.13.2
Checking aho-corasick v1.1.3
Compiling syn v2.0.89
Checking regex-syntax v0.8.5
Compiling jobserver v0.1.31
Compiling cc v1.2.2
Compiling typenum v1.17.0
Compiling generic-array v0.14.7
Checking regex-automata v0.4.9
Checking log v0.4.21
Checking rand_core v0.6.4
Checking fastrand v2.1.0
Compiling lock_api v0.4.11
Checking crypto-common v0.1.6
Checking bitflags v2.9.1
Compiling parking_lot_core v0.9.9
Checking scopeguard v1.2.0
Checking subtle v2.5.0
Checking stable_deref_trait v1.2.0
Compiling synstructure v0.13.1
Checking parking_lot v0.12.3
Compiling syn v1.0.109
Checking bstr v1.9.1
Checking tinyvec_macros v0.1.1
Checking once_cell v1.21.3
Checking tinyvec v1.6.0
Checking zeroize v1.7.0
Checking cpufeatures v0.2.12
Checking litemap v0.7.5
Compiling crc32fast v1.4.0
Checking unicode-normalization v0.1.23
Checking writeable v0.5.5
Compiling thiserror v2.0.12
Compiling serde_derive v1.0.219
Compiling zerofrom-derive v0.1.6
Compiling yoke-derive v0.7.5
Compiling zerovec-derive v0.10.3
Checking zerofrom v0.1.6
Checking yoke v0.7.5
Compiling displaydoc v0.2.5
Checking zerovec v0.10.4
Compiling icu_locid_transform_data v1.5.1
Compiling thiserror-impl v2.0.12
Compiling icu_provider_macros v1.5.0
Checking tinystr v0.7.6
Checking icu_locid v1.5.0
Checking block-padding v0.3.3
Compiling icu_properties_data v1.5.1
Checking icu_provider v1.5.0
Checking inout v0.1.3
Checking block-buffer v0.10.4
Checking itoa v1.0.11
Checking hashbrown v0.14.3
Compiling icu_normalizer_data v1.5.1
Compiling pkg-config v0.3.30
Checking digest v0.10.7
Checking icu_locid_transform v1.5.0
Checking cipher v0.4.4
Checking icu_collections v1.5.0
Checking write16 v1.0.0
Checking utf16_iter v1.0.5
Checking icu_properties v1.5.1
Compiling thiserror v1.0.69
Checking utf8_iter v1.0.4
Compiling thiserror-impl v1.0.69
Compiling rustix v0.38.34
Checking percent-encoding v2.3.1
Checking linux-raw-sys v0.4.13
Checking sha2 v0.10.8
Checking form_urlencoded v1.2.1
Checking universal-hash v0.5.1
Compiling vcpkg v0.2.15
Checking icu_normalizer v1.5.0
Checking opaque-debug v0.3.1
Compiling libz-sys v1.1.16
Compiling amplify_syn v2.0.1
Checking idna_adapter v1.2.0
Checking idna v1.0.3
Compiling data-encoding v2.5.0
Checking url v2.5.4
Checking gix-trace v0.1.12
Checking byteorder v1.5.0
Compiling amplify_derive v4.0.0
Checking tempfile v3.10.1
Checking signature v1.6.4
Checking amplify_num v0.5.2
Compiling data-encoding-macro-internal v0.1.12
Checking ascii v1.1.0
Checking data-encoding-macro v0.1.14
Checking ed25519 v1.5.3
Compiling libgit2-sys v0.17.0+1.8.1
Checking faster-hex v0.9.0
Checking aead v0.5.2
Compiling num-traits v0.2.19
Compiling proc-macro-error-attr v1.0.4
Checking base-x v0.2.11
Checking ct-codecs v1.1.1
Checking multibase v0.9.1
Checking ec25519 v0.1.0
Checking poly1305 v0.8.0
Checking chacha20 v0.9.1
Checking gix-utils v0.1.14
Compiling proc-macro-error v1.0.4
Checking adler2 v2.0.0
Checking miniz_oxide v0.8.8
Checking amplify v4.6.0
Checking cyphergraphy v0.3.0
Checking gix-hash v0.15.1
Checking same-file v1.0.6
Compiling crossbeam-utils v0.8.19
Checking keccak v0.1.5
Checking flate2 v1.1.1
Checking sha3 v0.10.8
Checking walkdir v2.5.0
Compiling git-ref-format-core v0.3.1
Checking polyval v0.6.2
Compiling sqlite3-src v0.5.1
Checking hmac v0.12.1
Checking prodash v29.0.2
Checking base32 v0.4.0
Compiling serde_json v1.0.140
Checking ppv-lite86 v0.2.17
Checking base64ct v1.6.0
Checking equivalent v1.0.1
Checking sha1_smol v1.0.0
Checking rand_chacha v0.3.1
Checking gix-features v0.39.1
Checking pem-rfc7468 v0.7.0
Checking indexmap v2.2.6
Checking cypheraddr v0.4.0
Compiling git-ref-format-macro v0.3.1
Checking pbkdf2 v0.12.2
Checking ghash v0.5.1
Checking chacha20poly1305 v0.10.1
Checking aes v0.8.4
Checking ctr v0.9.2
Checking ryu v1.0.17
Checking aes-gcm v0.10.3
Checking git-ref-format v0.3.1
Checking noise-framework v0.4.0
Checking crossbeam-channel v0.5.15
Checking socks5-client v0.4.1
Checking ssh-encoding v0.2.0
Checking rand v0.8.5
Checking blowfish v0.9.1
Checking cbc v0.1.2
Compiling ref-cast v1.0.24
Checking radicle-std-ext v0.1.0
Checking home v0.5.9
Checking gix-path v0.10.15
Checking ssh-cipher v0.2.0
Checking bcrypt-pbkdf v0.10.0
Checking cyphernet v0.5.2
Compiling ref-cast-impl v1.0.24
Checking signature v2.2.0
Checking ssh-key v0.6.6
Checking qcheck v1.0.0
Checking radicle-ssh v0.9.0 (/6178c334-7f10-4092-84bc-49e607c34bad/w/crates/radicle-ssh)
Checking dyn-clone v1.0.17
Checking lazy_static v1.5.0
Checking siphasher v1.0.1
Checking nonempty v0.9.0
Compiling serde_derive_internals v0.29.1
Checking radicle-dag v0.10.0 (/6178c334-7f10-4092-84bc-49e607c34bad/w/crates/radicle-dag)
Checking tree-sitter-language v0.1.2
Checking iana-time-zone v0.1.60
Checking jiff v0.2.1
Compiling schemars_derive v1.0.0-alpha.17
Checking schemars v1.0.0-alpha.17
Checking chrono v0.4.38
Checking gix-date v0.9.4
Checking colored v2.1.0
Checking localtime v1.3.1
Checking bytesize v2.0.1
Checking winnow v0.6.26
Compiling anyhow v1.0.82
Checking base64 v0.21.7
Checking gix-hashtable v0.6.0
Checking gix-validate v0.9.4
Checking anstyle-query v1.0.2
Checking memmap2 v0.9.4
Checking gix-chunk v0.4.11
Checking errno v0.3.13
Checking sem_safe v0.2.0
Checking signals_receipts v0.2.0
Checking gix-actor v0.33.2
Checking gix-commitgraph v0.25.1
Checking gix-object v0.46.1
Compiling signal-hook v0.3.18
Checking gix-fs v0.12.1
Checking signal-hook-registry v1.4.5
Checking gix-revwalk v0.17.0
Checking gix-tempfile v15.0.0
Checking radicle-signals v0.11.0 (/6178c334-7f10-4092-84bc-49e607c34bad/w/crates/radicle-signals)
Checking mio v0.8.11
Checking mio v1.0.4
Compiling tree-sitter v0.24.4
Compiling unicode-segmentation v1.11.0
Compiling convert_case v0.7.1
Checking signal-hook-mio v0.2.4
Checking regex v1.11.1
Compiling rustix v1.0.7
Checking shell-words v1.1.0
Checking gix-command v0.4.1
Compiling xattr v1.3.1
Compiling derive_more-impl v2.0.1
Compiling filetime v0.2.23
Checking linux-raw-sys v0.9.4
Checking bitflags v1.3.2
Checking lexopt v0.3.0
Compiling litrs v0.4.1
Checking utf8parse v0.2.1
Checking anstyle-parse v0.2.3
Checking derive_more v2.0.1
Checking crossterm v0.25.0
Compiling document-features v0.2.11
Compiling tar v0.4.40
Checking newline-converter v0.3.0
Checking gix-lock v15.0.1
Checking gix-config-value v0.14.12
Checking gix-url v0.28.2
Checking gix-quote v0.4.15
Checking fxhash v0.2.1
Checking gix-sec v0.10.12
Checking streaming-iterator v0.1.9
Checking colorchoice v1.0.0
Checking unicode-width v0.1.11
Checking anstyle v1.0.6
Checking inquire v0.7.5
Checking anstream v0.6.13
Checking gix-prompt v0.9.1
Compiling radicle-surf v0.22.0
Checking crossterm v0.29.0
Checking unicode-display-width v0.3.0
Checking gix-revision v0.31.1
Checking gix-traverse v0.43.1
Checking gix-diff v0.49.0
Checking gix-packetline v0.18.4
Compiling tree-sitter-css v0.23.1
Compiling tree-sitter-toml-ng v0.6.0
Compiling tree-sitter-ruby v0.23.1
Compiling tree-sitter-md v0.3.2
Compiling tree-sitter-c v0.23.2
Compiling tree-sitter-typescript v0.23.2
Compiling tree-sitter-json v0.24.8
Compiling tree-sitter-rust v0.23.2
Compiling tree-sitter-html v0.23.2
Compiling tree-sitter-bash v0.23.3
Compiling tree-sitter-python v0.23.4
Compiling tree-sitter-go v0.23.4
Checking sqlite3-sys v0.15.2
Checking sqlite v0.32.0
Checking gix-transport v0.44.0
Checking gix-pack v0.56.0
Checking gix-refspec v0.27.0
Checking gix-credentials v0.26.0
Checking snapbox-macros v0.3.8
Checking gix-shallow v0.1.0
Checking gix-ref v0.49.1
Checking gix-negotiate v0.17.0
Compiling maybe-async v0.2.10
Checking similar v2.5.0
Checking arc-swap v1.7.1
Compiling radicle-cli v0.13.0 (/6178c334-7f10-4092-84bc-49e607c34bad/w/crates/radicle-cli)
Checking normalize-line-endings v0.3.0
Checking base64 v0.13.1
Checking nonempty v0.5.0
Checking gix-protocol v0.47.0
Checking snapbox v0.4.17
Checking gix-odb v0.66.0
Checking tree-sitter-highlight v0.24.4
Checking popol v3.0.0
Checking timeago v0.4.2
Checking either v1.11.0
Checking io-reactor v0.5.2
Checking salsa20 v0.10.2
Checking socket2 v0.5.7
Compiling radicle-node v0.11.0 (/6178c334-7f10-4092-84bc-49e607c34bad/w/crates/radicle-node)
Checking yansi v0.5.1
Checking diff v0.1.13
Checking siphasher v0.3.11
Checking pretty_assertions v1.4.0
Checking netservices v0.8.0
Checking scrypt v0.11.0
Checking bloomy v1.2.0
Checking num-integer v0.1.46
Checking radicle-systemd v0.9.0 (/6178c334-7f10-4092-84bc-49e607c34bad/w/crates/radicle-systemd)
Compiling escargot v0.5.10
Compiling qcheck-macros v1.0.0
Checking num-bigint v0.4.6
Compiling ahash v0.8.11
Compiling radicle-remote-helper v0.10.0 (/6178c334-7f10-4092-84bc-49e607c34bad/w/crates/radicle-remote-helper)
Checking num-iter v0.1.45
Checking num-complex v0.4.6
Checking num-rational v0.4.2
Checking zerocopy v0.7.35
Checking bit-vec v0.8.0
Checking borrow-or-share v0.2.2
Checking fluent-uri v0.3.2
Checking bit-set v0.8.0
Checking num v0.4.3
Checking phf_shared v0.11.3
Checking outref v0.5.2
Checking vsimd v0.8.0
Checking uuid v1.16.0
Checking referencing v0.30.0
Checking phf v0.11.3
Checking uuid-simd v0.8.0
Checking fraction v0.15.3
Checking fancy-regex v0.14.0
Checking email_address v0.2.9
Checking num-cmp v0.1.0
Checking bytecount v0.6.8
Checking base64 v0.22.1
Checking emojis v0.6.4
Checking jsonschema v0.30.0
Checking git2 v0.19.0
Checking radicle-git-ext v0.8.1
Checking radicle-term v0.12.0 (/6178c334-7f10-4092-84bc-49e607c34bad/w/crates/radicle-term)
Checking radicle-crypto v0.12.0 (/6178c334-7f10-4092-84bc-49e607c34bad/w/crates/radicle-crypto)
Checking radicle-cob v0.14.0 (/6178c334-7f10-4092-84bc-49e607c34bad/w/crates/radicle-cob)
Checking radicle v0.15.0 (/6178c334-7f10-4092-84bc-49e607c34bad/w/crates/radicle)
Checking radicle-fetch v0.11.0 (/6178c334-7f10-4092-84bc-49e607c34bad/w/crates/radicle-fetch)
Checking radicle-cli-test v0.11.0 (/6178c334-7f10-4092-84bc-49e607c34bad/w/crates/radicle-cli-test)
Checking radicle-schemars v0.1.0 (/6178c334-7f10-4092-84bc-49e607c34bad/w/crates/radicle-schemars)
Finished `dev` profile [unoptimized + debuginfo] target(s) in 46.26s
+ cargo build --all-targets --workspace
Compiling cfg-if v1.0.0
Compiling libc v0.2.174
Compiling shlex v1.3.0
Compiling memchr v2.7.2
Compiling serde v1.0.219
Compiling smallvec v1.13.2
Compiling regex-syntax v0.8.5
Compiling jobserver v0.1.31
Compiling getrandom v0.2.15
Compiling cc v1.2.2
Compiling aho-corasick v1.1.3
Compiling regex-automata v0.4.9
Compiling typenum v1.17.0
Compiling log v0.4.21
Compiling generic-array v0.14.7
Compiling rand_core v0.6.4
Compiling bitflags v2.9.1
Compiling crypto-common v0.1.6
Compiling fastrand v2.1.0
Compiling scopeguard v1.2.0
Compiling lock_api v0.4.11
Compiling zerofrom v0.1.6
Compiling parking_lot_core v0.9.9
Compiling subtle v2.5.0
Compiling stable_deref_trait v1.2.0
Compiling tinyvec_macros v0.1.1
Compiling yoke v0.7.5
Compiling parking_lot v0.12.3
Compiling once_cell v1.21.3
Compiling zerovec v0.10.4
Compiling tinyvec v1.6.0
Compiling zeroize v1.7.0
Compiling cpufeatures v0.2.12
Compiling writeable v0.5.5
Compiling litemap v0.7.5
Compiling unicode-normalization v0.1.23
Compiling tinystr v0.7.6
Compiling bstr v1.9.1
Compiling icu_locid v1.5.0
Compiling block-padding v0.3.3
Compiling thiserror v2.0.12
Compiling icu_provider v1.5.0
Compiling inout v0.1.3
Compiling icu_locid_transform_data v1.5.1
Compiling block-buffer v0.10.4
Compiling hashbrown v0.14.3
Compiling adler2 v2.0.0
Compiling itoa v1.0.11
Compiling miniz_oxide v0.8.8
Compiling digest v0.10.7
Compiling icu_locid_transform v1.5.0
Compiling cipher v0.4.4
Compiling icu_properties_data v1.5.1
Compiling crc32fast v1.4.0
Compiling icu_collections v1.5.0
Compiling icu_normalizer_data v1.5.1
Compiling write16 v1.0.0
Compiling utf16_iter v1.0.5
Compiling icu_properties v1.5.1
Compiling utf8_iter v1.0.4
Compiling percent-encoding v2.3.1
Compiling linux-raw-sys v0.4.13
Compiling thiserror v1.0.69
Compiling sha2 v0.10.8
Compiling rustix v0.38.34
Compiling form_urlencoded v1.2.1
Compiling universal-hash v0.5.1
Compiling opaque-debug v0.3.1
Compiling libz-sys v1.1.16
Compiling byteorder v1.5.0
Compiling gix-trace v0.1.12
Compiling amplify_num v0.5.2
Compiling ascii v1.1.0
Compiling icu_normalizer v1.5.0
Compiling idna_adapter v1.2.0
Compiling idna v1.0.3
Compiling tempfile v3.10.1
Compiling url v2.5.4
Compiling signature v1.6.4
Compiling data-encoding v2.5.0
Compiling ed25519 v1.5.3
Compiling amplify v4.6.0
Compiling libgit2-sys v0.17.0+1.8.1
Compiling data-encoding-macro v0.1.14
Compiling aead v0.5.2
Compiling faster-hex v0.9.0
Compiling base-x v0.2.11
Compiling ct-codecs v1.1.1
Compiling multibase v0.9.1
Compiling ec25519 v0.1.0
Compiling poly1305 v0.8.0
Compiling chacha20 v0.9.1
Compiling gix-utils v0.1.14
Compiling cyphergraphy v0.3.0
Compiling num-traits v0.2.19
Compiling gix-hash v0.15.1
Compiling keccak v0.1.5
Compiling same-file v1.0.6
Compiling sha3 v0.10.8
Compiling walkdir v2.5.0
Compiling polyval v0.6.2
Compiling git-ref-format-core v0.3.1
Compiling flate2 v1.1.1
Compiling hmac v0.12.1
Compiling sqlite3-src v0.5.1
Compiling prodash v29.0.2
Compiling equivalent v1.0.1
Compiling base64ct v1.6.0
Compiling base32 v0.4.0
Compiling ppv-lite86 v0.2.17
Compiling sha1_smol v1.0.0
Compiling gix-features v0.39.1
Compiling rand_chacha v0.3.1
Compiling pem-rfc7468 v0.7.0
Compiling cypheraddr v0.4.0
Compiling indexmap v2.2.6
Compiling git-ref-format-macro v0.3.1
Compiling pbkdf2 v0.12.2
Compiling ghash v0.5.1
Compiling crossbeam-utils v0.8.19
Compiling chacha20poly1305 v0.10.1
Compiling ctr v0.9.2
Compiling aes v0.8.4
Compiling ryu v1.0.17
Compiling serde_json v1.0.140
Compiling aes-gcm v0.10.3
Compiling git-ref-format v0.3.1
Compiling crossbeam-channel v0.5.15
Compiling noise-framework v0.4.0
Compiling socks5-client v0.4.1
Compiling rand v0.8.5
Compiling ssh-encoding v0.2.0
Compiling blowfish v0.9.1
Compiling cbc v0.1.2
Compiling home v0.5.9
Compiling radicle-std-ext v0.1.0
Compiling gix-path v0.10.15
Compiling ssh-cipher v0.2.0
Compiling bcrypt-pbkdf v0.10.0
Compiling cyphernet v0.5.2
Compiling signature v2.2.0
Compiling ssh-key v0.6.6
Compiling ref-cast v1.0.24
Compiling qcheck v1.0.0
Compiling radicle-ssh v0.9.0 (/6178c334-7f10-4092-84bc-49e607c34bad/w/crates/radicle-ssh)
Compiling dyn-clone v1.0.17
Compiling lazy_static v1.5.0
Compiling siphasher v1.0.1
Compiling radicle-dag v0.10.0 (/6178c334-7f10-4092-84bc-49e607c34bad/w/crates/radicle-dag)
Compiling nonempty v0.9.0
Compiling tree-sitter-language v0.1.2
Compiling jiff v0.2.1
Compiling iana-time-zone v0.1.60
Compiling chrono v0.4.38
Compiling schemars v1.0.0-alpha.17
Compiling gix-date v0.9.4
Compiling colored v2.1.0
Compiling localtime v1.3.1
Compiling bytesize v2.0.1
Compiling winnow v0.6.26
Compiling base64 v0.21.7
Compiling gix-hashtable v0.6.0
Compiling gix-actor v0.33.2
Compiling gix-validate v0.9.4
Compiling anstyle-query v1.0.2
Compiling gix-object v0.46.1
Compiling memmap2 v0.9.4
Compiling anyhow v1.0.82
Compiling gix-chunk v0.4.11
Compiling errno v0.3.13
Compiling sem_safe v0.2.0
Compiling unicode-segmentation v1.11.0
Compiling signals_receipts v0.2.0
Compiling gix-commitgraph v0.25.1
Compiling gix-revwalk v0.17.0
Compiling gix-fs v0.12.1
Compiling signal-hook-registry v1.4.5
Compiling gix-tempfile v15.0.0
Compiling signal-hook v0.3.18
Compiling radicle-signals v0.11.0 (/6178c334-7f10-4092-84bc-49e607c34bad/w/crates/radicle-signals)
Compiling mio v0.8.11
Compiling mio v1.0.4
Compiling tree-sitter v0.24.4
Compiling signal-hook-mio v0.2.4
Compiling convert_case v0.7.1
Compiling regex v1.11.1
Compiling shell-words v1.1.0
Compiling gix-command v0.4.1
Compiling derive_more-impl v2.0.1
Compiling xattr v1.3.1
Compiling filetime v0.2.23
Compiling lexopt v0.3.0
Compiling utf8parse v0.2.1
Compiling linux-raw-sys v0.9.4
Compiling bitflags v1.3.2
Compiling crossterm v0.25.0
Compiling rustix v1.0.7
Compiling derive_more v2.0.1
Compiling anstyle-parse v0.2.3
Compiling tar v0.4.40
Compiling gix-lock v15.0.1
Compiling newline-converter v0.3.0
Compiling gix-config-value v0.14.12
Compiling gix-url v0.28.2
Compiling gix-quote v0.4.15
Compiling fxhash v0.2.1
Compiling sqlite3-sys v0.15.2
Compiling sqlite v0.32.0
Compiling gix-sec v0.10.12
Compiling anstyle v1.0.6
Compiling colorchoice v1.0.0
Compiling streaming-iterator v0.1.9
Compiling unicode-width v0.1.11
Compiling anstream v0.6.13
Compiling inquire v0.7.5
Compiling radicle-surf v0.22.0
Compiling gix-prompt v0.9.1
Compiling crossterm v0.29.0
Compiling gix-revision v0.31.1
Compiling gix-traverse v0.43.1
Compiling unicode-display-width v0.3.0
Compiling gix-diff v0.49.0
Compiling gix-packetline v0.18.4
Compiling tree-sitter-toml-ng v0.6.0
Compiling tree-sitter-bash v0.23.3
Compiling tree-sitter-json v0.24.8
Compiling tree-sitter-python v0.23.4
Compiling tree-sitter-typescript v0.23.2
Compiling tree-sitter-css v0.23.1
Compiling tree-sitter-md v0.3.2
Compiling tree-sitter-rust v0.23.2
Compiling tree-sitter-c v0.23.2
Compiling tree-sitter-go v0.23.4
Compiling tree-sitter-ruby v0.23.1
Compiling tree-sitter-html v0.23.2
Compiling gix-transport v0.44.0
Compiling gix-pack v0.56.0
Compiling gix-refspec v0.27.0
Compiling gix-credentials v0.26.0
Compiling snapbox-macros v0.3.8
Compiling gix-ref v0.49.1
Compiling gix-shallow v0.1.0
Compiling gix-negotiate v0.17.0
Compiling base64 v0.13.1
Compiling similar v2.5.0
Compiling nonempty v0.5.0
Compiling arc-swap v1.7.1
Compiling normalize-line-endings v0.3.0
Compiling radicle-cli v0.13.0 (/6178c334-7f10-4092-84bc-49e607c34bad/w/crates/radicle-cli)
Compiling snapbox v0.4.17
Compiling gix-odb v0.66.0
Compiling gix-protocol v0.47.0
Compiling tree-sitter-highlight v0.24.4
Compiling popol v3.0.0
Compiling either v1.11.0
Compiling timeago v0.4.2
Compiling io-reactor v0.5.2
Compiling salsa20 v0.10.2
Compiling socket2 v0.5.7
Compiling radicle-node v0.11.0 (/6178c334-7f10-4092-84bc-49e607c34bad/w/crates/radicle-node)
Compiling siphasher v0.3.11
Compiling yansi v0.5.1
Compiling diff v0.1.13
Compiling bloomy v1.2.0
Compiling pretty_assertions v1.4.0
Compiling netservices v0.8.0
Compiling scrypt v0.11.0
Compiling num-integer v0.1.46
Compiling radicle-systemd v0.9.0 (/6178c334-7f10-4092-84bc-49e607c34bad/w/crates/radicle-systemd)
Compiling escargot v0.5.10
Compiling num-bigint v0.4.6
Compiling radicle-remote-helper v0.10.0 (/6178c334-7f10-4092-84bc-49e607c34bad/w/crates/radicle-remote-helper)
Compiling num-iter v0.1.45
Compiling num-complex v0.4.6
Compiling num-rational v0.4.2
Compiling borrow-or-share v0.2.2
Compiling bit-vec v0.8.0
Compiling zerocopy v0.7.35
Compiling bit-set v0.8.0
Compiling num v0.4.3
Compiling fluent-uri v0.3.2
Compiling phf_shared v0.11.3
Compiling ahash v0.8.11
Compiling outref v0.5.2
Compiling vsimd v0.8.0
Compiling uuid v1.16.0
Compiling uuid-simd v0.8.0
Compiling referencing v0.30.0
Compiling phf v0.11.3
Compiling fraction v0.15.3
Compiling fancy-regex v0.14.0
Compiling email_address v0.2.9
Compiling bytecount v0.6.8
Compiling num-cmp v0.1.0
Compiling base64 v0.22.1
Compiling jsonschema v0.30.0
Compiling emojis v0.6.4
Compiling git2 v0.19.0
Compiling radicle-git-ext v0.8.1
Compiling radicle-term v0.12.0 (/6178c334-7f10-4092-84bc-49e607c34bad/w/crates/radicle-term)
Compiling radicle-crypto v0.12.0 (/6178c334-7f10-4092-84bc-49e607c34bad/w/crates/radicle-crypto)
Compiling radicle-cob v0.14.0 (/6178c334-7f10-4092-84bc-49e607c34bad/w/crates/radicle-cob)
Compiling radicle v0.15.0 (/6178c334-7f10-4092-84bc-49e607c34bad/w/crates/radicle)
Compiling radicle-fetch v0.11.0 (/6178c334-7f10-4092-84bc-49e607c34bad/w/crates/radicle-fetch)
Compiling radicle-cli-test v0.11.0 (/6178c334-7f10-4092-84bc-49e607c34bad/w/crates/radicle-cli-test)
Compiling radicle-schemars v0.1.0 (/6178c334-7f10-4092-84bc-49e607c34bad/w/crates/radicle-schemars)
Finished `dev` profile [unoptimized + debuginfo] target(s) in 1m 06s
+ cargo doc --workspace --no-deps
Checking regex-automata v0.4.9
Compiling syn v1.0.109
Checking idna v1.0.3
Checking radicle-ssh v0.9.0 (/6178c334-7f10-4092-84bc-49e607c34bad/w/crates/radicle-ssh)
Compiling num-traits v0.2.19
Checking url v2.5.4
Checking git2 v0.19.0
Checking radicle-dag v0.10.0 (/6178c334-7f10-4092-84bc-49e607c34bad/w/crates/radicle-dag)
Checking chrono v0.4.38
Compiling amplify_syn v2.0.1
Checking bstr v1.9.1
Compiling proc-macro-error v1.0.4
Checking radicle-signals v0.11.0 (/6178c334-7f10-4092-84bc-49e607c34bad/w/crates/radicle-signals)
Compiling amplify_derive v4.0.0
Compiling data-encoding-macro-internal v0.1.12
Checking gix-path v0.10.15
Compiling git-ref-format-macro v0.3.1
Checking git-ref-format-core v0.3.1
Checking gix-date v0.9.4
Checking gix-actor v0.33.2
Checking data-encoding-macro v0.1.14
Checking multibase v0.9.1
Checking gix-validate v0.9.4
Checking gix-object v0.46.1
Checking gix-commitgraph v0.25.1
Checking git-ref-format v0.3.1
Checking radicle-git-ext v0.8.1
Checking regex v1.11.1
Checking gix-command v0.4.1
Compiling radicle-cli v0.13.0 (/6178c334-7f10-4092-84bc-49e607c34bad/w/crates/radicle-cli)
Checking radicle-surf v0.22.0
Checking tree-sitter v0.24.4
Checking gix-revwalk v0.17.0
Checking radicle-term v0.12.0 (/6178c334-7f10-4092-84bc-49e607c34bad/w/crates/radicle-term)
Checking tree-sitter-toml-ng v0.6.0
Checking tree-sitter-highlight v0.24.4
Checking gix-url v0.28.2
Checking gix-config-value v0.14.12
Checking gix-quote v0.4.15
Checking gix-traverse v0.43.1
Checking gix-revision v0.31.1
Checking amplify v4.6.0
Checking gix-prompt v0.9.1
Checking gix-diff v0.49.0
Checking gix-packetline v0.18.4
Checking gix-refspec v0.27.0
Checking cyphergraphy v0.3.0
Checking gix-pack v0.56.0
Checking gix-transport v0.44.0
Checking gix-credentials v0.26.0
Checking cypheraddr v0.4.0
Checking noise-framework v0.4.0
Checking gix-shallow v0.1.0
Checking socks5-client v0.4.1
Checking gix-ref v0.49.1
Checking gix-negotiate v0.17.0
Checking cyphernet v0.5.2
Checking radicle-crypto v0.12.0 (/6178c334-7f10-4092-84bc-49e607c34bad/w/crates/radicle-crypto)
Checking io-reactor v0.5.2
Compiling radicle-node v0.11.0 (/6178c334-7f10-4092-84bc-49e607c34bad/w/crates/radicle-node)
Checking gix-odb v0.66.0
Checking radicle-cob v0.14.0 (/6178c334-7f10-4092-84bc-49e607c34bad/w/crates/radicle-cob)
Checking netservices v0.8.0
Checking gix-protocol v0.47.0
Checking radicle-systemd v0.9.0 (/6178c334-7f10-4092-84bc-49e607c34bad/w/crates/radicle-systemd)
Documenting radicle-cob v0.14.0 (/6178c334-7f10-4092-84bc-49e607c34bad/w/crates/radicle-cob)
Documenting radicle-crypto v0.12.0 (/6178c334-7f10-4092-84bc-49e607c34bad/w/crates/radicle-crypto)
Checking radicle v0.15.0 (/6178c334-7f10-4092-84bc-49e607c34bad/w/crates/radicle)
Documenting radicle v0.15.0 (/6178c334-7f10-4092-84bc-49e607c34bad/w/crates/radicle)
Documenting radicle-term v0.12.0 (/6178c334-7f10-4092-84bc-49e607c34bad/w/crates/radicle-term)
Documenting radicle-signals v0.11.0 (/6178c334-7f10-4092-84bc-49e607c34bad/w/crates/radicle-signals)
Documenting radicle-ssh v0.9.0 (/6178c334-7f10-4092-84bc-49e607c34bad/w/crates/radicle-ssh)
Documenting radicle-dag v0.10.0 (/6178c334-7f10-4092-84bc-49e607c34bad/w/crates/radicle-dag)
Documenting radicle-systemd v0.9.0 (/6178c334-7f10-4092-84bc-49e607c34bad/w/crates/radicle-systemd)
Documenting radicle-cli v0.13.0 (/6178c334-7f10-4092-84bc-49e607c34bad/w/crates/radicle-cli)
Checking radicle-fetch v0.11.0 (/6178c334-7f10-4092-84bc-49e607c34bad/w/crates/radicle-fetch)
Documenting radicle-schemars v0.1.0 (/6178c334-7f10-4092-84bc-49e607c34bad/w/crates/radicle-schemars)
Documenting radicle-node v0.11.0 (/6178c334-7f10-4092-84bc-49e607c34bad/w/crates/radicle-node)
Documenting radicle-fetch v0.11.0 (/6178c334-7f10-4092-84bc-49e607c34bad/w/crates/radicle-fetch)
Documenting radicle-cli-test v0.11.0 (/6178c334-7f10-4092-84bc-49e607c34bad/w/crates/radicle-cli-test)
Documenting radicle-remote-helper v0.10.0 (/6178c334-7f10-4092-84bc-49e607c34bad/w/crates/radicle-remote-helper)
Checking radicle-remote-helper v0.10.0 (/6178c334-7f10-4092-84bc-49e607c34bad/w/crates/radicle-remote-helper)
Finished `dev` profile [unoptimized + debuginfo] target(s) in 11.35s
Generated /6178c334-7f10-4092-84bc-49e607c34bad/w/target/doc/radicle/index.html and 15 other files
+ cargo test --workspace --no-fail-fast
Finished `test` profile [unoptimized + debuginfo] target(s) in 0.13s
Running unittests src/lib.rs (target/debug/deps/radicle-f7aabfdef0ad0fc0)
running 188 tests
test canonical::formatter::test::ascii_control_characters ... ok
test canonical::formatter::test::ordered_nested_object ... ok
test canonical::formatter::test::securesystemslib_asserts ... ok
test cob::cache::migrations::_2::tests::test_migration_2 ... ok
test cob::common::test::test_color ... ok
test cob::cache::tests::test_check_version ... ok
test cob::cache::tests::test_migrate_to ... ok
test cob::common::test::test_emojis ... ok
test cob::cache::migrations::_2::tests::test_patch_json_deserialization ... ok
test cob::identity::test::prop_json_eq_str ... ok
test cob::identity::test::test_identity_remove_delegate_concurrent ... ok
test cob::identity::test::test_identity_redact_revision ... ok
test cob::identity::test::test_identity_reject_concurrent ... ok
test cob::identity::test::test_identity_update_rejected ... ok
test cob::identity::test::test_identity_updates ... ok
test cob::issue::cache::tests::test_counts ... ok
test cob::issue::cache::tests::test_get ... ok
test cob::issue::cache::tests::test_is_empty ... ok
test cob::issue::cache::tests::test_list ... ok
test cob::issue::cache::tests::test_list_by_status ... ok
test cob::issue::cache::tests::test_remove ... ok
test cob::identity::test::test_valid_identity ... ok
test cob::identity::test::test_identity_updates_concurrent ... ok
test cob::issue::test::test_embeds ... ok
test cob::issue::test::test_embeds_edit ... ok
test cob::identity::test::test_identity_updates_concurrent_outdated ... ok
test cob::issue::test::test_invalid_actions ... ok
test cob::issue::test::test_invalid_cob ... ok
test cob::issue::test::test_invalid_tx ... ok
test cob::issue::test::test_invalid_tx_reference ... ok
test cob::issue::test::test_issue_all ... ok
test cob::issue::test::test_concurrency ... ok
test cob::issue::test::test_issue_comment ... ok
test cob::issue::test::test_issue_comment_redact ... ok
test cob::issue::test::test_issue_create_and_assign ... ok
test cob::issue::test::test_issue_create_and_get ... ok
test cob::issue::test::test_issue_create_and_change_state ... ok
test cob::issue::test::test_issue_create_and_unassign ... ok
test cob::issue::test::test_issue_create_and_reassign ... ok
test cob::issue::test::test_issue_edit_description ... ok
test cob::issue::test::test_issue_edit ... ok
test cob::issue::test::test_issue_multilines ... ok
test cob::issue::test::test_issue_state_serde ... ok
test cob::issue::test::test_ordering ... ok
test cob::issue::test::test_issue_label ... ok
test cob::issue::test::test_issue_react ... ok
test cob::patch::cache::tests::test_get ... ok
test cob::patch::cache::tests::test_is_empty ... ok
test cob::issue::test::test_issue_reply ... ok
test cob::patch::cache::tests::test_list_by_status ... ok
test cob::patch::cache::tests::test_list ... ok
test cob::patch::test::test_json ... ok
test cob::patch::test::test_json_serialization ... ok
test cob::patch::cache::tests::test_remove ... ok
test cob::patch::test::test_patch_create_and_get ... ok
test cob::patch::test::test_patch_discussion ... ok
test cob::patch::test::test_patch_merge ... ok
test cob::patch::cache::tests::test_counts ... ok
test cob::patch::test::test_patch_review_comment ... ok
test cob::patch::test::test_patch_review ... ok
test cob::patch::test::test_patch_redact ... ok
test cob::patch::test::test_patch_review_edit ... ok
test cob::patch::test::test_patch_review_duplicate ... ok
test cob::patch::test::test_patch_review_edit_comment ... ok
test cob::patch::test::test_patch_review_remove_summary ... ok
test cob::patch::test::test_reactions_json_serialization ... ok
test cob::patch::test::test_revision_edit_redact ... ok
test cob::patch::test::test_revision_reaction ... ok
test cob::patch::test::test_revision_review_merge_redacted ... ok
test cob::patch::test::test_patch_review_revision_redact ... ok
test cob::thread::tests::test_comment_edit_missing ... ok
test cob::thread::tests::test_comment_edit_redacted ... ok
test cob::thread::tests::test_comment_redact_missing ... ok
test cob::thread::tests::test_duplicate_comments ... ok
test cob::thread::tests::test_edit_comment ... ok
test cob::thread::tests::test_redact_comment ... ok
test cob::patch::cache::tests::test_find_by_revision ... ok
test cob::thread::tests::test_timeline ... ok
test git::canonical::tests::test_quorum_merges ... ok
test cob::patch::test::test_patch_update ... ok
test git::test::test_version_from_str ... ok
test git::test::test_version_ord ... ok
test identity::did::test::test_did_encode_decode ... ok
test identity::did::test::test_did_vectors ... ok
test identity::doc::id::test::prop_from_str ... ok
test git::canonical::tests::test_quorum ... ok
test identity::doc::test::test_canonical_doc ... ok
test identity::doc::test::test_canonical_example ... ok
test identity::doc::test::test_duplicate_dids ... ok
test identity::doc::test::test_future_version_error ... ok
test identity::doc::test::test_is_valid_version ... ok
test identity::doc::test::test_max_delegates ... ok
test identity::doc::test::test_not_found ... ok
test identity::doc::test::test_parse_version ... ok
test identity::doc::test::test_visibility_json ... ok
test identity::project::test::test_project_name ... ok
test node::address::store::test::test_alias ... ok
test node::address::store::test::test_disconnected ... ok
test node::address::store::test::test_disconnected_ban ... ok
test node::address::store::test::test_empty ... ok
test node::address::store::test::test_entries ... ok
test node::address::store::test::test_get_none ... ok
test node::address::store::test::test_insert_and_get ... ok
test node::address::store::test::test_insert_and_remove ... ok
test node::address::store::test::test_insert_and_update ... ok
test node::address::store::test::test_insert_duplicate ... ok
test node::address::store::test::test_node_aliases ... ok
test node::address::store::test::test_remove_nothing ... ok
test git::canonical::tests::test_quorum_properties ... ok
test node::features::test::test_operations ... ok
test node::notifications::store::test::test_branch_notifications ... ok
test node::notifications::store::test::test_clear ... ok
test node::notifications::store::test::test_cob_notifications ... ok
test node::notifications::store::test::test_counts_by_repo ... ok
test node::db::test::test_version ... ok
test node::notifications::store::test::test_duplicate_notifications ... ok
test node::notifications::store::test::test_notification_status ... ok
test node::policy::store::test::test_follow_and_unfollow_node ... ok
test node::policy::store::test::test_node_policies ... ok
test node::policy::store::test::test_node_aliases ... ok
test node::policy::store::test::test_node_policy ... ok
test node::policy::store::test::test_repo_policy ... ok
test node::policy::store::test::test_repo_policies ... ok
test node::policy::store::test::test_seed_and_unseed_repo ... ok
test node::policy::store::test::test_update_scope ... ok
test node::policy::store::test::test_update_alias ... ok
test node::refs::store::test::test_count ... ok
test node::refs::store::test::test_set_and_delete ... ok
test node::refs::store::test::test_set_and_get ... ok
test node::routing::test::test_count ... ok
test node::routing::test::test_entries ... ok
test node::routing::test::test_insert_and_get ... ok
test node::routing::test::test_insert_and_get_resources ... ok
test node::routing::test::test_insert_and_remove ... ok
test node::routing::test::test_insert_duplicate ... ok
test node::routing::test::test_insert_existing_updated_time ... ok
test node::routing::test::test_len ... ok
test node::routing::test::test_remove_many ... ok
test node::routing::test::test_remove_redundant ... ok
test node::routing::test::test_update_existing_multi ... ok
test node::sync::announce::test::announcer_must_reach_preferred_seeds ... ok
test node::sync::announce::test::announcer_reached_max_replication_target ... ok
test node::sync::announce::test::announcer_reached_min_replication_target ... ok
test node::sync::announce::test::announcer_timed_out ... ok
test node::sync::announce::test::announcer_will_minimise_replication_factor ... ok
test node::routing::test::test_prune ... ok
test node::sync::announce::test::cannot_construct_announcer ... ok
test node::sync::fetch::test::all_nodes_are_candidates ... ok
test node::sync::fetch::test::could_not_reach_target ... ok
test node::sync::fetch::test::all_nodes_are_fetchable ... ok
test node::sync::fetch::test::ignores_duplicates_and_local_node ... ok
test node::sync::fetch::test::preferred_seeds_target_returned_over_replicas ... ok
test node::sync::fetch::test::reaches_target_of_max_replicas ... ok
test node::sync::fetch::test::reaches_target_of_preferred_seeds ... ok
test node::sync::test::ensure_replicas_construction ... ok
test node::sync::fetch::test::reaches_target_of_replicas ... ok
test node::test::test_alias ... ok
test node::test::test_command_result ... ok
test node::test::test_user_agent ... ok
test node::timestamp::tests::test_timestamp_max ... ok
test node::sync::test::replicas_constrain_to ... ok
test profile::test::canonicalize_home ... ok
test profile::test::test_config ... ok
test cob::thread::tests::prop_ordering ... ok
test rad::tests::test_checkout ... ok
test rad::tests::test_fork ... ok
test serde_ext::test::test_localtime ... ok
test serde_ext::test::test_localtime_ext ... ok
test rad::tests::test_init ... ok
test storage::git::tests::test_references_of ... ok
test storage::git::tests::test_sign_refs ... ok
test storage::git::transport::local::url::test::test_url_parse ... ok
test storage::git::transport::local::url::test::test_url_to_string ... ok
test storage::git::transport::remote::url::test::test_url_parse ... ok
test storage::refs::tests::prop_canonical_roundtrip ... ok
test profile::config::test::schema ... ok
test storage::tests::test_storage ... ok
test test::assert::test::assert_with_message ... ok
test test::assert::test::test_assert_no_move ... ok
test test::assert::test::test_assert_panic_0 - should panic ... ok
test test::assert::test::test_assert_panic_1 - should panic ... ok
test test::assert::test::test_assert_panic_2 - should panic ... ok
test test::assert::test::test_assert_succeed ... ok
test test::assert::test::test_panic_message ... ok
test version::test::test_version ... ok
test storage::git::tests::test_remote_refs ... ok
test storage::refs::tests::test_rid_verification ... ok
test identity::doc::test::prop_encode_decode ... ok
test result: ok. 188 passed; 0 failed; 0 ignored; 0 measured; 0 filtered out; finished in 2.17s
Running unittests src/lib.rs (target/debug/deps/radicle_cli-74153bd6daf7f987)
running 14 tests
test commands::rad_patch::review::builder::tests::test_review_comments_basic ... ok
test commands::rad_patch::review::builder::tests::test_review_comments_multiline ... ok
test commands::rad_inspect::test::test_tree ... ok
test commands::rad_patch::review::builder::tests::test_review_comments_before ... ok
test commands::rad_patch::review::builder::tests::test_review_comments_split_hunk ... ok
test git::pretty_diff::test::test_pretty ... ignored
test git::ddiff::tests::diff_encode_decode_ddiff_hunk ... ok
test git::unified_diff::test::test_diff_content_encode_decode_content ... ok
test git::unified_diff::test::test_diff_encode_decode_diff ... ok
test terminal::format::test::test_bytes ... ok
test terminal::format::test::test_strip_comments ... ok
test terminal::patch::test::test_edit_display_message ... ok
test terminal::patch::test::test_create_display_message ... ok
test terminal::patch::test::test_update_display_message ... ok
test result: ok. 13 passed; 0 failed; 1 ignored; 0 measured; 0 filtered out; finished in 0.00s
Running unittests src/main.rs (target/debug/deps/rad-fd35f2fedcf16b47)
running 0 tests
test result: ok. 0 passed; 0 failed; 0 ignored; 0 measured; 0 filtered out; finished in 0.00s
Running tests/commands.rs (target/debug/deps/commands-39f585a25cdd31b6)
running 97 tests
test framework_home ... ok
test git_push_amend ... ok
test git_push_and_fetch ... ok
test git_push_diverge ... ok
test rad_auth ... ok
test rad_auth_errors ... ok
test rad_block ... ok
test rad_checkout ... ok
test git_tag ... ok
test git_push_rollback ... ok
test git_push_converge ... ok
test rad_clone ... ok
test rad_clean ... ok
test rad_clone_connect ... ok
test rad_clone_unknown ... ok
test rad_clone_all ... ok
test rad_cob_log ... ok
test rad_cob_multiset ... ok
test rad_clone_directory ... ok
test rad_clone_partial_fail ... ok
test rad_cob_migrate ... ok
test rad_cob_show ... ok
test rad_cob_update ... ok
test rad_config ... ok
test rad_cob_update_identity ... ok
test rad_diff ... ok
test rad_id_collaboration ... ignored, slow
test rad_id ... ok
test rad_id_conflict ... ok
test rad_id_private ... ok
test rad_id_multi_delegate ... ok
test rad_id_threshold_soft_fork ... ok
test rad_id_threshold ... ok
test rad_id_unknown_field ... ok
test rad_id_update_delete_field ... ok
test rad_init ... ok
test rad_init_existing ... ok
test rad_init_no_git ... ok
test rad_init_no_seed ... ok
test rad_init_private ... ok
test rad_init_private_clone ... ok
test rad_inbox ... ok
test rad_init_private_no_seed ... ok
test rad_fetch ... ok
test rad_fork ... ok
test rad_init_private_clone_seed ... ok
test rad_init_private_seed ... ok
test rad_init_sync_not_connected ... ok
test rad_init_sync_preferred ... ok
test rad_init_with_existing_remote ... ok
test rad_inspect ... ok
test rad_issue ... ok
test rad_merge_after_update ... ok
test rad_merge_no_ff ... ok
test rad_merge_via_push ... ok
test rad_node_connect ... ok
test rad_node_connect_without_address ... ok
test rad_patch ... ok
test rad_node ... ok
test rad_patch_ahead_behind ... ok
test rad_patch_change_base ... ok
test rad_patch_checkout ... ok
test rad_patch_checkout_revision ... ok
test rad_patch_checkout_force ... ok
test rad_patch_detached_head ... ok
test rad_patch_diff ... ok
test rad_patch_draft ... ok
test rad_init_sync_timeout ... ok
test rad_patch_edit ... ok
test rad_init_sync_and_clone ... ok
test rad_patch_fetch_2 ... ok
test rad_patch_merge_draft ... ok
test rad_patch_delete ... ok
test rad_patch_fetch_1 ... ok
test rad_patch_revert_merge ... ok
test rad_patch_update ... ok
test rad_patch_open_explore ... ok
test rad_publish ... ok
test rad_patch_via_push ... ok
test rad_review_by_hunk ... ok
test rad_seed_and_follow ... ok
test rad_remote ... ok
test rad_self ... ok
test rad_seed_many ... ok
test rad_sync_without_node ... ok
test rad_push_and_pull_patches ... ok
test rad_unseed ... ok
test rad_warn_old_nodes ... FAILED
test rad_unseed_many ... ok
test rad_watch ... ok
test rad_sync ... ok
test test_clone_without_seeds ... ok
test test_cob_deletion ... ok
test test_cob_replication ... ok
test rad_workflow ... ok
test rad_patch_pull_update ... ok
test test_replication_via_seed ... ok
failures:
---- rad_warn_old_nodes stdout ----
1788899134 test: Using PATH ["/6178c334-7f10-4092-84bc-49e607c34bad/w/crates/radicle-cli/target/debug", "/usr/local/cargo/bin", "/usr/local/sbin", "/usr/local/bin", "/usr/sbin", "/usr/bin", "/sbin", "/bin", "/tmp/.tmpKmLARB"]
1788899134 test: rad-warn-old-nodes.md: Running `/6178c334-7f10-4092-84bc-49e607c34bad/w/target/debug/rad` with ["config", "push", "preferredSeeds", "z6MkrLMMsiPWUcNPHcRajuMi9mDfYckSoJyPwwnknocNYPm7@seed.radicle.garden:8776"] in `/tmp/.tmpKmLARB`..
1788899134 test: rad-warn-old-nodes.md: Running `/6178c334-7f10-4092-84bc-49e607c34bad/w/target/debug/rad` with ["config", "push", "node.connect", "z6Mkmqogy2qEM2ummccUthFEaaHvyYmYBYh3dbe9W4ebScxo@ash.radicle.garden:8776"] in `/tmp/.tmpKmLARB`..
1788899134 test: rad-warn-old-nodes.md: Running `/6178c334-7f10-4092-84bc-49e607c34bad/w/target/debug/rad` with ["debug"] in `/tmp/.tmpKmLARB`..
thread 'rad_warn_old_nodes' panicked at crates/radicle-cli-test/src/lib.rs:487:36:
--- Expected
++++ actual: stdout
1 1 | {
2 2 | "radExe": "[..]",
3 3 | "radVersion": "[..]",
4 - "radicleNodeVersion": "radicle-node [..]",
5 - "gitRemoteRadVersion": "git-remote-rad [..]",
6 - "gitVersion": "git version [..]",
7 - "sshVersion": "[..]",
8 - "gitHead": "[..]",
4 + "radicleNodeVersion": "<unknown>",
5 + "gitRemoteRadVersion": "git-remote-rad pre-release (b7de4dde)",
6 + "gitVersion": "git version 2.47.3",
7 + "sshVersion": "OpenSSH_10.0p2 Debian-7, OpenSSL 3.5.4 30 Sep 2025",
8 + "gitHead": "b7de4dde",
9 9 | "log": {
10 10 | "filename": "[..]",
11 11 | "exists": false,
12 12 | "len": null
13 13 | },
⋮
29 29 | "warnings": [
30 30 | "Value of configuration option `node.connect` at index 0 mentions node with address 'ash.radicle.garden:8776', which has been renamed to 'rosa.radicle.xyz:8776'. Please update your configuration.",
31 31 | "Value of configuration option `preferred_seeds` at index 0 mentions node with address 'seed.radicle.garden:8776', which has been renamed to 'iris.radicle.xyz:8776'. Please update your configuration."
32 32 | ]
33 33 | }
Exit status: 0
note: run with `RUST_BACKTRACE=1` environment variable to display a backtrace
failures:
rad_warn_old_nodes
test result: FAILED. 95 passed; 1 failed; 1 ignored; 0 measured; 0 filtered out; finished in 72.25s
error: test failed, to rerun pass `-p radicle-cli --test commands`
Running unittests src/lib.rs (target/debug/deps/radicle_cli_test-414cf954b3e6838e)
running 3 tests
test tests::test_parse ... ok
test tests::test_run ... ok
test tests::test_example_spaced_brackets ... ok
test result: ok. 3 passed; 0 failed; 0 ignored; 0 measured; 0 filtered out; finished in 0.00s
Running unittests src/lib.rs (target/debug/deps/radicle_cob-65db1d3d21109e11)
running 8 tests
test object::tests::test_serde ... ok
test tests::invalid_parse_refstr ... ok
test tests::parse_refstr ... ok
test tests::roundtrip ... ok
test tests::traverse_cobs ... ok
test type_name::test::valid_typenames ... ok
test tests::list_cobs ... ok
test tests::update_cob ... ok
test result: ok. 8 passed; 0 failed; 0 ignored; 0 measured; 0 filtered out; finished in 0.02s
Running unittests src/lib.rs (target/debug/deps/radicle_crypto-0912e5a263b454ad)
running 12 tests
test ssh::fmt::test::test_fingerprint ... ok
test ssh::fmt::test::test_key ... ok
test ssh::keystore::tests::test_init_no_passphrase ... ok
test ssh::test::prop_encode_decode_sk ... ok
test ssh::test::test_agent_encoding_remove ... ok
test ssh::test::test_agent_encoding_sign ... ok
test tests::prop_key_equality ... ok
test tests::prop_encode_decode ... ok
test tests::test_encode_decode ... ok
test tests::test_e25519_dh ... ok
test ssh::keystore::tests::test_signer ... ok
test ssh::keystore::tests::test_init_passphrase ... ok
test result: ok. 12 passed; 0 failed; 0 ignored; 0 measured; 0 filtered out; finished in 0.84s
Running unittests src/lib.rs (target/debug/deps/radicle_dag-20ca1aca3d76c348)
running 20 tests
test tests::test_contains ... ok
test tests::test_cycle ... ok
test tests::test_dependencies ... ok
test tests::test_complex ... ok
test tests::test_diamond ... ok
test tests::test_fold_diamond ... ok
test tests::test_fold_multiple_roots ... ok
test tests::test_fold_reject ... ok
test tests::test_fold_sorting_1 ... ok
test tests::test_fold_sorting_2 ... ok
test tests::test_get ... ok
test tests::test_is_empty ... ok
test tests::test_len ... ok
test tests::test_prune_1 ... ok
test tests::test_merge_1 ... ok
test tests::test_merge_2 ... ok
test tests::test_prune_2 ... ok
test tests::test_prune_by_sorting ... ok
test tests::test_remove ... ok
test tests::test_siblings ... ok
test result: ok. 20 passed; 0 failed; 0 ignored; 0 measured; 0 filtered out; finished in 0.00s
Running unittests src/lib.rs (target/debug/deps/radicle_fetch-4b8234984d8609a4)
running 0 tests
test result: ok. 0 passed; 0 failed; 0 ignored; 0 measured; 0 filtered out; finished in 0.00s
Running unittests src/lib.rs (target/debug/deps/radicle_node-61fe54fa2ff83004)
running 113 tests
test deserializer::test::test_decode_next ... ok
test deserializer::test::prop_decode_next ... ok
test deserializer::test::test_unparsed ... ok
test service::filter::test::test_parameters ... ok
test service::gossip::store::test::test_announced ... ok
test service::limiter::test::test_limitter_different_rates ... ok
test service::limiter::test::test_limitter_multi ... ok
test control::tests::test_control_socket ... ok
test service::limiter::test::test_limitter_refill ... ok
test control::tests::test_seed_unseed ... ok
test service::filter::test::test_sizes ... ok
test service::message::tests::test_inventory_limit ... ok
test service::message::tests::test_ref_remote_limit ... ok
test service::message::tests::prop_refs_announcement_signing ... ok
test tests::e2e::missing_default_branch ... ok
test tests::e2e::missing_delegate_default_branch ... ok
test tests::e2e::test_background_foreground_fetch ... ok
test tests::e2e::test_channel_reader_limit ... ok
test tests::e2e::test_catchup_on_refs_announcements ... ok
test tests::e2e::test_clone ... ok
test service::message::tests::test_node_announcement_validate ... ok
test tests::e2e::test_dont_fetch_owned_refs ... ok
test tests::e2e::test_fetch_followed_remotes ... ok
test tests::e2e::test_connection_crossing ... FAILED
test tests::e2e::test_fetch_preserve_owned_refs ... ok
test tests::e2e::test_fetch_unseeded ... ok
test tests::e2e::test_concurrent_fetches ... ok
test tests::e2e::test_fetch_up_to_date ... ok
test tests::e2e::test_inventory_sync_basic ... ok
test tests::e2e::test_large_fetch ... ok
test tests::e2e::test_migrated_clone ... ok
test tests::e2e::test_missing_remote ... ok
test tests::e2e::test_multiple_offline_inits ... ok
test tests::e2e::test_non_fastforward_sigrefs ... ok
test tests::e2e::test_outdated_delegate_sigrefs ... ok
test tests::e2e::test_outdated_sigrefs ... ok
test tests::e2e::test_replication ... ok
test tests::e2e::test_replication_invalid ... ok
test tests::e2e::test_replication_ref_in_sigrefs ... ok
test tests::e2e::test_inventory_sync_bridge ... ok
test tests::e2e::test_inventory_sync_ring ... ok
test tests::e2e::test_inventory_sync_star ... ok
test tests::test_announcement_rebroadcast ... ok
test tests::test_announcement_rebroadcast_duplicates ... ok
test tests::test_announcement_rebroadcast_timestamp_filtered ... ok
test tests::test_announcement_relay ... ok
test tests::test_connection_kept_alive ... ok
test tests::test_disconnecting_unresponsive_peer ... ok
test tests::test_fetch_missing_inventory_on_gossip ... ok
test tests::test_fetch_missing_inventory_on_schedule ... ok
test tests::test_inbound_connection ... ok
test tests::test_inventory_decode ... ok
test tests::test_init_and_seed ... ok
test tests::test_inventory_relay ... ok
test tests::test_inventory_relay_bad_timestamp ... ok
test tests::test_inventory_sync ... ok
test tests::test_maintain_connections ... ok
test tests::test_maintain_connections_failed_attempt ... ok
test tests::test_maintain_connections_transient ... ok
test tests::test_outbound_connection ... ok
test tests::test_persistent_peer_connect ... ok
test tests::test_inventory_pruning ... ok
test tests::test_persistent_peer_reconnect_success ... ok
test tests::test_persistent_peer_reconnect_attempt ... ok
test tests::test_ping_response ... ok
test tests::test_queued_fetch_from_ann_same_rid ... ok
test tests::test_queued_fetch_from_command_same_rid ... ok
test tests::test_queued_fetch_max_capacity ... ok
test tests::test_redundant_connect ... ok
test tests::test_refs_announcement_followed ... ok
test tests::test_refs_announcement_fetch_trusted_no_inventory ... ok
test tests::test_refs_announcement_no_subscribe ... ok
test tests::test_refs_announcement_offline ... ok
test tests::test_refs_announcement_relay_private ... ok
test tests::test_refs_announcement_relay_public ... ok
test tests::test_seed_repo_subscribe ... ok
test tests::test_refs_synced_event ... ok
test wire::frame::test::test_stream_id ... ok
test tests::test_seeding ... ok
test wire::message::tests::prop_addr ... ok
test wire::message::tests::prop_message_encode_decode ... ok
test tests::prop_inventory_exchange_dense ... ok
test wire::message::tests::prop_zero_bytes_encode_decode ... ok
test wire::message::tests::test_node_ann_max_size ... ok
test wire::message::tests::test_inv_ann_max_size ... ok
test wire::message::tests::test_pingpong_encode_max_size ... ok
test wire::message::tests::test_pingpong_encode_size_overflow ... ok
test wire::protocol::test::test_inventory_ann_with_extension ... ok
test wire::protocol::test::test_pong_message_with_extension ... ok
test wire::tests::prop_filter ... ok
test wire::tests::prop_id ... ok
test wire::tests::prop_oid ... ok
test wire::tests::prop_pubkey ... ok
test wire::tests::prop_refs ... ok
test wire::tests::prop_signature ... ok
test wire::tests::prop_signed_refs ... ok
test wire::tests::prop_string ... ok
test wire::tests::prop_tuple ... ok
test wire::tests::prop_u16 ... ok
test wire::tests::prop_u32 ... ok
test wire::tests::prop_u64 ... ok
test wire::tests::prop_u8 ... ok
test wire::tests::prop_vec ... ok
test wire::tests::test_alias ... ok
test wire::tests::test_bounded_vec_limit ... ok
test wire::tests::test_filter_invalid ... ok
test wire::tests::test_string ... ok
test wire::varint::test::prop_encode_decode ... ok
test wire::varint::test::test_encode_overflow - should panic ... ok
test wire::varint::test::test_encoding ... ok
test wire::message::tests::prop_message_decoder ... ok
test wire::message::tests::test_refs_ann_max_size ... ok
test tests::test_announcement_message_amplification ... ok
failures:
---- tests::e2e::test_connection_crossing stdout ----
1788899144 test: Node::init alice: z6MketNvWEqyoczjbtskL7XWWJsvGewarotzXiKRJB9SJJzg
1788899144 test: Node::init bob: z6MkwFSxBGhwfGR4zq4R5YxfhKoNW9wvF6DmT1vPytdh5vDT
1788899144 tests::e2e::test_connection_crossing node: Opening policy database..
1788899144 tests::e2e::test_connection_crossing node: Migrating COBs cache..
1788899144 tests::e2e::test_connection_crossing node: Migration of COBs cache complete (version=2)..
1788899144 tests::e2e::test_connection_crossing node: Default seeding policy set to 'block (all)'
1788899144 tests::e2e::test_connection_crossing node: Initializing service (Test)..
1788899144 tests::e2e::test_connection_crossing node: Opening node database..
1788899144 tests::e2e::test_connection_crossing node: Address book is empty. Adding bootstrap nodes..
1788899144 tests::e2e::test_connection_crossing node: 0 nodes added to address book
1788899144 tests::e2e::test_connection_crossing service: Init @1788899144972
1788899144 tests::e2e::test_connection_crossing service: Empty refs database, populating from storage..
1788899144 tests::e2e::test_connection_crossing service: Not enough available peers to connect to (available=0, wanted=8)
1788899144 z6MketNvWEqyoczjbtskL7XWWJsvGewarotzXiKRJB9SJJzg <service> node: Listening on 0.0.0.0:37399..
1788899144 tests::e2e::test_connection_crossing node: Binding control socket /tmp/.tmpJHqtdn/GcEaOxz5/node/control.sock..
1788899144 z6MketNvWEqyoczjbtskL7XWWJsvGewarotzXiKRJB9SJJzg <runtime> node: Running node z6MketNvWEqyoczjbtskL7XWWJsvGewarotzXiKRJB9SJJzg in /tmp/.tmpJHqtdn/GcEaOxz5..
1788899144 tests::e2e::test_connection_crossing node: Opening policy database..
1788899144 z6MketNvWEqyoczjbtskL7XWWJsvGewarotzXiKRJB9SJJzg <control> control: Control thread listening on socket..
1788899144 z6MketNvWEqyoczjbtskL7XWWJsvGewarotzXiKRJB9SJJzg <service> service: Received command QueryState(..)
1788899144 z6MketNvWEqyoczjbtskL7XWWJsvGewarotzXiKRJB9SJJzg <signals> node: Signal notifications channel error: receiving on an empty and disconnected channel
1788899145 tests::e2e::test_connection_crossing node: Migrating COBs cache..
1788899145 tests::e2e::test_connection_crossing node: Migration of COBs cache complete (version=2)..
1788899145 tests::e2e::test_connection_crossing node: Default seeding policy set to 'block (all)'
1788899145 tests::e2e::test_connection_crossing node: Initializing service (Test)..
1788899145 tests::e2e::test_connection_crossing node: Opening node database..
1788899145 tests::e2e::test_connection_crossing node: Address book is empty. Adding bootstrap nodes..
1788899145 tests::e2e::test_connection_crossing node: 0 nodes added to address book
1788899145 tests::e2e::test_connection_crossing service: Init @1788899144997
1788899145 tests::e2e::test_connection_crossing service: Empty refs database, populating from storage..
1788899145 tests::e2e::test_connection_crossing service: Not enough available peers to connect to (available=0, wanted=8)
1788899145 z6MkwFSxBGhwfGR4zq4R5YxfhKoNW9wvF6DmT1vPytdh5vDT <service> node: Listening on 0.0.0.0:41693..
1788899145 tests::e2e::test_connection_crossing node: Binding control socket /tmp/.tmpJHqtdn/4p0T6fIL/node/control.sock..
1788899145 z6MkwFSxBGhwfGR4zq4R5YxfhKoNW9wvF6DmT1vPytdh5vDT <runtime> node: Running node z6MkwFSxBGhwfGR4zq4R5YxfhKoNW9wvF6DmT1vPytdh5vDT in /tmp/.tmpJHqtdn/4p0T6fIL..
1788899145 test: Preferred peer is z6MkwFSxBGhwfGR4zq4R5YxfhKoNW9wvF6DmT1vPytdh5vDT
1788899145 z6MkwFSxBGhwfGR4zq4R5YxfhKoNW9wvF6DmT1vPytdh5vDT <control> control: Control thread listening on socket..
1788899145 z6MkwFSxBGhwfGR4zq4R5YxfhKoNW9wvF6DmT1vPytdh5vDT <service> service: Received command QueryState(..)
1788899145 z6MkwFSxBGhwfGR4zq4R5YxfhKoNW9wvF6DmT1vPytdh5vDT <service> service: Received command QueryState(..)
1788899145 z6MketNvWEqyoczjbtskL7XWWJsvGewarotzXiKRJB9SJJzg <service> service: Received command QueryState(..)
1788899145 z6MketNvWEqyoczjbtskL7XWWJsvGewarotzXiKRJB9SJJzg <service> service: Received command Connect(z6MkwFSxBGhwfGR4zq4R5YxfhKoNW9wvF6DmT1vPytdh5vDT, 0.0.0.0:41693, ConnectOptions { persistent: false, timeout: 30s })
1788899145 z6MketNvWEqyoczjbtskL7XWWJsvGewarotzXiKRJB9SJJzg <service> service: Connecting to z6MkwFSxBGhwfGR4zq4R5YxfhKoNW9wvF6DmT1vPytdh5vDT (0.0.0.0:41693)..
1788899145 z6MketNvWEqyoczjbtskL7XWWJsvGewarotzXiKRJB9SJJzg <service> service: Attempted connection to z6MkwFSxBGhwfGR4zq4R5YxfhKoNW9wvF6DmT1vPytdh5vDT (0.0.0.0:41693)
1788899145 z6MketNvWEqyoczjbtskL7XWWJsvGewarotzXiKRJB9SJJzg <service> wire: Registering outbound transport for z6MkwFSxBGhwfGR4zq4R5YxfhKoNW9wvF6DmT1vPytdh5vDT (fd=22)..
1788899145 z6MketNvWEqyoczjbtskL7XWWJsvGewarotzXiKRJB9SJJzg <service> wire: Outbound peer resource registered for z6MkwFSxBGhwfGR4zq4R5YxfhKoNW9wvF6DmT1vPytdh5vDT with id=2 (fd=22)
1788899145 z6MkwFSxBGhwfGR4zq4R5YxfhKoNW9wvF6DmT1vPytdh5vDT <service> wire: Inbound connection from 127.0.0.1:52996 (fd=108)..
1788899145 z6MkwFSxBGhwfGR4zq4R5YxfhKoNW9wvF6DmT1vPytdh5vDT <service> wire: Accepted inbound connection from 127.0.0.1:52996 (fd=108)..
1788899145 z6MkwFSxBGhwfGR4zq4R5YxfhKoNW9wvF6DmT1vPytdh5vDT <service> wire: Inbound peer resource registered with id=2 (fd=108)
1788899145 z6MketNvWEqyoczjbtskL7XWWJsvGewarotzXiKRJB9SJJzg <service> wire: Session established with z6MkwFSxBGhwfGR4zq4R5YxfhKoNW9wvF6DmT1vPytdh5vDT (id=2) (fd=22) (outbound)
1788899145 z6MketNvWEqyoczjbtskL7XWWJsvGewarotzXiKRJB9SJJzg <service> service: Connected to z6MkwFSxBGhwfGR4zq4R5YxfhKoNW9wvF6DmT1vPytdh5vDT (0.0.0.0:41693) (Outbound)
1788899145 z6MketNvWEqyoczjbtskL7XWWJsvGewarotzXiKRJB9SJJzg <service> service: Subscribing to messages since timestamp 1788812745033..
1788899145 z6MkwFSxBGhwfGR4zq4R5YxfhKoNW9wvF6DmT1vPytdh5vDT <signals> node: Signal notifications channel error: receiving on an empty and disconnected channel
1788899145 z6MkwFSxBGhwfGR4zq4R5YxfhKoNW9wvF6DmT1vPytdh5vDT <service> wire: Session established with z6MketNvWEqyoczjbtskL7XWWJsvGewarotzXiKRJB9SJJzg (id=2) (fd=108) (inbound)
1788899145 z6MkwFSxBGhwfGR4zq4R5YxfhKoNW9wvF6DmT1vPytdh5vDT <service> service: Connected to z6MketNvWEqyoczjbtskL7XWWJsvGewarotzXiKRJB9SJJzg (127.0.0.1:52996) (Inbound)
1788899145 z6MkwFSxBGhwfGR4zq4R5YxfhKoNW9wvF6DmT1vPytdh5vDT <service> service: Subscribing to messages since timestamp 1788812745034..
1788899145 z6MketNvWEqyoczjbtskL7XWWJsvGewarotzXiKRJB9SJJzg <service> service: Received node announcement of z6MkwFSxBGhwfGR4zq4R5YxfhKoNW9wvF6DmT1vPytdh5vDT with 0 address(es) from z6MkwFSxBGhwfGR4zq4R5YxfhKoNW9wvF6DmT1vPytdh5vDT (t=1788899144997)
1788899145 z6MkwFSxBGhwfGR4zq4R5YxfhKoNW9wvF6DmT1vPytdh5vDT <service> service: Received node announcement of z6MketNvWEqyoczjbtskL7XWWJsvGewarotzXiKRJB9SJJzg with 0 address(es) from z6MketNvWEqyoczjbtskL7XWWJsvGewarotzXiKRJB9SJJzg (t=1788899144972)
1788899145 z6MketNvWEqyoczjbtskL7XWWJsvGewarotzXiKRJB9SJJzg <service> service: Stored announcement from z6MkwFSxBGhwfGR4zq4R5YxfhKoNW9wvF6DmT1vPytdh5vDT to be broadcast in 0 millisecond(s) (t=1788899144997)
1788899145 z6MkwFSxBGhwfGR4zq4R5YxfhKoNW9wvF6DmT1vPytdh5vDT <service> service: Stored announcement from z6MketNvWEqyoczjbtskL7XWWJsvGewarotzXiKRJB9SJJzg to be broadcast in 0 millisecond(s) (t=1788899144972)
1788899145 z6MketNvWEqyoczjbtskL7XWWJsvGewarotzXiKRJB9SJJzg <service> service: Address store entry for node z6MkwFSxBGhwfGR4zq4R5YxfhKoNW9wvF6DmT1vPytdh5vDT updated at 1788899144997
1788899145 z6MketNvWEqyoczjbtskL7XWWJsvGewarotzXiKRJB9SJJzg <service> service: Received inventory announcement of z6MkwFSxBGhwfGR4zq4R5YxfhKoNW9wvF6DmT1vPytdh5vDT with 0 item(s) from z6MkwFSxBGhwfGR4zq4R5YxfhKoNW9wvF6DmT1vPytdh5vDT (t=1788899144998)
1788899145 z6MkwFSxBGhwfGR4zq4R5YxfhKoNW9wvF6DmT1vPytdh5vDT <service> service: Address store entry for node z6MketNvWEqyoczjbtskL7XWWJsvGewarotzXiKRJB9SJJzg updated at 1788899144972
1788899145 z6MkwFSxBGhwfGR4zq4R5YxfhKoNW9wvF6DmT1vPytdh5vDT <service> service: Received inventory announcement of z6MketNvWEqyoczjbtskL7XWWJsvGewarotzXiKRJB9SJJzg with 0 item(s) from z6MketNvWEqyoczjbtskL7XWWJsvGewarotzXiKRJB9SJJzg (t=1788899144973)
1788899145 z6MketNvWEqyoczjbtskL7XWWJsvGewarotzXiKRJB9SJJzg <service> service: Stored announcement from z6MkwFSxBGhwfGR4zq4R5YxfhKoNW9wvF6DmT1vPytdh5vDT to be broadcast in 0 millisecond(s) (t=1788899144998)
1788899145 z6MketNvWEqyoczjbtskL7XWWJsvGewarotzXiKRJB9SJJzg <service> service: Received subscription filter from z6MkwFSxBGhwfGR4zq4R5YxfhKoNW9wvF6DmT1vPytdh5vDT
1788899145 z6MkwFSxBGhwfGR4zq4R5YxfhKoNW9wvF6DmT1vPytdh5vDT <service> service: Stored announcement from z6MketNvWEqyoczjbtskL7XWWJsvGewarotzXiKRJB9SJJzg to be broadcast in 0 millisecond(s) (t=1788899144973)
1788899145 z6MkwFSxBGhwfGR4zq4R5YxfhKoNW9wvF6DmT1vPytdh5vDT <service> service: Received subscription filter from z6MketNvWEqyoczjbtskL7XWWJsvGewarotzXiKRJB9SJJzg
1788899145 z6MkwFSxBGhwfGR4zq4R5YxfhKoNW9wvF6DmT1vPytdh5vDT <service> service: Received command Connect(z6MketNvWEqyoczjbtskL7XWWJsvGewarotzXiKRJB9SJJzg, 0.0.0.0:37399, ConnectOptions { persistent: false, timeout: 30s })
1788899145 z6MkwFSxBGhwfGR4zq4R5YxfhKoNW9wvF6DmT1vPytdh5vDT <service> service: Connecting to z6MketNvWEqyoczjbtskL7XWWJsvGewarotzXiKRJB9SJJzg (0.0.0.0:37399)..
1788899145 z6MkwFSxBGhwfGR4zq4R5YxfhKoNW9wvF6DmT1vPytdh5vDT <service> service: Attempted connection to peer z6MketNvWEqyoczjbtskL7XWWJsvGewarotzXiKRJB9SJJzg which already has a session
1788899146 z6MketNvWEqyoczjbtskL7XWWJsvGewarotzXiKRJB9SJJzg <service> service: Received command QueryState(..)
1788899146 z6MkwFSxBGhwfGR4zq4R5YxfhKoNW9wvF6DmT1vPytdh5vDT <service> service: Received command QueryState(..)
1788899146 z6MketNvWEqyoczjbtskL7XWWJsvGewarotzXiKRJB9SJJzg <service> service: Received command QueryState(..)
1788899146 test: Ok([Session { nid: PublicKey(z6MkwFSxBGhwfGR4zq4R5YxfhKoNW9wvF6DmT1vPytdh5vDT), link: Outbound, addr: Address(NetAddr { host: Ip(0.0.0.0), port: 41693 }), state: Connected { since: LocalTime { millis: 1788899145033 }, ping: None, fetching: {}, latencies: [], stable: false } }])
1788899146 z6MkwFSxBGhwfGR4zq4R5YxfhKoNW9wvF6DmT1vPytdh5vDT <service> service: Received command QueryState(..)
1788899146 test: Ok([Session { nid: PublicKey(z6MketNvWEqyoczjbtskL7XWWJsvGewarotzXiKRJB9SJJzg), link: Inbound, addr: Address(NetAddr { host: Ip(127.0.0.1), port: 52996 }), state: Connected { since: LocalTime { millis: 1788899145034 }, ping: None, fetching: {}, latencies: [], stable: false } }])
thread 'tests::e2e::test_connection_crossing' panicked at crates/radicle-node/src/tests/e2e.rs:859:9:
assertion `left == right` failed
left: Outbound
right: Inbound
note: run with `RUST_BACKTRACE=1` environment variable to display a backtrace
1788899146 test: Node z6MkwFSxBGhwfGR4zq4R5YxfhKoNW9wvF6DmT1vPytdh5vDT shutting down..
1788899146 z6MkwFSxBGhwfGR4zq4R5YxfhKoNW9wvF6DmT1vPytdh5vDT <control> control: Received `{"command":"shutdown"}` on control socket
1788899146 z6MkwFSxBGhwfGR4zq4R5YxfhKoNW9wvF6DmT1vPytdh5vDT <control> control: Shutdown requested..
1788899146 z6MketNvWEqyoczjbtskL7XWWJsvGewarotzXiKRJB9SJJzg <service> wire: Disconnecting peer with id=2: connection reset
1788899146 z6MketNvWEqyoczjbtskL7XWWJsvGewarotzXiKRJB9SJJzg <service> wire: Transport handover for disconnecting peer with id=2 (fd=22)
1788899146 z6MketNvWEqyoczjbtskL7XWWJsvGewarotzXiKRJB9SJJzg <service> service: Disconnected from z6MkwFSxBGhwfGR4zq4R5YxfhKoNW9wvF6DmT1vPytdh5vDT (connection reset)
1788899146 z6MketNvWEqyoczjbtskL7XWWJsvGewarotzXiKRJB9SJJzg <service> service: Dropping peer z6MkwFSxBGhwfGR4zq4R5YxfhKoNW9wvF6DmT1vPytdh5vDT..
1788899146 z6MketNvWEqyoczjbtskL7XWWJsvGewarotzXiKRJB9SJJzg <service> service: Not enough available peers to connect to (available=0, wanted=8)
1788899146 z6MkwFSxBGhwfGR4zq4R5YxfhKoNW9wvF6DmT1vPytdh5vDT <runtime> pool: Worker pool shutting down..
1788899146 z6MkwFSxBGhwfGR4zq4R5YxfhKoNW9wvF6DmT1vPytdh5vDT <runtime> node: Node shutdown completed for z6MkwFSxBGhwfGR4zq4R5YxfhKoNW9wvF6DmT1vPytdh5vDT
1788899146 test: Node z6MketNvWEqyoczjbtskL7XWWJsvGewarotzXiKRJB9SJJzg shutting down..
1788899146 z6MketNvWEqyoczjbtskL7XWWJsvGewarotzXiKRJB9SJJzg <control> control: Received `{"command":"shutdown"}` on control socket
1788899146 z6MketNvWEqyoczjbtskL7XWWJsvGewarotzXiKRJB9SJJzg <control> control: Shutdown requested..
1788899146 z6MketNvWEqyoczjbtskL7XWWJsvGewarotzXiKRJB9SJJzg <runtime> pool: Worker pool shutting down..
1788899146 z6MketNvWEqyoczjbtskL7XWWJsvGewarotzXiKRJB9SJJzg <runtime> node: Node shutdown completed for z6MketNvWEqyoczjbtskL7XWWJsvGewarotzXiKRJB9SJJzg
failures:
tests::e2e::test_connection_crossing
test result: FAILED. 112 passed; 1 failed; 0 ignored; 0 measured; 0 filtered out; finished in 16.90s
error: test failed, to rerun pass `-p radicle-node --lib`
Running unittests src/main.rs (target/debug/deps/radicle_node-6dd4867ccb6b4803)
running 0 tests
test result: ok. 0 passed; 0 failed; 0 ignored; 0 measured; 0 filtered out; finished in 0.00s
Running unittests src/lib.rs (target/debug/deps/radicle_remote_helper-7bfde46959c7bd2c)
running 0 tests
test result: ok. 0 passed; 0 failed; 0 ignored; 0 measured; 0 filtered out; finished in 0.00s
Running unittests src/git-remote-rad.rs (target/debug/deps/git_remote_rad-ccfda0e6b12494a5)
running 0 tests
test result: ok. 0 passed; 0 failed; 0 ignored; 0 measured; 0 filtered out; finished in 0.00s
Running unittests src/main.rs (target/debug/deps/radicle_schemars-3c6475501b3b4eb5)
running 0 tests
test result: ok. 0 passed; 0 failed; 0 ignored; 0 measured; 0 filtered out; finished in 0.00s
Running unittests src/lib.rs (target/debug/deps/radicle_signals-ad41f42c3d3e47ce)
running 0 tests
test result: ok. 0 passed; 0 failed; 0 ignored; 0 measured; 0 filtered out; finished in 0.00s
Running unittests src/lib.rs (target/debug/deps/radicle_ssh-02e22359ef9bf046)
running 0 tests
test result: ok. 0 passed; 0 failed; 0 ignored; 0 measured; 0 filtered out; finished in 0.00s
Running unittests src/lib.rs (target/debug/deps/radicle_systemd-28e02dc067eac38d)
running 0 tests
test result: ok. 0 passed; 0 failed; 0 ignored; 0 measured; 0 filtered out; finished in 0.00s
Running unittests src/lib.rs (target/debug/deps/radicle_term-8690075601e9065b)
running 20 tests
test ansi::tests::colors_disabled ... ok
test ansi::tests::colors_enabled ... ok
test cell::test::test_width ... ok
test ansi::tests::wrapping ... ok
test element::test::test_width ... ok
test table::test::test_table ... ok
test element::test::test_truncate ... ok
test table::test::test_table_border_maximized ... ok
test table::test::test_table_border_truncated ... ok
test table::test::test_table_border ... ok
test table::test::test_table_truncate ... ok
test table::test::test_table_unicode ... ok
test table::test::test_table_unicode_truncate ... ok
test table::test::test_truncate ... ok
test textarea::test::test_wrapping ... ok
test textarea::test::test_wrapping_code_block ... ok
test textarea::test::test_wrapping_fenced_block ... ok
test vstack::test::test_vstack ... ok
test vstack::test::test_vstack_maximize ... ok
test textarea::test::test_wrapping_paragraphs ... ok
test result: ok. 20 passed; 0 failed; 0 ignored; 0 measured; 0 filtered out; finished in 0.00s
Doc-tests radicle
running 0 tests
test result: ok. 0 passed; 0 failed; 0 ignored; 0 measured; 0 filtered out; finished in 0.00s
Doc-tests radicle_cli
running 0 tests
test result: ok. 0 passed; 0 failed; 0 ignored; 0 measured; 0 filtered out; finished in 0.00s
Doc-tests radicle_cli_test
running 0 tests
test result: ok. 0 passed; 0 failed; 0 ignored; 0 measured; 0 filtered out; finished in 0.00s
Doc-tests radicle_cob
running 1 test
test crates/radicle-cob/src/backend/git/stable.rs - backend::git::stable::with_advanced_timestamp (line 56) ... ignored
test result: ok. 0 passed; 0 failed; 1 ignored; 0 measured; 0 filtered out; finished in 0.00s
Doc-tests radicle_crypto
running 0 tests
test result: ok. 0 passed; 0 failed; 0 ignored; 0 measured; 0 filtered out; finished in 0.00s
Doc-tests radicle_dag
running 0 tests
test result: ok. 0 passed; 0 failed; 0 ignored; 0 measured; 0 filtered out; finished in 0.00s
Doc-tests radicle_fetch
running 0 tests
test result: ok. 0 passed; 0 failed; 0 ignored; 0 measured; 0 filtered out; finished in 0.00s
Doc-tests radicle_node
running 6 tests
test crates/radicle-node/src/bounded.rs - bounded::BoundedVec<T,N>::truncate (line 50) ... ok
test crates/radicle-node/src/bounded.rs - bounded::BoundedVec<T,N>::max (line 96) ... ok
test crates/radicle-node/src/bounded.rs - bounded::BoundedVec<T,N>::collect_from (line 30) ... ok
test crates/radicle-node/src/bounded.rs - bounded::BoundedVec<T,N>::push (line 122) ... ok
test crates/radicle-node/src/bounded.rs - bounded::BoundedVec<T,N>::with_capacity (line 66) ... ok
test crates/radicle-node/src/bounded.rs - bounded::BoundedVec<T,N>::unbound (line 149) ... ok
test result: ok. 6 passed; 0 failed; 0 ignored; 0 measured; 0 filtered out; finished in 0.50s
Doc-tests radicle_remote_helper
running 0 tests
test result: ok. 0 passed; 0 failed; 0 ignored; 0 measured; 0 filtered out; finished in 0.00s
Doc-tests radicle_signals
running 0 tests
test result: ok. 0 passed; 0 failed; 0 ignored; 0 measured; 0 filtered out; finished in 0.00s
Doc-tests radicle_ssh
running 0 tests
test result: ok. 0 passed; 0 failed; 0 ignored; 0 measured; 0 filtered out; finished in 0.00s
Doc-tests radicle_systemd
running 0 tests
test result: ok. 0 passed; 0 failed; 0 ignored; 0 measured; 0 filtered out; finished in 0.00s
Doc-tests radicle_term
running 1 test
test crates/radicle-term/src/table.rs - table (line 4) ... ok
test result: ok. 1 passed; 0 failed; 0 ignored; 0 measured; 0 filtered out; finished in 0.47s
error: 2 targets failed:
`-p radicle-cli --test commands`
`-p radicle-node --lib`
Exit code: 101
{
"response": "finished",
"result": "failure"
}