rad:z3gqcJUoA1n9HaHKufZs5FCSGazv5 heartwooda90aabb1fe2c5d6d969f6c3236f45f93bc6bf3c4
{
"request": "trigger",
"version": 1,
"event_type": "patch",
"repository": {
"id": "rad:z3gqcJUoA1n9HaHKufZs5FCSGazv5",
"name": "heartwood",
"description": "Radicle Heartwood Protocol & Stack",
"private": false,
"default_branch": "master",
"delegates": [
"did:key:z6MksFqXN3Yhqk8pTJdUGLwATkRfQvwZXPqR2qMEhbS9wzpT",
"did:key:z6MkireRatUThvd3qzfKht1S44wpm4FEWSSa4PRMTSQZ3voM",
"did:key:z6MkkPvBfjP4bQmco5Dm7UGsX2ruDBieEHi8n9DVJWX5sTEz"
]
},
"action": "Created",
"patch": {
"id": "49513bf467a0d3e8a41283edb7faf40ad52b4354",
"author": {
"id": "did:key:z6MkireRatUThvd3qzfKht1S44wpm4FEWSSa4PRMTSQZ3voM",
"alias": null
},
"title": "node: rate limiter for channel reads",
"state": {
"status": "merged",
"conflicts": []
},
"before": "f13afe491d169004159a033c4ad7548a7ba76271",
"after": "a90aabb1fe2c5d6d969f6c3236f45f93bc6bf3c4",
"commits": [
"a90aabb1fe2c5d6d969f6c3236f45f93bc6bf3c4"
],
"target": "d285eccb23f3986bfa88fc1af033e6dcb0dc3a65",
"labels": [],
"assignees": [],
"revisions": [
{
"id": "49513bf467a0d3e8a41283edb7faf40ad52b4354",
"author": {
"id": "did:key:z6MkireRatUThvd3qzfKht1S44wpm4FEWSSa4PRMTSQZ3voM",
"alias": null
},
"description": "This introduces rate limits for the `ChannelReader` to limit DDoS attacks and\nattempts to upload repositories that are larger than a node is will to permit.\n\nThe limiter sets the total number of bytes it is will to accept in a single\nexchange, defaulting to 500MB. This means that initial fetches will prevent\nlarge repositories, but is plenty for new packfile data to be sent in subsequent\nfetch exchanges.\n\nThe limit can be configured within the node's config file, under the limits.",
"base": "3b5fac178eaf9bca639fbd0c1df0c68619a7f51f",
"oid": "f48b79f3b91b3654b2dde7e35779ce34181b0cb2",
"timestamp": 1743602717
},
{
"id": "5d2dad11ce8b0f20561c4cdb0f27957e41bcda98",
"author": {
"id": "did:key:z6MkireRatUThvd3qzfKht1S44wpm4FEWSSa4PRMTSQZ3voM",
"alias": null
},
"description": "Changes:\n- Rebased\n- Use `bytesize`, the library has no deps \u2013 other than `serde` via the flag, and\n it handles fractionals better than what I had quickly sketched.",
"base": "f13afe491d169004159a033c4ad7548a7ba76271",
"oid": "f13afe491d169004159a033c4ad7548a7ba76271",
"timestamp": 1745580536
},
{
"id": "b1abab8313fc45c21c0af4f0beadc90a357bf5a9",
"author": {
"id": "did:key:z6MkireRatUThvd3qzfKht1S44wpm4FEWSSa4PRMTSQZ3voM",
"alias": null
},
"description": "Changes:\n- Accidentally pushed master, reverting\n- Changed `has_reached` to `exceeded_by`",
"base": "f13afe491d169004159a033c4ad7548a7ba76271",
"oid": "fe0587685fef9b1e10129d339e94bb337418dce9",
"timestamp": 1745581310
},
{
"id": "6059959743d59e332783ad3e798ca84075b037a9",
"author": {
"id": "did:key:z6MkireRatUThvd3qzfKht1S44wpm4FEWSSa4PRMTSQZ3voM",
"alias": null
},
"description": "Changes:\n- Removed pre-commit yaml file",
"base": "f13afe491d169004159a033c4ad7548a7ba76271",
"oid": "ffa90a7afe2018157bdd519492049302643d3574",
"timestamp": 1745582007
},
{
"id": "9719b0e705226ac59555d48f787fa451737cf780",
"author": {
"id": "did:key:z6MkireRatUThvd3qzfKht1S44wpm4FEWSSa4PRMTSQZ3voM",
"alias": null
},
"description": "Changes:\n- Rename ByteLimit to FetchPackSizeLimit",
"base": "f13afe491d169004159a033c4ad7548a7ba76271",
"oid": "65094aae64e2cb621110f8fc79b7865034f935cc",
"timestamp": 1745585674
},
{
"id": "d2e5f05573f848d4ab5479772fddec3ddbf313d6",
"author": {
"id": "did:key:z6MkireRatUThvd3qzfKht1S44wpm4FEWSSa4PRMTSQZ3voM",
"alias": null
},
"description": "Changes:\n- Reword `exceed_by` doc copy",
"base": "f13afe491d169004159a033c4ad7548a7ba76271",
"oid": "040f24406960d8644beaa6b23c71e760711479b3",
"timestamp": 1745585958
},
{
"id": "52c680fbac86c0401d373939b1844864ca8c921f",
"author": {
"id": "did:key:z6MkireRatUThvd3qzfKht1S44wpm4FEWSSa4PRMTSQZ3voM",
"alias": null
},
"description": "Changes:\n- Use `saturating_add`",
"base": "f13afe491d169004159a033c4ad7548a7ba76271",
"oid": "f606208ca4f506652336703b528369687799c62b",
"timestamp": 1745588657
},
{
"id": "37d0420ee7fbe9fda0c02e5b48c0071d37216c5e",
"author": {
"id": "did:key:z6MkireRatUThvd3qzfKht1S44wpm4FEWSSa4PRMTSQZ3voM",
"alias": null
},
"description": "Changes:\n- Reword doc comment again",
"base": "f13afe491d169004159a033c4ad7548a7ba76271",
"oid": "ebc018824f599a3f281b0c21366770583a02daae",
"timestamp": 1745588800
},
{
"id": "338890b1eea98550fb61a5ee7ccdeacbef290d57",
"author": {
"id": "did:key:z6MkireRatUThvd3qzfKht1S44wpm4FEWSSa4PRMTSQZ3voM",
"alias": null
},
"description": "Changes:\n- Correct doc strings to remove ByteLimit, and use FetchPackSizeLimit instead",
"base": "f13afe491d169004159a033c4ad7548a7ba76271",
"oid": "a90aabb1fe2c5d6d969f6c3236f45f93bc6bf3c4",
"timestamp": 1745605723
}
]
}
}
{
"response": "triggered",
"run_id": {
"id": "56dc18f9-fcd6-4256-9883-e47663db3e94"
},
"info_url": "https://cci.rad.levitte.org//56dc18f9-fcd6-4256-9883-e47663db3e94.html"
}
Started at: 2026-09-07 21:13:33.898238+02:00
Commands:
$ rad clone rad:z3gqcJUoA1n9HaHKufZs5FCSGazv5 .
✓ Creating checkout in ./...
✓ Remote cloudhead@z6MksFqXN3Yhqk8pTJdUGLwATkRfQvwZXPqR2qMEhbS9wzpT added
✓ Remote-tracking branch cloudhead@z6MksFqXN3Yhqk8pTJdUGLwATkRfQvwZXPqR2qMEhbS9wzpT/master created for z6MksFqXN3Yhqk8pTJdUGLwATkRfQvwZXPqR2qMEhbS9wzpT
✓ Remote fintohaps@z6MkireRatUThvd3qzfKht1S44wpm4FEWSSa4PRMTSQZ3voM added
✓ Remote-tracking branch fintohaps@z6MkireRatUThvd3qzfKht1S44wpm4FEWSSa4PRMTSQZ3voM/master created for z6MkireRatUThvd3qzfKht1S44wpm4FEWSSa4PRMTSQZ3voM
✓ Remote lorenz@z6MkkPvBfjP4bQmco5Dm7UGsX2ruDBieEHi8n9DVJWX5sTEz added
✓ Remote-tracking branch lorenz@z6MkkPvBfjP4bQmco5Dm7UGsX2ruDBieEHi8n9DVJWX5sTEz/master created for z6MkkPvBfjP4bQmco5Dm7UGsX2ruDBieEHi8n9DVJWX5sTEz
✓ Repository successfully cloned under /opt/radcis/ci.rad.levitte.org/cci/state/56dc18f9-fcd6-4256-9883-e47663db3e94/w/
╭────────────────────────────────────╮
│ heartwood │
│ Radicle Heartwood Protocol & Stack │
│ 189 issues · 38 patches │
╰────────────────────────────────────╯
Run `cd ./.` to go to the repository directory.
Exit code: 0
$ rad patch checkout 49513bf467a0d3e8a41283edb7faf40ad52b4354
✓ Switched to branch patch/49513bf at revision 338890b
✓ Branch patch/49513bf setup to track rad/patches/49513bf467a0d3e8a41283edb7faf40ad52b4354
Exit code: 0
$ git config advice.detachedHead false
Exit code: 0
$ git checkout a90aabb1fe2c5d6d969f6c3236f45f93bc6bf3c4
HEAD is now at a90aabb1 node: rate limiter for channel reads
Exit code: 0
$ rad patch show 49513bf467a0d3e8a41283edb7faf40ad52b4354 -p
╭──────────────────────────────────────────────────────────────────────────────────╮
│ Title node: rate limiter for channel reads │
│ Patch 49513bf467a0d3e8a41283edb7faf40ad52b4354 │
│ Author fintohaps z6Mkire…SQZ3voM │
│ Head a90aabb1fe2c5d6d969f6c3236f45f93bc6bf3c4 │
│ Base f13afe491d169004159a033c4ad7548a7ba76271 │
│ Target master │
│ Branches patch/49513bf │
│ Commits ahead 0, behind 1080 │
│ Status merged │
│ │
│ This introduces rate limits for the `ChannelReader` to limit DDoS attacks and │
│ attempts to upload repositories that are larger than a node is will to permit. │
│ │
│ The limiter sets the total number of bytes it is will to accept in a single │
│ exchange, defaulting to 500MB. This means that initial fetches will prevent │
│ large repositories, but is plenty for new packfile data to be sent in subsequent │
│ fetch exchanges. │
│ │
│ The limit can be configured within the node's config file, under the limits. │
├──────────────────────────────────────────────────────────────────────────────────┤
│ a90aabb node: rate limiter for channel reads │
├──────────────────────────────────────────────────────────────────────────────────┤
│ ● Revision 49513bf @ 3b5fac1..f48b79f by fintohaps z6Mkire…SQZ3voM 1 year ago │
│ ↑ Revision 5d2dad1 @ f13afe4..f13afe4 by fintohaps z6Mkire…SQZ3voM 1 year ago │
│ └─ ✓ merged by fintohaps z6Mkire…SQZ3voM │
│ ↑ Revision b1abab8 @ f13afe4..fe05876 by fintohaps z6Mkire…SQZ3voM 1 year ago │
│ ↑ Revision 6059959 @ f13afe4..ffa90a7 by fintohaps z6Mkire…SQZ3voM 1 year ago │
│ ↑ Revision 9719b0e @ f13afe4..65094aa by fintohaps z6Mkire…SQZ3voM 1 year ago │
│ ↑ Revision d2e5f05 @ f13afe4..040f244 by fintohaps z6Mkire…SQZ3voM 1 year ago │
│ ↑ Revision 52c680f @ f13afe4..f606208 by fintohaps z6Mkire…SQZ3voM 1 year ago │
│ ↑ Revision 37d0420 @ f13afe4..ebc0188 by fintohaps z6Mkire…SQZ3voM 1 year ago │
│ ↑ Revision 338890b @ f13afe4..a90aabb by fintohaps z6Mkire…SQZ3voM 1 year ago │
╰──────────────────────────────────────────────────────────────────────────────────╯
commit a90aabb1fe2c5d6d969f6c3236f45f93bc6bf3c4
Author: Fintan Halpenny <fintan.halpenny@gmail.com>
Date: Wed Apr 2 15:10:54 2025 +0200
node: rate limiter for channel reads
This introduces rate limits for the `ChannelReader` to limit DDoS attacks and
attempts to upload repositories that are larger than a node is will to permit.
The limiter sets the total number of bytes it is will to accept in a single
exchange, defaulting to 500MB. This means that initial fetches will prevent
large repositories, but is plenty for new packfile data to be sent in subsequent
fetch exchanges.
The limit can be configured within the node's config file, under the limits.
diff --git a/Cargo.lock b/Cargo.lock
index dd88c84c0..981c3d3bc 100644
--- a/Cargo.lock
+++ b/Cargo.lock
@@ -1,6 +1,6 @@
# This file is automatically @generated by Cargo.
# It is not intended for manual editing.
-version = 3
+version = 4
[[package]]
name = "adler2"
@@ -308,6 +308,15 @@ version = "1.5.0"
source = "registry+https://github.com/rust-lang/crates.io-index"
checksum = "1fd0f2584146f6f2ef48085050886acf353beff7305ebd1ae69500e27c67f64b"
+[[package]]
+name = "bytesize"
+version = "2.0.1"
+source = "registry+https://github.com/rust-lang/crates.io-index"
+checksum = "a3c8f83209414aacf0eeae3cf730b18d6981697fba62f200fcfb92b9f082acba"
+dependencies = [
+ "serde",
+]
+
[[package]]
name = "cbc"
version = "0.1.2"
@@ -2173,6 +2182,7 @@ version = "0.14.0"
dependencies = [
"amplify",
"base64 0.21.7",
+ "bytesize",
"chrono",
"colored",
"crossbeam-channel",
diff --git a/radicle-cli/examples/rad-config.md b/radicle-cli/examples/rad-config.md
index e26fd17d6..7e4dc39c6 100644
--- a/radicle-cli/examples/rad-config.md
+++ b/radicle-cli/examples/rad-config.md
@@ -47,7 +47,8 @@ $ rad config
"connection": {
"inbound": 128,
"outbound": 16
- }
+ },
+ "fetchPackReceive": "500.0 MiB"
},
"workers": 8,
"seedingPolicy": {
diff --git a/radicle-node/src/service.rs b/radicle-node/src/service.rs
index dfb8b8744..db08f00dd 100644
--- a/radicle-node/src/service.rs
+++ b/radicle-node/src/service.rs
@@ -1098,7 +1098,13 @@ where
refs_at: refs_at.clone(),
subscribers: vec![],
});
- self.outbox.fetch(session, rid, refs_at, timeout);
+ self.outbox.fetch(
+ session,
+ rid,
+ refs_at,
+ timeout,
+ self.config.limits.fetch_pack_receive,
+ );
Ok(fetching)
}
diff --git a/radicle-node/src/service/io.rs b/radicle-node/src/service/io.rs
index 5232f9223..09b05fbb3 100644
--- a/radicle-node/src/service/io.rs
+++ b/radicle-node/src/service/io.rs
@@ -2,6 +2,7 @@ use std::collections::VecDeque;
use std::time;
use log::*;
+use radicle::node::config::FetchPackSizeLimit;
use radicle::storage::refs::RefsAt;
use crate::prelude::*;
@@ -30,6 +31,8 @@ pub enum Io {
refs_at: Option<Vec<RefsAt>>,
/// Fetch timeout.
timeout: time::Duration,
+ /// Limit the number of bytes fetched.
+ reader_limit: FetchPackSizeLimit,
},
/// Ask for a wakeup in a specified amount of time.
Wakeup(LocalDuration),
@@ -124,6 +127,7 @@ impl Outbox {
rid: RepoId,
refs_at: Vec<RefsAt>,
timeout: time::Duration,
+ reader_limit: FetchPackSizeLimit,
) {
peer.fetching(rid);
@@ -143,6 +147,7 @@ impl Outbox {
refs_at,
remote: peer.id,
timeout,
+ reader_limit,
});
}
diff --git a/radicle-node/src/tests/e2e.rs b/radicle-node/src/tests/e2e.rs
index 8337b53ab..ffa83c2a5 100644
--- a/radicle-node/src/tests/e2e.rs
+++ b/radicle-node/src/tests/e2e.rs
@@ -1493,3 +1493,44 @@ fn test_multiple_offline_inits() {
assert!(projects.contains(&repo.rid), "Bob is missing {}", repo.rid);
}
}
+
+#[test]
+fn test_channel_reader_limit() {
+ logger::init(log::Level::Debug);
+
+ let tmp = tempfile::tempdir().unwrap();
+ let mut alice = Node::init(tmp.path(), config::relay("alice"));
+ let limits = radicle::node::config::Limits {
+ fetch_pack_receive: radicle::node::config::FetchPackSizeLimit::bytes(1000),
+ ..radicle::node::config::Limits::default()
+ };
+ let bob = Node::init(
+ tmp.path(),
+ Config {
+ limits,
+ ..config::relay("bob")
+ },
+ );
+ let acme = alice.project("acme", "");
+
+ let mut alice = alice.spawn();
+ let mut bob = bob.spawn();
+
+ alice.connect(&bob);
+ converge([&alice, &bob]);
+
+ let updated = bob.handle.seed(acme, Scope::All).unwrap();
+ assert!(updated);
+
+ let result = bob.handle.fetch(acme, alice.id, DEFAULT_TIMEOUT).unwrap();
+ assert!(!result.is_success());
+
+ let FetchResult::Failed { reason } = result else {
+ panic!("fetch result must be failed")
+ };
+ assert!(
+ reason.contains("Failed to consume the pack sent by the remote"),
+ "actual: {}",
+ reason
+ );
+}
diff --git a/radicle-node/src/wire/protocol.rs b/radicle-node/src/wire/protocol.rs
index b4f903f25..a34a1ba22 100644
--- a/radicle-node/src/wire/protocol.rs
+++ b/radicle-node/src/wire/protocol.rs
@@ -35,7 +35,7 @@ use crate::wire::frame;
use crate::wire::frame::{Frame, FrameData, StreamId};
use crate::wire::Encode;
use crate::worker;
-use crate::worker::{ChannelEvent, FetchRequest, FetchResult, Task, TaskResult};
+use crate::worker::{ChannelEvent, ChannelsConfig, FetchRequest, FetchResult, Task, TaskResult};
use crate::Link;
/// NoiseXK handshake pattern.
@@ -128,22 +128,22 @@ impl Streams {
}
/// Open a new stream.
- fn open(&mut self, timeout: time::Duration) -> (StreamId, worker::Channels) {
+ fn open(&mut self, config: ChannelsConfig) -> (StreamId, worker::Channels) {
self.seq += 1;
let id = StreamId::git(self.link)
.nth(self.seq)
.expect("Streams::open: too many streams");
let channels = self
- .register(id, timeout)
+ .register(id, config)
.expect("Streams::open: stream was already open");
(id, channels)
}
/// Register an open stream.
- fn register(&mut self, stream: StreamId, timeout: time::Duration) -> Option<worker::Channels> {
- let (wire, worker) = worker::Channels::pair(timeout)
+ fn register(&mut self, stream: StreamId, config: ChannelsConfig) -> Option<worker::Channels> {
+ let (wire, worker) = worker::Channels::pair(config)
.expect("Streams::register: fatal: unable to create channels");
match self.streams.entry(stream) {
@@ -762,8 +762,12 @@ where
log::debug!(target: "wire", "Received `open` command for stream {stream} from {nid}");
metrics.streams_opened += 1;
metrics.received_fetch_requests += 1;
-
- let Some(channels) = streams.register(stream, FETCH_TIMEOUT) else {
+ let reader_limit = self.service.config().limits.fetch_pack_receive;
+ let Some(channels) = streams.register(
+ stream,
+ ChannelsConfig::new(FETCH_TIMEOUT)
+ .with_reader_limit(reader_limit),
+ ) else {
log::warn!(target: "wire", "Peer attempted to open already-open stream stream {stream}");
continue;
};
@@ -1062,6 +1066,7 @@ where
rid,
remote,
timeout,
+ reader_limit,
refs_at,
} => {
log::trace!(target: "wire", "Processing fetch for {rid} from {remote}..");
@@ -1076,7 +1081,8 @@ where
log::error!(target: "wire", "Peer {remote} is not connected: dropping fetch");
continue;
};
- let (stream, channels) = streams.open(timeout);
+ let (stream, channels) =
+ streams.open(ChannelsConfig::new(timeout).with_reader_limit(reader_limit));
log::debug!(target: "wire", "Opened new stream with id {stream} for {rid} and remote {remote}");
diff --git a/radicle-node/src/worker.rs b/radicle-node/src/worker.rs
index bc5277f3a..eb5b0a298 100644
--- a/radicle-node/src/worker.rs
+++ b/radicle-node/src/worker.rs
@@ -23,7 +23,7 @@ use crate::service::policy;
use crate::service::policy::SeedingPolicy;
use crate::wire::StreamId;
-pub use channels::{ChannelEvent, Channels};
+pub use channels::{ChannelEvent, Channels, ChannelsConfig};
/// Worker pool configuration.
pub struct Config {
diff --git a/radicle-node/src/worker/channels.rs b/radicle-node/src/worker/channels.rs
index 298408ec5..a5e721bd7 100644
--- a/radicle-node/src/worker/channels.rs
+++ b/radicle-node/src/worker/channels.rs
@@ -4,6 +4,7 @@ use std::ops::Deref;
use std::{fmt, io, time};
use crossbeam_channel as chan;
+use radicle::node::config::FetchPackSizeLimit;
use radicle::node::NodeId;
use crate::runtime::Handle;
@@ -14,6 +15,32 @@ use crate::wire::StreamId;
/// upload-pack's stdout, the data chunks are of a maximum size of 8192 bytes.
pub const MAX_WORKER_CHANNEL_SIZE: usize = 64;
+#[derive(Clone, Copy, Debug)]
+pub struct ChannelsConfig {
+ timeout: time::Duration,
+ reader_limit: FetchPackSizeLimit,
+}
+
+impl ChannelsConfig {
+ pub fn new(timeout: time::Duration) -> Self {
+ Self {
+ timeout,
+ reader_limit: FetchPackSizeLimit::default(),
+ }
+ }
+
+ pub fn with_timeout(self, timeout: time::Duration) -> Self {
+ Self { timeout, ..self }
+ }
+
+ pub fn with_reader_limit(self, reader_limit: FetchPackSizeLimit) -> Self {
+ Self {
+ reader_limit,
+ ..self
+ }
+ }
+}
+
/// A reader and writer pair that can be used in the fetch protocol.
///
/// It implements [`radicle::fetch::transport::ConnectionStream`] to
@@ -92,20 +119,23 @@ impl<T: AsRef<[u8]>> Channels<T> {
pub fn new(
sender: chan::Sender<ChannelEvent<T>>,
receiver: chan::Receiver<ChannelEvent<T>>,
- timeout: time::Duration,
+ config: ChannelsConfig,
) -> Self {
- let sender = ChannelWriter { sender, timeout };
- let receiver = ChannelReader::new(receiver, timeout);
+ let sender = ChannelWriter {
+ sender,
+ timeout: config.timeout,
+ };
+ let receiver = ChannelReader::new(receiver, config.timeout, config.reader_limit);
Self { sender, receiver }
}
- pub fn pair(timeout: time::Duration) -> io::Result<(Channels<T>, Channels<T>)> {
+ pub fn pair(config: ChannelsConfig) -> io::Result<(Channels<T>, Channels<T>)> {
let (l_send, r_recv) = chan::bounded::<ChannelEvent<T>>(MAX_WORKER_CHANNEL_SIZE);
let (r_send, l_recv) = chan::bounded::<ChannelEvent<T>>(MAX_WORKER_CHANNEL_SIZE);
- let l = Channels::new(l_send, l_recv, timeout);
- let r = Channels::new(r_send, r_recv, timeout);
+ let l = Channels::new(l_send, l_recv, config);
+ let r = Channels::new(r_send, r_recv, config);
Ok((l, r))
}
@@ -123,12 +153,41 @@ impl<T: AsRef<[u8]>> Channels<T> {
}
}
+#[derive(Clone, Copy, Debug)]
+pub struct ReadLimiter {
+ limit: FetchPackSizeLimit,
+ total_read: usize,
+}
+
+impl ReadLimiter {
+ pub fn new(limit: FetchPackSizeLimit) -> Self {
+ Self {
+ limit,
+ total_read: 0,
+ }
+ }
+
+ pub fn read(&mut self, bytes: usize) -> io::Result<()> {
+ self.total_read = self.total_read.saturating_add(bytes);
+ log::trace!(target: "worker", "limit {}, total bytes read: {}", self.limit, self.total_read);
+ if self.limit.exceeded_by(self.total_read) {
+ Err(io::Error::new(
+ io::ErrorKind::Other,
+ "sender has exceeded number of allowed bytes, aborting read",
+ ))
+ } else {
+ Ok(())
+ }
+ }
+}
+
/// Wraps a [`chan::Receiver`] and provides it with [`io::Read`].
#[derive(Clone)]
pub struct ChannelReader<T = Vec<u8>> {
buffer: io::Cursor<Vec<u8>>,
receiver: chan::Receiver<ChannelEvent<T>>,
timeout: time::Duration,
+ limiter: ReadLimiter,
}
impl<T> Deref for ChannelReader<T> {
@@ -140,11 +199,16 @@ impl<T> Deref for ChannelReader<T> {
}
impl<T: AsRef<[u8]>> ChannelReader<T> {
- pub fn new(receiver: chan::Receiver<ChannelEvent<T>>, timeout: time::Duration) -> Self {
+ pub fn new(
+ receiver: chan::Receiver<ChannelEvent<T>>,
+ timeout: time::Duration,
+ limit: FetchPackSizeLimit,
+ ) -> Self {
Self {
buffer: io::Cursor::new(Vec::new()),
receiver,
timeout,
+ limiter: ReadLimiter::new(limit),
}
}
}
@@ -152,6 +216,7 @@ impl<T: AsRef<[u8]>> ChannelReader<T> {
impl Read for ChannelReader<Vec<u8>> {
fn read(&mut self, buf: &mut [u8]) -> io::Result<usize> {
let read = self.buffer.read(buf)?;
+ self.limiter.read(read)?;
if read > 0 {
return Ok(read);
}
diff --git a/radicle/Cargo.toml b/radicle/Cargo.toml
index 74853a1b6..9282579b8 100644
--- a/radicle/Cargo.toml
+++ b/radicle/Cargo.toml
@@ -16,6 +16,7 @@ logger = ["colored", "chrono"]
[dependencies]
amplify = { version = "4.0.0", default-features = false, features = ["std"] }
base64 = { version = "0.21.3" }
+bytesize = { version = "2", features = ["serde"] }
crossbeam-channel = { version = "0.5.6" }
cyphernet = { version = "0.5.0", features = ["tor", "dns", "p2p-ed25519"] }
fastrand = { version = "2.0.0" }
diff --git a/radicle/src/node/config.rs b/radicle/src/node/config.rs
index fdbe4476a..15571df27 100644
--- a/radicle/src/node/config.rs
+++ b/radicle/src/node/config.rs
@@ -1,6 +1,7 @@
use std::collections::HashSet;
-use std::net;
use std::ops::Deref;
+use std::str::FromStr;
+use std::{fmt, net};
use cyphernet::addr::PeerAddr;
use localtime::LocalDuration;
@@ -114,6 +115,9 @@ pub struct Limits {
/// Connection limits.
#[serde(default)]
pub connection: ConnectionLimits,
+ /// Channel limits.
+ #[serde(default)]
+ pub fetch_pack_receive: FetchPackSizeLimit,
}
impl Default for Limits {
@@ -126,10 +130,88 @@ impl Default for Limits {
max_open_files: 4096,
rate: RateLimits::default(),
connection: ConnectionLimits::default(),
+ fetch_pack_receive: FetchPackSizeLimit::default(),
}
}
}
+/// Limiter for byte streams.
+///
+/// Default: 500MiB
+#[derive(Debug, Clone, Copy, serde::Serialize, serde::Deserialize)]
+#[serde(rename_all = "camelCase")]
+#[serde(into = "String", try_from = "String")]
+pub struct FetchPackSizeLimit {
+ limit: bytesize::ByteSize,
+}
+
+impl From<bytesize::ByteSize> for FetchPackSizeLimit {
+ fn from(limit: bytesize::ByteSize) -> Self {
+ Self { limit }
+ }
+}
+
+impl From<FetchPackSizeLimit> for String {
+ fn from(limit: FetchPackSizeLimit) -> Self {
+ limit.to_string()
+ }
+}
+
+impl TryFrom<String> for FetchPackSizeLimit {
+ type Error = String;
+
+ fn try_from(s: String) -> Result<Self, Self::Error> {
+ s.parse()
+ }
+}
+
+impl FromStr for FetchPackSizeLimit {
+ type Err = String;
+
+ fn from_str(s: &str) -> Result<Self, Self::Err> {
+ Ok(FetchPackSizeLimit { limit: s.parse()? })
+ }
+}
+
+impl fmt::Display for FetchPackSizeLimit {
+ fn fmt(&self, f: &mut fmt::Formatter<'_>) -> fmt::Result {
+ write!(f, "{}", self.limit)
+ }
+}
+
+impl FetchPackSizeLimit {
+ /// New `FetchPackSizeLimit` in bytes.
+ pub fn bytes(size: u64) -> Self {
+ bytesize::ByteSize::b(size).into()
+ }
+
+ /// New `FetchPackSizeLimit` in kibibytes.
+ pub fn kibibytes(size: u64) -> Self {
+ bytesize::ByteSize::kib(size).into()
+ }
+
+ /// New `FetchPackSizeLimit` in mebibytes.
+ pub fn mebibytes(size: u64) -> Self {
+ bytesize::ByteSize::mib(size).into()
+ }
+
+ /// New `FetchPackSizeLimit` in gibibytes.
+ pub fn gibibytes(size: u64) -> Self {
+ bytesize::ByteSize::gib(size).into()
+ }
+
+ /// Check if this limit is exceeded by the number of `bytes` provided.
+ pub fn exceeded_by(&self, bytes: usize) -> bool {
+ bytes >= self.limit.as_u64() as usize
+ }
+}
+
+impl Default for FetchPackSizeLimit {
+ fn default() -> Self {
+ Self::mebibytes(500)
+ }
+}
+
/// Connection limits.
#[derive(Debug, Clone, serde::Serialize, serde::Deserialize)]
#[serde(rename_all = "camelCase")]
Exit code: 0
shell: 'cargo --version rustc --version cargo fmt --check cargo clippy --all-targets --workspace -- --deny warnings cargo build --all-targets --workspace cargo doc --workspace --no-deps cargo test --workspace --no-fail-fast '
Commands:
$ podman run --name 56dc18f9-fcd6-4256-9883-e47663db3e94 -v /opt/radcis/ci.rad.levitte.org/cci/state/56dc18f9-fcd6-4256-9883-e47663db3e94/s:/56dc18f9-fcd6-4256-9883-e47663db3e94/s:ro -v /opt/radcis/ci.rad.levitte.org/cci/state/56dc18f9-fcd6-4256-9883-e47663db3e94/w:/56dc18f9-fcd6-4256-9883-e47663db3e94/w -w /56dc18f9-fcd6-4256-9883-e47663db3e94/w -v /opt/radcis/ci.rad.levitte.org/.radicle:/${id}/.radicle:ro -e RAD_HOME=/${id}/.radicle rust:trixie bash /56dc18f9-fcd6-4256-9883-e47663db3e94/s/script.sh
+ cargo --version
info: syncing channel updates for '1.85-x86_64-unknown-linux-gnu'
info: latest update on 2025-03-18, rust version 1.85.1 (4eb161250 2025-03-15)
info: downloading component 'cargo'
info: downloading component 'clippy'
info: downloading component 'rust-docs'
info: downloading component 'rust-src'
info: downloading component 'rust-std'
info: downloading component 'rustc'
info: downloading component 'rustfmt'
info: installing component 'cargo'
info: installing component 'clippy'
info: installing component 'rust-docs'
info: installing component 'rust-src'
info: installing component 'rust-std'
info: installing component 'rustc'
info: installing component 'rustfmt'
cargo 1.85.1 (d73d2caf9 2024-12-31)
+ rustc --version
rustc 1.85.1 (4eb161250 2025-03-15)
+ cargo fmt --check
+ cargo clippy --all-targets --workspace -- --deny warnings
Updating crates.io index
Downloading crates ...
Downloaded adler2 v2.0.0
Downloaded rfc6979 v0.4.0
Downloaded crc32fast v1.4.0
Downloaded scopeguard v1.2.0
Downloaded byteorder v1.5.0
Downloaded write16 v1.0.0
Downloaded yoke-derive v0.7.5
Downloaded siphasher v1.0.1
Downloaded timeago v0.4.2
Downloaded yansi v0.5.1
Downloaded tree-sitter-css v0.23.1
Downloaded similar v2.5.0
Downloaded tree-sitter-language v0.1.2
Downloaded streaming-iterator v0.1.9
Downloaded tree-sitter-json v0.24.8
Downloaded xattr v1.3.1
Downloaded synstructure v0.13.1
Downloaded tinyvec v1.6.0
Downloaded writeable v0.5.5
Downloaded zerofrom-derive v0.1.6
Downloaded fastrand v2.1.0
Downloaded version_check v0.9.4
Downloaded zerofrom v0.1.6
Downloaded idna_adapter v1.2.0
Downloaded gix-revision v0.31.1
Downloaded termion v3.0.0
Downloaded radicle-git-ext v0.8.0
Downloaded yoke v0.7.5
Downloaded normalize-line-endings v0.3.0
Downloaded multibase v0.9.1
Downloaded newline-converter v0.3.0
Downloaded lazy_static v1.5.0
Downloaded gix-sec v0.10.12
Downloaded universal-hash v0.5.1
Downloaded gix-features v0.39.1
Downloaded radicle-std-ext v0.1.0
Downloaded numtoa v0.1.0
Downloaded ff v0.13.0
Downloaded gix-commitgraph v0.25.1
Downloaded ecdsa v0.16.9
Downloaded phf_shared v0.11.3
Downloaded netservices v0.8.0
Downloaded icu_provider_macros v1.5.0
Downloaded gix-refspec v0.27.0
Downloaded localtime v1.3.1
Downloaded percent-encoding v2.3.1
Downloaded group v0.13.0
Downloaded amplify_derive v4.0.0
Downloaded pbkdf2 v0.12.2
Downloaded ppv-lite86 v0.2.17
Downloaded once_cell v1.19.0
Downloaded poly1305 v0.8.0
Downloaded lock_api v0.4.11
Downloaded gix-ref v0.49.1
Downloaded gix-traverse v0.43.1
Downloaded iana-time-zone v0.1.60
Downloaded miniz_oxide v0.8.8
Downloaded icu_provider v1.5.0
Downloaded pretty_assertions v1.4.0
Downloaded phf v0.11.3
Downloaded aes-gcm v0.10.3
Downloaded hashbrown v0.14.3
Downloaded qcheck v1.0.0
Downloaded quote v1.0.36
Downloaded icu_normalizer_data v1.5.1
Downloaded icu_locid_transform_data v1.5.1
Downloaded icu_properties v1.5.1
Downloaded p256 v0.13.2
Downloaded icu_properties_data v1.5.1
Downloaded proc-macro2 v1.0.92
Downloaded icu_collections v1.5.0
Downloaded prodash v29.0.2
Downloaded libm v0.2.8
Downloaded p521 v0.13.3
Downloaded vcpkg v0.2.15
Downloaded idna v1.0.3
Downloaded tree-sitter-md v0.3.2
Downloaded tree-sitter-c v0.23.2
Downloaded p384 v0.13.0
Downloaded syn v2.0.89
Downloaded regex v1.11.1
Downloaded syn v1.0.109
Downloaded tree-sitter-rust v0.23.2
Downloaded rustix v0.38.34
Downloaded bstr v1.9.1
Downloaded bloomy v1.2.0
Downloaded tree-sitter-bash v0.23.3
Downloaded inquire v0.7.5
Downloaded num-bigint-dig v0.8.4
Downloaded winnow v0.6.26
Downloaded tree-sitter-python v0.23.4
Downloaded tree-sitter-ruby v0.23.1
Downloaded unicode-normalization v0.1.23
Downloaded regex-automata v0.4.9
Downloaded pkcs1 v0.7.5
Downloaded icu_normalizer v1.5.0
Downloaded icu_locid v1.5.0
Downloaded gix-transport v0.44.0
Downloaded parking_lot v0.12.1
Downloaded hmac v0.12.1
Downloaded chrono v0.4.38
Downloaded aho-corasick v1.1.3
Downloaded jiff v0.2.1
Downloaded num-traits v0.2.18
Downloaded tree-sitter-go v0.23.4
Downloaded pkg-config v0.3.30
Downloaded libc v0.2.155
Downloaded tree-sitter-typescript v0.23.2
Downloaded pkcs8 v0.10.2
Downloaded sha3 v0.10.8
Downloaded litemap v0.7.5
Downloaded io-reactor v0.5.2
Downloaded icu_locid_transform v1.5.0
Downloaded memchr v2.7.2
Downloaded maybe-async v0.2.10
Downloaded gix-path v0.10.15
Downloaded radicle-surf v0.22.0
Downloaded unicode-segmentation v1.11.0
Downloaded aes v0.8.4
Downloaded zerovec v0.10.4
Downloaded git2 v0.19.0
Downloaded emojis v0.6.4
Downloaded cyphernet v0.5.2
Downloaded cc v1.2.2
Downloaded primeorder v0.13.6
Downloaded gix-pack v0.56.0
Downloaded indexmap v2.2.6
Downloaded der v0.7.9
Downloaded crypto-bigint v0.5.5
Downloaded base64 v0.21.7
Downloaded arc-swap v1.7.1
Downloaded qcheck-macros v1.0.0
Downloaded log v0.4.21
Downloaded inout v0.1.3
Downloaded itoa v1.0.11
Downloaded polyval v0.6.2
Downloaded crossbeam-channel v0.5.15
Downloaded chacha20poly1305 v0.10.1
Downloaded elliptic-curve v0.13.8
Downloaded base64 v0.22.1
Downloaded pem-rfc7468 v0.7.0
Downloaded proc-macro-error v1.0.4
Downloaded memmap2 v0.9.4
Downloaded gix-packetline v0.18.4
Downloaded getrandom v0.2.15
Downloaded flate2 v1.1.1
Downloaded base64 v0.13.1
Downloaded rsa v0.9.6
Downloaded parking_lot_core v0.9.9
Downloaded keccak v0.1.5
Downloaded gix-protocol v0.47.0
Downloaded url v2.5.4
Downloaded const-oid v0.9.6
Downloaded colored v2.1.0
Downloaded amplify v4.6.0
Downloaded zeroize v1.7.0
Downloaded jobserver v0.1.31
Downloaded num-integer v0.1.46
Downloaded either v1.11.0
Downloaded popol v3.0.0
Downloaded gix-validate v0.9.4
Downloaded gix-url v0.28.2
Downloaded proc-macro-error-attr v1.0.4
Downloaded gix-object v0.46.1
Downloaded tempfile v3.10.1
Downloaded tar v0.4.40
Downloaded gix-odb v0.66.0
Downloaded ctr v0.9.2
Downloaded chacha20 v0.9.1
Downloaded amplify_num v0.5.2
Downloaded gix-quote v0.4.15
Downloaded opaque-debug v0.3.1
Downloaded gix-trace v0.1.12
Downloaded gix-shallow v0.1.0
Downloaded gix-revwalk v0.17.0
Downloaded nonempty v0.9.0
Downloaded nonempty v0.5.0
Downloaded noise-framework v0.4.0
Downloaded gix-diff v0.49.0
Downloaded gix-command v0.4.1
Downloaded ed25519 v1.5.3
Downloaded cbc v0.1.2
Downloaded anstream v0.6.13
Downloaded filetime v0.2.23
Downloaded digest v0.10.7
Downloaded bytesize v2.0.1
Downloaded escargot v0.5.10
Downloaded socket2 v0.5.7
Downloaded ec25519 v0.1.0
Downloaded displaydoc v0.2.5
Downloaded cipher v0.4.4
Downloaded amplify_syn v2.0.1
Downloaded home v0.5.9
Downloaded gix-utils v0.1.14
Downloaded diff v0.1.13
Downloaded bitflags v2.5.0
Downloaded num-iter v0.1.44
Downloaded zerovec-derive v0.10.3
Downloaded smallvec v1.13.2
Downloaded generic-array v0.14.7
Downloaded bcrypt-pbkdf v0.10.0
Downloaded unicode-ident v1.0.12
Downloaded gix-hash v0.15.1
Downloaded faster-hex v0.9.0
Downloaded colorchoice v1.0.0
Downloaded gix-tempfile v15.0.0
Downloaded gix-prompt v0.9.1
Downloaded typenum v1.17.0
Downloaded spin v0.9.8
Downloaded gix-credentials v0.26.0
Downloaded block-padding v0.3.3
Downloaded git-ref-format v0.3.0
Downloaded equivalent v1.0.1
Downloaded crypto-common v0.1.6
Downloaded base-x v0.2.11
Downloaded serde v1.0.219
Downloaded gix-lock v15.0.1
Downloaded gix-config-value v0.14.12
Downloaded errno v0.3.9
Downloaded anstyle-query v1.0.2
Downloaded gix-actor v0.33.2
Downloaded fxhash v0.2.1
Downloaded cyphergraphy v0.3.0
Downloaded block-buffer v0.10.4
Downloaded lexopt v0.3.0
Downloaded unicode-width v0.1.11
Downloaded tree-sitter-toml-ng v0.6.0
Downloaded tinyvec_macros v0.1.1
Downloaded base64ct v1.6.0
Downloaded unicode-display-width v0.3.0
Downloaded gix-hashtable v0.6.0
Downloaded git-ref-format-macro v0.3.0
Downloaded ghash v0.5.1
Downloaded crossbeam-utils v0.8.19
Downloaded utf8_iter v1.0.4
Downloaded utf16_iter v1.0.5
Downloaded tree-sitter-highlight v0.24.4
Downloaded salsa20 v0.10.2
Downloaded gix-date v0.9.4
Downloaded tree-sitter-html v0.23.2
Downloaded thiserror v1.0.69
Downloaded spki v0.7.3
Downloaded sha2 v0.10.8
Downloaded data-encoding-macro v0.1.14
Downloaded cypheraddr v0.4.0
Downloaded cpufeatures v0.2.12
Downloaded form_urlencoded v1.2.1
Downloaded dyn-clone v1.0.17
Downloaded blowfish v0.9.1
Downloaded anstyle-parse v0.2.3
Downloaded tinystr v0.7.6
Downloaded serde_derive v1.0.219
Downloaded rand v0.8.5
Downloaded sqlite3-sys v0.15.2
Downloaded shlex v1.3.0
Downloaded sec1 v0.7.3
Downloaded scrypt v0.11.0
Downloaded rand_core v0.6.4
Downloaded signature v1.6.4
Downloaded rand_chacha v0.3.1
Downloaded snapbox v0.4.17
Downloaded siphasher v0.3.11
Downloaded regex-syntax v0.8.5
Downloaded signature v2.2.0
Downloaded serde_json v1.0.116
Downloaded gix-chunk v0.4.11
Downloaded git-ref-format-core v0.3.0
Downloaded cfg-if v1.0.0
Downloaded base16ct v0.2.0
Downloaded autocfg v1.2.0
Downloaded anstyle v1.0.6
Downloaded tree-sitter v0.24.4
Downloaded termion v2.0.3
Downloaded ssh-key v0.6.6
Downloaded ssh-encoding v0.2.0
Downloaded data-encoding-macro-internal v0.1.12
Downloaded data-encoding v2.5.0
Downloaded signals_receipts v0.2.0
Downloaded gix-negotiate v0.17.0
Downloaded thiserror-impl v2.0.12
Downloaded ssh-cipher v0.2.0
Downloaded sha1_smol v1.0.0
Downloaded same-file v1.0.6
Downloaded ryu v1.0.17
Downloaded aead v0.5.2
Downloaded walkdir v2.5.0
Downloaded thiserror-impl v1.0.69
Downloaded thiserror v2.0.12
Downloaded stable_deref_trait v1.2.0
Downloaded sqlite v0.32.0
Downloaded socks5-client v0.4.1
Downloaded snapbox-macros v0.3.8
Downloaded shell-words v1.1.0
Downloaded gix-fs v0.12.1
Downloaded ct-codecs v1.1.1
Downloaded base32 v0.4.0
Downloaded subtle v2.5.0
Downloaded sem_safe v0.2.0
Downloaded utf8parse v0.2.1
Downloaded anyhow v1.0.82
Downloaded ascii v1.1.0
Downloaded linux-raw-sys v0.4.13
Downloaded libgit2-sys v0.17.0+1.8.1
Downloaded sqlite3-src v0.5.1
Downloaded libz-sys v1.1.16
Compiling libc v0.2.155
Compiling proc-macro2 v1.0.92
Compiling unicode-ident v1.0.12
Checking cfg-if v1.0.0
Compiling shlex v1.3.0
Compiling version_check v0.9.4
Checking memchr v2.7.2
Compiling typenum v1.17.0
Compiling quote v1.0.36
Compiling jobserver v0.1.31
Checking getrandom v0.2.15
Compiling syn v2.0.89
Compiling generic-array v0.14.7
Compiling cc v1.2.2
Checking aho-corasick v1.1.3
Compiling serde v1.0.219
Checking regex-syntax v0.8.5
Checking rand_core v0.6.4
Checking smallvec v1.13.2
Checking crypto-common v0.1.6
Checking log v0.4.21
Checking fastrand v2.1.0
Compiling autocfg v1.2.0
Checking bitflags v2.5.0
Checking subtle v2.5.0
Compiling syn v1.0.109
Checking stable_deref_trait v1.2.0
Checking once_cell v1.19.0
Checking regex-automata v0.4.9
Checking zeroize v1.7.0
Checking cpufeatures v0.2.12
Checking tinyvec_macros v0.1.1
Checking tinyvec v1.6.0
Compiling crc32fast v1.4.0
Compiling synstructure v0.13.1
Checking unicode-normalization v0.1.23
Checking block-padding v0.3.3
Checking writeable v0.5.5
Checking litemap v0.7.5
Checking bstr v1.9.1
Compiling icu_locid_transform_data v1.5.1
Compiling serde_derive v1.0.219
Compiling zerofrom-derive v0.1.6
Compiling yoke-derive v0.7.5
Compiling zerovec-derive v0.10.3
Compiling displaydoc v0.2.5
Checking zerofrom v0.1.6
Checking yoke v0.7.5
Compiling icu_provider_macros v1.5.0
Checking inout v0.1.3
Checking block-buffer v0.10.4
Compiling pkg-config v0.3.30
Compiling icu_properties_data v1.5.1
Checking zerovec v0.10.4
Checking digest v0.10.7
Checking cipher v0.4.4
Compiling icu_normalizer_data v1.5.1
Compiling thiserror v1.0.69
Compiling thiserror-impl v1.0.69
Checking write16 v1.0.0
Checking utf16_iter v1.0.5
Checking utf8_iter v1.0.4
Compiling rustix v0.38.34
Checking tinystr v0.7.6
Checking icu_collections v1.5.0
Checking icu_locid v1.5.0
Checking sha2 v0.10.8
Checking icu_provider v1.5.0
Checking hashbrown v0.14.3
Checking icu_locid_transform v1.5.0
Checking linux-raw-sys v0.4.13
Checking icu_properties v1.5.1
Checking itoa v1.0.11
Checking percent-encoding v2.3.1
Checking form_urlencoded v1.2.1
Checking universal-hash v0.5.1
Checking opaque-debug v0.3.1
Compiling vcpkg v0.2.15
Compiling amplify_syn v2.0.1
Compiling libz-sys v1.1.16
Checking byteorder v1.5.0
Checking icu_normalizer v1.5.0
Compiling data-encoding v2.5.0
Compiling amplify_derive v4.0.0
Checking amplify_num v0.5.2
Checking idna_adapter v1.2.0
Checking idna v1.0.3
Compiling data-encoding-macro-internal v0.1.12
Checking url v2.5.4
Checking ascii v1.1.0
Checking signature v1.6.4
Checking ed25519 v1.5.3
Checking tempfile v3.10.1
Compiling libgit2-sys v0.17.0+1.8.1
Checking aead v0.5.2
Compiling proc-macro-error-attr v1.0.4
Checking data-encoding-macro v0.1.14
Checking ct-codecs v1.1.1
Checking base-x v0.2.11
Checking ec25519 v0.1.0
Checking multibase v0.9.1
Checking poly1305 v0.8.0
Checking chacha20 v0.9.1
Compiling proc-macro-error v1.0.4
Checking amplify v4.6.0
Checking keccak v0.1.5
Checking cyphergraphy v0.3.0
Checking sha3 v0.10.8
Compiling git-ref-format-core v0.3.0
Checking polyval v0.6.2
Compiling sqlite3-src v0.5.1
Checking hmac v0.12.1
Checking base32 v0.4.0
Checking base64ct v1.6.0
Compiling thiserror v2.0.12
Checking ppv-lite86 v0.2.17
Checking pem-rfc7468 v0.7.0
Checking rand_chacha v0.3.1
Compiling git-ref-format-macro v0.3.0
Checking cypheraddr v0.4.0
Checking pbkdf2 v0.12.2
Checking ghash v0.5.1
Checking chacha20poly1305 v0.10.1
Checking ctr v0.9.2
Checking aes v0.8.4
Compiling thiserror-impl v2.0.12
Compiling crossbeam-utils v0.8.19
Checking aes-gcm v0.10.3
Checking git-ref-format v0.3.0
Checking noise-framework v0.4.0
Checking socks5-client v0.4.1
Checking rand v0.8.5
Checking ssh-encoding v0.2.0
Checking blowfish v0.9.1
Checking cbc v0.1.2
Checking radicle-std-ext v0.1.0
Checking bcrypt-pbkdf v0.10.0
Checking ssh-cipher v0.2.0
Checking cyphernet v0.5.2
Checking signature v2.2.0
Checking ssh-key v0.6.6
Checking crossbeam-channel v0.5.15
Checking qcheck v1.0.0
Checking radicle-ssh v0.9.0 (/56dc18f9-fcd6-4256-9883-e47663db3e94/w/radicle-ssh)
Compiling num-traits v0.2.18
Checking equivalent v1.0.1
Compiling serde_json v1.0.116
Checking indexmap v2.2.6
Checking ryu v1.0.17
Checking tree-sitter-language v0.1.2
Checking siphasher v1.0.1
Checking nonempty v0.9.0
Compiling lock_api v0.4.11
Checking radicle-dag v0.10.0 (/56dc18f9-fcd6-4256-9883-e47663db3e94/w/radicle-dag)
Compiling anyhow v1.0.82
Compiling parking_lot_core v0.9.9
Checking lazy_static v1.5.0
Checking gix-trace v0.1.12
Checking scopeguard v1.2.0
Checking anstyle-query v1.0.2
Checking iana-time-zone v0.1.60
Checking chrono v0.4.38
Checking colored v2.1.0
Checking localtime v1.3.1
Checking bytesize v2.0.1
Checking utf8parse v0.2.1
Checking base64 v0.21.7
Checking anstyle-parse v0.2.3
Checking parking_lot v0.12.1
Checking faster-hex v0.9.0
Checking errno v0.3.9
Checking sem_safe v0.2.0
Checking colorchoice v1.0.0
Checking anstyle v1.0.6
Checking signals_receipts v0.2.0
Checking anstream v0.6.13
Checking gix-utils v0.1.14
Checking adler2 v2.0.0
Checking snapbox-macros v0.3.8
Checking miniz_oxide v0.8.8
Checking gix-hash v0.15.1
Checking similar v2.5.0
Checking same-file v1.0.6
Checking normalize-line-endings v0.3.0
Checking snapbox v0.4.17
Checking walkdir v2.5.0
Checking flate2 v1.1.1
Checking radicle-signals v0.11.0 (/56dc18f9-fcd6-4256-9883-e47663db3e94/w/radicle-signals)
Checking prodash v29.0.2
Compiling tree-sitter v0.24.4
Checking sha1_smol v1.0.0
Checking gix-features v0.39.1
Checking unicode-segmentation v1.11.0
Checking numtoa v0.1.0
Checking yansi v0.5.1
Checking diff v0.1.13
Checking pretty_assertions v1.4.0
Compiling xattr v1.3.1
Compiling filetime v0.2.23
Checking home v0.5.9
Compiling escargot v0.5.10
Checking lexopt v0.3.0
Checking gix-path v0.10.15
Compiling tar v0.4.40
Checking termion v2.0.3
Checking newline-converter v0.3.0
Checking fxhash v0.2.1
Checking regex v1.11.1
Checking dyn-clone v1.0.17
Checking unicode-width v0.1.11
Checking streaming-iterator v0.1.9
Checking inquire v0.7.5
Compiling radicle-surf v0.22.0
Checking termion v3.0.0
Checking unicode-display-width v0.3.0
Compiling tree-sitter-go v0.23.4
Compiling tree-sitter-typescript v0.23.2
Compiling tree-sitter-python v0.23.4
Compiling tree-sitter-rust v0.23.2
Compiling tree-sitter-json v0.24.8
Compiling tree-sitter-css v0.23.1
Compiling tree-sitter-bash v0.23.3
Compiling tree-sitter-c v0.23.2
Compiling tree-sitter-ruby v0.23.1
Compiling tree-sitter-toml-ng v0.6.0
Compiling tree-sitter-md v0.3.2
Compiling tree-sitter-html v0.23.2
Checking sqlite3-sys v0.15.2
Checking sqlite v0.32.0
Checking nonempty v0.5.0
Checking base64 v0.13.1
Compiling radicle-cli v0.12.1 (/56dc18f9-fcd6-4256-9883-e47663db3e94/w/radicle-cli)
Checking tree-sitter-highlight v0.24.4
Checking timeago v0.4.2
Checking jiff v0.2.1
Checking winnow v0.6.26
Checking gix-hashtable v0.6.0
Checking gix-validate v0.9.4
Checking memmap2 v0.9.4
Checking gix-chunk v0.4.11
Checking gix-fs v0.12.1
Checking gix-commitgraph v0.25.1
Checking gix-tempfile v15.0.0
Checking shell-words v1.1.0
Checking gix-command v0.4.1
Checking gix-lock v15.0.1
Checking gix-config-value v0.14.12
Checking gix-url v0.28.2
Checking gix-quote v0.4.15
Checking gix-sec v0.10.12
Checking gix-prompt v0.9.1
Checking gix-packetline v0.18.4
Checking gix-credentials v0.26.0
Checking gix-transport v0.44.0
Checking gix-shallow v0.1.0
Compiling maybe-async v0.2.10
Checking arc-swap v1.7.1
Checking popol v3.0.0
Checking either v1.11.0
Checking gix-date v0.9.4
Checking io-reactor v0.5.2
Checking gix-actor v0.33.2
Checking salsa20 v0.10.2
Checking gix-object v0.46.1
Checking socket2 v0.5.7
Compiling radicle-node v0.10.0 (/56dc18f9-fcd6-4256-9883-e47663db3e94/w/radicle-node)
Checking siphasher v0.3.11
Checking bloomy v1.2.0
Checking netservices v0.8.0
Checking scrypt v0.11.0
Checking radicle-systemd v0.9.0 (/56dc18f9-fcd6-4256-9883-e47663db3e94/w/radicle-systemd)
Compiling qcheck-macros v1.0.0
Compiling radicle-remote-helper v0.10.0 (/56dc18f9-fcd6-4256-9883-e47663db3e94/w/radicle-remote-helper)
Checking gix-revwalk v0.17.0
Checking gix-diff v0.49.0
Checking gix-traverse v0.43.1
Checking gix-revision v0.31.1
Checking gix-negotiate v0.17.0
Checking gix-pack v0.56.0
Checking gix-ref v0.49.1
Checking gix-refspec v0.27.0
Checking phf_shared v0.11.3
Checking phf v0.11.3
Checking emojis v0.6.4
Checking gix-protocol v0.47.0
Checking gix-odb v0.66.0
Checking git2 v0.19.0
Checking radicle-git-ext v0.8.0
Checking radicle-term v0.12.0 (/56dc18f9-fcd6-4256-9883-e47663db3e94/w/radicle-term)
Checking radicle-crypto v0.11.0 (/56dc18f9-fcd6-4256-9883-e47663db3e94/w/radicle-crypto)
Checking radicle-cob v0.13.0 (/56dc18f9-fcd6-4256-9883-e47663db3e94/w/radicle-cob)
Checking radicle-crdt v0.1.0 (/56dc18f9-fcd6-4256-9883-e47663db3e94/w/radicle-crdt)
Checking radicle v0.14.0 (/56dc18f9-fcd6-4256-9883-e47663db3e94/w/radicle)
Checking radicle-cli-test v0.10.0 (/56dc18f9-fcd6-4256-9883-e47663db3e94/w/radicle-cli-test)
Checking radicle-fetch v0.10.0 (/56dc18f9-fcd6-4256-9883-e47663db3e94/w/radicle-fetch)
Checking radicle-tools v0.9.0 (/56dc18f9-fcd6-4256-9883-e47663db3e94/w/radicle-tools)
Finished `dev` profile [unoptimized + debuginfo] target(s) in 43.69s
+ cargo build --all-targets --workspace
Compiling cfg-if v1.0.0
Compiling libc v0.2.155
Compiling shlex v1.3.0
Compiling memchr v2.7.2
Compiling typenum v1.17.0
Compiling aho-corasick v1.1.3
Compiling jobserver v0.1.31
Compiling getrandom v0.2.15
Compiling cc v1.2.2
Compiling regex-syntax v0.8.5
Compiling rand_core v0.6.4
Compiling generic-array v0.14.7
Compiling smallvec v1.13.2
Compiling serde v1.0.219
Compiling crypto-common v0.1.6
Compiling log v0.4.21
Compiling fastrand v2.1.0
Compiling regex-automata v0.4.9
Compiling bitflags v2.5.0
Compiling subtle v2.5.0
Compiling zerofrom v0.1.6
Compiling stable_deref_trait v1.2.0
Compiling once_cell v1.19.0
Compiling yoke v0.7.5
Compiling zeroize v1.7.0
Compiling tinyvec_macros v0.1.1
Compiling cpufeatures v0.2.12
Compiling zerovec v0.10.4
Compiling tinyvec v1.6.0
Compiling block-padding v0.3.3
Compiling litemap v0.7.5
Compiling tinystr v0.7.6
Compiling unicode-normalization v0.1.23
Compiling writeable v0.5.5
Compiling bstr v1.9.1
Compiling icu_locid v1.5.0
Compiling inout v0.1.3
Compiling block-buffer v0.10.4
Compiling adler2 v2.0.0
Compiling miniz_oxide v0.8.8
Compiling icu_provider v1.5.0
Compiling digest v0.10.7
Compiling cipher v0.4.4
Compiling crc32fast v1.4.0
Compiling icu_locid_transform_data v1.5.1
Compiling icu_locid_transform v1.5.0
Compiling icu_properties_data v1.5.1
Compiling icu_collections v1.5.0
Compiling icu_normalizer_data v1.5.1
Compiling utf16_iter v1.0.5
Compiling utf8_iter v1.0.4
Compiling write16 v1.0.0
Compiling thiserror v1.0.69
Compiling sha2 v0.10.8
Compiling hashbrown v0.14.3
Compiling icu_properties v1.5.1
Compiling itoa v1.0.11
Compiling linux-raw-sys v0.4.13
Compiling percent-encoding v2.3.1
Compiling form_urlencoded v1.2.1
Compiling universal-hash v0.5.1
Compiling opaque-debug v0.3.1
Compiling libz-sys v1.1.16
Compiling byteorder v1.5.0
Compiling rustix v0.38.34
Compiling ascii v1.1.0
Compiling data-encoding v2.5.0
Compiling signature v1.6.4
Compiling amplify_num v0.5.2
Compiling ed25519 v1.5.3
Compiling icu_normalizer v1.5.0
Compiling idna_adapter v1.2.0
Compiling idna v1.0.3
Compiling amplify v4.6.0
Compiling url v2.5.4
Compiling tempfile v3.10.1
Compiling data-encoding-macro v0.1.14
Compiling libgit2-sys v0.17.0+1.8.1
Compiling aead v0.5.2
Compiling base-x v0.2.11
Compiling ct-codecs v1.1.1
Compiling multibase v0.9.1
Compiling ec25519 v0.1.0
Compiling poly1305 v0.8.0
Compiling chacha20 v0.9.1
Compiling keccak v0.1.5
Compiling cyphergraphy v0.3.0
Compiling sha3 v0.10.8
Compiling polyval v0.6.2
Compiling git-ref-format-core v0.3.0
Compiling hmac v0.12.1
Compiling sqlite3-src v0.5.1
Compiling base32 v0.4.0
Compiling base64ct v1.6.0
Compiling ppv-lite86 v0.2.17
Compiling pem-rfc7468 v0.7.0
Compiling rand_chacha v0.3.1
Compiling cypheraddr v0.4.0
Compiling pbkdf2 v0.12.2
Compiling git-ref-format-macro v0.3.0
Compiling ghash v0.5.1
Compiling chacha20poly1305 v0.10.1
Compiling ctr v0.9.2
Compiling aes v0.8.4
Compiling thiserror v2.0.12
Compiling git-ref-format v0.3.0
Compiling noise-framework v0.4.0
Compiling aes-gcm v0.10.3
Compiling socks5-client v0.4.1
Compiling rand v0.8.5
Compiling ssh-encoding v0.2.0
Compiling blowfish v0.9.1
Compiling cbc v0.1.2
Compiling radicle-std-ext v0.1.0
Compiling ssh-cipher v0.2.0
Compiling bcrypt-pbkdf v0.10.0
Compiling cyphernet v0.5.2
Compiling crossbeam-utils v0.8.19
Compiling signature v2.2.0
Compiling crossbeam-channel v0.5.15
Compiling ssh-key v0.6.6
Compiling qcheck v1.0.0
Compiling radicle-ssh v0.9.0 (/56dc18f9-fcd6-4256-9883-e47663db3e94/w/radicle-ssh)
Compiling equivalent v1.0.1
Compiling indexmap v2.2.6
Compiling ryu v1.0.17
Compiling tree-sitter-language v0.1.2
Compiling num-traits v0.2.18
Compiling serde_json v1.0.116
Compiling siphasher v1.0.1
Compiling nonempty v0.9.0
Compiling radicle-dag v0.10.0 (/56dc18f9-fcd6-4256-9883-e47663db3e94/w/radicle-dag)
Compiling lazy_static v1.5.0
Compiling scopeguard v1.2.0
Compiling gix-trace v0.1.12
Compiling iana-time-zone v0.1.60
Compiling anstyle-query v1.0.2
Compiling chrono v0.4.38
Compiling lock_api v0.4.11
Compiling parking_lot_core v0.9.9
Compiling colored v2.1.0
Compiling bytesize v2.0.1
Compiling localtime v1.3.1
Compiling base64 v0.21.7
Compiling utf8parse v0.2.1
Compiling anstyle-parse v0.2.3
Compiling parking_lot v0.12.1
Compiling anyhow v1.0.82
Compiling faster-hex v0.9.0
Compiling sem_safe v0.2.0
Compiling errno v0.3.9
Compiling colorchoice v1.0.0
Compiling anstyle v1.0.6
Compiling signals_receipts v0.2.0
Compiling anstream v0.6.13
Compiling gix-utils v0.1.14
Compiling snapbox-macros v0.3.8
Compiling gix-hash v0.15.1
Compiling similar v2.5.0
Compiling normalize-line-endings v0.3.0
Compiling same-file v1.0.6
Compiling snapbox v0.4.17
Compiling walkdir v2.5.0
Compiling radicle-signals v0.11.0 (/56dc18f9-fcd6-4256-9883-e47663db3e94/w/radicle-signals)
Compiling prodash v29.0.2
Compiling flate2 v1.1.1
Compiling tree-sitter v0.24.4
Compiling sha1_smol v1.0.0
Compiling gix-features v0.39.1
Compiling yansi v0.5.1
Compiling numtoa v0.1.0
Compiling diff v0.1.13
Compiling unicode-segmentation v1.11.0
Compiling pretty_assertions v1.4.0
Compiling xattr v1.3.1
Compiling filetime v0.2.23
Compiling home v0.5.9
Compiling lexopt v0.3.0
Compiling gix-path v0.10.15
Compiling tar v0.4.40
Compiling newline-converter v0.3.0
Compiling termion v2.0.3
Compiling fxhash v0.2.1
Compiling regex v1.11.1
Compiling unicode-width v0.1.11
Compiling streaming-iterator v0.1.9
Compiling dyn-clone v1.0.17
Compiling inquire v0.7.5
Compiling radicle-surf v0.22.0
Compiling escargot v0.5.10
Compiling unicode-display-width v0.3.0
Compiling termion v3.0.0
Compiling tree-sitter-json v0.24.8
Compiling tree-sitter-c v0.23.2
Compiling tree-sitter-toml-ng v0.6.0
Compiling tree-sitter-bash v0.23.3
Compiling tree-sitter-md v0.3.2
Compiling tree-sitter-css v0.23.1
Compiling tree-sitter-python v0.23.4
Compiling tree-sitter-ruby v0.23.1
Compiling tree-sitter-typescript v0.23.2
Compiling tree-sitter-rust v0.23.2
Compiling tree-sitter-go v0.23.4
Compiling tree-sitter-html v0.23.2
Compiling sqlite3-sys v0.15.2
Compiling sqlite v0.32.0
Compiling radicle-cli v0.12.1 (/56dc18f9-fcd6-4256-9883-e47663db3e94/w/radicle-cli)
Compiling nonempty v0.5.0
Compiling base64 v0.13.1
Compiling tree-sitter-highlight v0.24.4
Compiling timeago v0.4.2
Compiling jiff v0.2.1
Compiling winnow v0.6.26
Compiling gix-hashtable v0.6.0
Compiling gix-validate v0.9.4
Compiling memmap2 v0.9.4
Compiling gix-chunk v0.4.11
Compiling gix-commitgraph v0.25.1
Compiling gix-fs v0.12.1
Compiling gix-tempfile v15.0.0
Compiling shell-words v1.1.0
Compiling gix-command v0.4.1
Compiling gix-lock v15.0.1
Compiling gix-url v0.28.2
Compiling gix-config-value v0.14.12
Compiling gix-quote v0.4.15
Compiling gix-sec v0.10.12
Compiling gix-prompt v0.9.1
Compiling gix-packetline v0.18.4
Compiling gix-date v0.9.4
Compiling gix-transport v0.44.0
Compiling gix-actor v0.33.2
Compiling gix-object v0.46.1
Compiling gix-credentials v0.26.0
Compiling gix-revwalk v0.17.0
Compiling gix-traverse v0.43.1
Compiling gix-revision v0.31.1
Compiling gix-diff v0.49.0
Compiling gix-negotiate v0.17.0
Compiling gix-pack v0.56.0
Compiling gix-refspec v0.27.0
Compiling gix-ref v0.49.1
Compiling gix-shallow v0.1.0
Compiling arc-swap v1.7.1
Compiling popol v3.0.0
Compiling gix-odb v0.66.0
Compiling gix-protocol v0.47.0
Compiling either v1.11.0
Compiling io-reactor v0.5.2
Compiling salsa20 v0.10.2
Compiling socket2 v0.5.7
Compiling siphasher v0.3.11
Compiling radicle-node v0.10.0 (/56dc18f9-fcd6-4256-9883-e47663db3e94/w/radicle-node)
Compiling netservices v0.8.0
Compiling bloomy v1.2.0
Compiling scrypt v0.11.0
Compiling radicle-systemd v0.9.0 (/56dc18f9-fcd6-4256-9883-e47663db3e94/w/radicle-systemd)
Compiling radicle-remote-helper v0.10.0 (/56dc18f9-fcd6-4256-9883-e47663db3e94/w/radicle-remote-helper)
Compiling phf_shared v0.11.3
Compiling phf v0.11.3
Compiling emojis v0.6.4
Compiling git2 v0.19.0
Compiling radicle-git-ext v0.8.0
Compiling radicle-term v0.12.0 (/56dc18f9-fcd6-4256-9883-e47663db3e94/w/radicle-term)
Compiling radicle-crypto v0.11.0 (/56dc18f9-fcd6-4256-9883-e47663db3e94/w/radicle-crypto)
Compiling radicle-cob v0.13.0 (/56dc18f9-fcd6-4256-9883-e47663db3e94/w/radicle-cob)
Compiling radicle v0.14.0 (/56dc18f9-fcd6-4256-9883-e47663db3e94/w/radicle)
Compiling radicle-crdt v0.1.0 (/56dc18f9-fcd6-4256-9883-e47663db3e94/w/radicle-crdt)
Compiling radicle-cli-test v0.10.0 (/56dc18f9-fcd6-4256-9883-e47663db3e94/w/radicle-cli-test)
Compiling radicle-fetch v0.10.0 (/56dc18f9-fcd6-4256-9883-e47663db3e94/w/radicle-fetch)
Compiling radicle-tools v0.9.0 (/56dc18f9-fcd6-4256-9883-e47663db3e94/w/radicle-tools)
Finished `dev` profile [unoptimized + debuginfo] target(s) in 1m 09s
+ cargo doc --workspace --no-deps
Compiling syn v1.0.109
Checking radicle-ssh v0.9.0 (/56dc18f9-fcd6-4256-9883-e47663db3e94/w/radicle-ssh)
Checking radicle-dag v0.10.0 (/56dc18f9-fcd6-4256-9883-e47663db3e94/w/radicle-dag)
Checking radicle-signals v0.11.0 (/56dc18f9-fcd6-4256-9883-e47663db3e94/w/radicle-signals)
Compiling radicle-cli v0.12.1 (/56dc18f9-fcd6-4256-9883-e47663db3e94/w/radicle-cli)
Compiling radicle-node v0.10.0 (/56dc18f9-fcd6-4256-9883-e47663db3e94/w/radicle-node)
Checking radicle-systemd v0.9.0 (/56dc18f9-fcd6-4256-9883-e47663db3e94/w/radicle-systemd)
Checking radicle-term v0.12.0 (/56dc18f9-fcd6-4256-9883-e47663db3e94/w/radicle-term)
Documenting radicle-term v0.12.0 (/56dc18f9-fcd6-4256-9883-e47663db3e94/w/radicle-term)
Documenting radicle-signals v0.11.0 (/56dc18f9-fcd6-4256-9883-e47663db3e94/w/radicle-signals)
Documenting radicle-ssh v0.9.0 (/56dc18f9-fcd6-4256-9883-e47663db3e94/w/radicle-ssh)
Documenting radicle-dag v0.10.0 (/56dc18f9-fcd6-4256-9883-e47663db3e94/w/radicle-dag)
Documenting radicle-systemd v0.9.0 (/56dc18f9-fcd6-4256-9883-e47663db3e94/w/radicle-systemd)
Compiling amplify_syn v2.0.1
Compiling proc-macro-error v1.0.4
Compiling data-encoding-macro-internal v0.1.12
Compiling git-ref-format-macro v0.3.0
Compiling amplify_derive v4.0.0
Checking data-encoding-macro v0.1.14
Checking git-ref-format v0.3.0
Checking multibase v0.9.1
Checking radicle-git-ext v0.8.0
Checking radicle-surf v0.22.0
Checking amplify v4.6.0
Checking cyphergraphy v0.3.0
Checking io-reactor v0.5.2
Checking cypheraddr v0.4.0
Checking noise-framework v0.4.0
Checking socks5-client v0.4.1
Checking cyphernet v0.5.2
Checking radicle-crypto v0.11.0 (/56dc18f9-fcd6-4256-9883-e47663db3e94/w/radicle-crypto)
Checking netservices v0.8.0
Documenting radicle-crypto v0.11.0 (/56dc18f9-fcd6-4256-9883-e47663db3e94/w/radicle-crypto)
Checking radicle-cob v0.13.0 (/56dc18f9-fcd6-4256-9883-e47663db3e94/w/radicle-cob)
Documenting radicle-crdt v0.1.0 (/56dc18f9-fcd6-4256-9883-e47663db3e94/w/radicle-crdt)
Documenting radicle-cob v0.13.0 (/56dc18f9-fcd6-4256-9883-e47663db3e94/w/radicle-cob)
Checking radicle v0.14.0 (/56dc18f9-fcd6-4256-9883-e47663db3e94/w/radicle)
Documenting radicle v0.14.0 (/56dc18f9-fcd6-4256-9883-e47663db3e94/w/radicle)
Checking radicle-cli-test v0.10.0 (/56dc18f9-fcd6-4256-9883-e47663db3e94/w/radicle-cli-test)
Checking radicle-fetch v0.10.0 (/56dc18f9-fcd6-4256-9883-e47663db3e94/w/radicle-fetch)
Documenting radicle-cli-test v0.10.0 (/56dc18f9-fcd6-4256-9883-e47663db3e94/w/radicle-cli-test)
Documenting radicle-fetch v0.10.0 (/56dc18f9-fcd6-4256-9883-e47663db3e94/w/radicle-fetch)
Documenting radicle-cli v0.12.1 (/56dc18f9-fcd6-4256-9883-e47663db3e94/w/radicle-cli)
Documenting radicle-node v0.10.0 (/56dc18f9-fcd6-4256-9883-e47663db3e94/w/radicle-node)
Checking radicle-remote-helper v0.10.0 (/56dc18f9-fcd6-4256-9883-e47663db3e94/w/radicle-remote-helper)
Documenting radicle-remote-helper v0.10.0 (/56dc18f9-fcd6-4256-9883-e47663db3e94/w/radicle-remote-helper)
Documenting radicle-tools v0.9.0 (/56dc18f9-fcd6-4256-9883-e47663db3e94/w/radicle-tools)
Finished `dev` profile [unoptimized + debuginfo] target(s) in 9.71s
Generated /56dc18f9-fcd6-4256-9883-e47663db3e94/w/target/doc/radicle/index.html and 22 other files
+ cargo test --workspace --no-fail-fast
Finished `test` profile [unoptimized + debuginfo] target(s) in 0.11s
Running unittests src/lib.rs (target/debug/deps/radicle-cbcedab996359b3f)
running 170 tests
test canonical::formatter::test::ascii_control_characters ... ok
test canonical::formatter::test::securesystemslib_asserts ... ok
test canonical::formatter::test::ordered_nested_object ... ok
test cob::cache::migrations::_2::tests::test_patch_json_deserialization ... ok
test cob::common::test::test_color ... ok
test cob::cache::migrations::_2::tests::test_migration_2 ... ok
test cob::common::test::test_emojis ... ok
test cob::cache::tests::test_migrate_to ... ok
test cob::cache::tests::test_check_version ... ok
test cob::identity::test::prop_json_eq_str ... ok
test cob::identity::test::test_identity_remove_delegate_concurrent ... ok
test cob::identity::test::test_identity_reject_concurrent ... ok
test cob::identity::test::test_identity_update_rejected ... ok
test cob::identity::test::test_identity_redact_revision ... ok
test cob::identity::test::test_identity_updates ... ok
test cob::issue::cache::tests::test_counts ... ok
test cob::issue::cache::tests::test_get ... ok
test cob::issue::cache::tests::test_is_empty ... ok
test cob::issue::cache::tests::test_list ... ok
test cob::issue::cache::tests::test_list_by_status ... ok
test cob::issue::cache::tests::test_remove ... ok
test cob::identity::test::test_valid_identity ... ok
test cob::identity::test::test_identity_updates_concurrent ... ok
test cob::issue::test::test_embeds ... ok
test cob::identity::test::test_identity_updates_concurrent_outdated ... ok
test cob::issue::test::test_embeds_edit ... ok
test cob::issue::test::test_concurrency ... ok
test cob::issue::test::test_invalid_actions ... ok
test cob::issue::test::test_invalid_tx ... ok
test cob::issue::test::test_invalid_cob ... ok
test cob::issue::test::test_issue_all ... ok
test cob::issue::test::test_issue_comment ... ok
test cob::issue::test::test_issue_comment_redact ... ok
test cob::issue::test::test_issue_create_and_change_state ... ok
test cob::issue::test::test_issue_create_and_assign ... ok
test cob::issue::test::test_issue_create_and_get ... ok
test cob::issue::test::test_issue_edit ... ok
test cob::issue::test::test_issue_create_and_unassign ... ok
test cob::issue::test::test_issue_create_and_reassign ... ok
test cob::issue::test::test_issue_edit_description ... ok
test cob::issue::test::test_issue_multilines ... ok
test cob::issue::test::test_issue_state_serde ... ok
test cob::issue::test::test_ordering ... ok
test cob::issue::test::test_issue_react ... ok
test cob::issue::test::test_issue_label ... ok
test cob::issue::test::test_issue_reply ... ok
test cob::patch::cache::tests::test_is_empty ... ok
test cob::patch::cache::tests::test_get ... ok
test cob::patch::cache::tests::test_list ... ok
test cob::patch::cache::tests::test_list_by_status ... ok
test cob::patch::test::test_json ... ok
test cob::patch::test::test_json_serialization ... ok
test cob::patch::cache::tests::test_remove ... ok
test cob::patch::test::test_patch_create_and_get ... ok
test cob::patch::cache::tests::test_counts ... ok
test cob::patch::test::test_patch_merge ... ok
test cob::patch::test::test_patch_discussion ... ok
test cob::patch::test::test_patch_redact ... ok
test cob::patch::test::test_patch_review ... ok
test cob::patch::test::test_patch_review_comment ... ok
test cob::patch::test::test_patch_review_duplicate ... ok
test cob::patch::test::test_patch_review_edit ... ok
test cob::patch::test::test_patch_review_edit_comment ... ok
test cob::patch::test::test_patch_review_remove_summary ... ok
test cob::patch::test::test_reactions_json_serialization ... ok
test cob::patch::test::test_revision_edit_redact ... ok
test cob::patch::test::test_revision_reaction ... ok
test cob::patch::test::test_revision_review_merge_redacted ... ok
test cob::patch::test::test_patch_review_revision_redact ... ok
test cob::thread::tests::test_comment_edit_missing ... ok
test cob::thread::tests::test_comment_edit_redacted ... ok
test cob::thread::tests::test_comment_redact_missing ... ok
test cob::thread::tests::test_duplicate_comments ... ok
test cob::thread::tests::test_edit_comment ... ok
test cob::thread::tests::test_redact_comment ... ok
test cob::thread::tests::test_timeline ... ok
test cob::patch::test::test_patch_update ... ok
test git::canonical::tests::test_quorum_merges ... ok
test git::canonical::tests::test_quorum ... ok
test git::test::test_version_from_str ... ok
test git::test::test_version_ord ... ok
test identity::did::test::test_did_encode_decode ... ok
test identity::did::test::test_did_vectors ... ok
test identity::doc::id::test::prop_from_str ... ok
test git::canonical::tests::test_quorum_properties ... ok
test identity::doc::test::test_canonical_doc ... ok
test identity::doc::test::test_canonical_example ... ok
test identity::doc::test::test_duplicate_dids ... ok
test identity::doc::test::test_future_version_error ... ok
test identity::doc::test::test_is_valid_version ... ok
test cob::thread::tests::prop_ordering ... ok
test identity::doc::test::test_not_found ... ok
test identity::doc::test::test_parse_version ... ok
test identity::doc::test::test_visibility_json ... ok
test identity::project::test::test_project_name ... ok
test identity::doc::test::test_max_delegates ... ok
test node::address::store::test::test_disconnected ... ok
test node::address::store::test::test_disconnected_ban ... ok
test node::address::store::test::test_alias ... ok
test node::address::store::test::test_entries ... ok
test node::address::store::test::test_get_none ... ok
test node::address::store::test::test_insert_and_get ... ok
test node::address::store::test::test_insert_and_remove ... ok
test node::address::store::test::test_insert_and_update ... ok
test node::address::store::test::test_insert_duplicate ... ok
test node::address::store::test::test_node_aliases ... ok
test node::address::store::test::test_remove_nothing ... ok
test node::db::test::test_version ... ok
test node::features::test::test_operations ... ok
test node::notifications::store::test::test_branch_notifications ... ok
test node::notifications::store::test::test_clear ... ok
test node::notifications::store::test::test_cob_notifications ... ok
test node::notifications::store::test::test_counts_by_repo ... ok
test node::notifications::store::test::test_duplicate_notifications ... ok
test node::notifications::store::test::test_notification_status ... ok
test node::policy::store::test::test_follow_and_unfollow_node ... ok
test node::policy::store::test::test_node_aliases ... ok
test node::policy::store::test::test_node_policies ... ok
test node::policy::store::test::test_node_policy ... ok
test node::policy::store::test::test_repo_policies ... ok
test node::policy::store::test::test_repo_policy ... ok
test node::policy::store::test::test_seed_and_unseed_repo ... ok
test node::policy::store::test::test_update_alias ... ok
test node::address::store::test::test_empty ... ok
test node::policy::store::test::test_update_scope ... ok
test node::refs::store::test::test_count ... ok
test node::refs::store::test::test_set_and_delete ... ok
test node::refs::store::test::test_set_and_get ... ok
test node::routing::test::test_count ... ok
test node::routing::test::test_insert_and_get ... ok
test node::routing::test::test_entries ... ok
test node::routing::test::test_insert_and_get_resources ... ok
test node::routing::test::test_insert_and_remove ... ok
test node::routing::test::test_insert_duplicate ... ok
test node::routing::test::test_len ... ok
test node::routing::test::test_insert_existing_updated_time ... ok
test node::routing::test::test_remove_many ... ok
test node::routing::test::test_remove_redundant ... ok
test node::routing::test::test_update_existing_multi ... ok
test node::test::test_alias ... ok
test node::test::test_command_result ... ok
test node::test::test_user_agent ... ok
test node::timestamp::tests::test_timestamp_max ... ok
test profile::test::canonicalize_home ... ok
test profile::test::test_config ... ok
test node::routing::test::test_prune ... ok
test rad::tests::test_checkout ... ok
test rad::tests::test_fork ... ok
test serde_ext::test::test_localtime ... ok
test serde_ext::test::test_localtime_ext ... ok
test rad::tests::test_init ... ok
test storage::git::tests::test_references_of ... ok
test storage::git::tests::test_sign_refs ... ok
test storage::git::transport::local::url::test::test_url_parse ... ok
test storage::git::transport::local::url::test::test_url_to_string ... ok
test storage::git::transport::remote::url::test::test_url_parse ... ok
test storage::refs::tests::prop_canonical_roundtrip ... ok
test storage::git::tests::test_remote_refs ... ok
test storage::tests::test_storage ... ok
test test::assert::test::assert_with_message ... ok
test test::assert::test::test_assert_no_move ... ok
test test::assert::test::test_assert_panic_0 - should panic ... ok
test test::assert::test::test_assert_panic_1 - should panic ... ok
test test::assert::test::test_assert_panic_2 - should panic ... ok
test test::assert::test::test_assert_succeed ... ok
test test::assert::test::test_panic_message ... ok
test version::test::test_version ... ok
test storage::refs::tests::test_rid_verification ... ok
test identity::doc::test::prop_encode_decode ... ok
test cob::patch::cache::tests::test_find_by_revision ... ok
test result: ok. 170 passed; 0 failed; 0 ignored; 0 measured; 0 filtered out; finished in 2.63s
Running unittests src/lib.rs (target/debug/deps/radicle_cli-251748f5cc5248ac)
running 14 tests
test commands::rad_inspect::test::test_tree ... ok
test commands::rad_patch::review::builder::tests::test_review_comments_split_hunk ... ok
test commands::rad_patch::review::builder::tests::test_review_comments_basic ... ok
test commands::rad_patch::review::builder::tests::test_review_comments_multiline ... ok
test git::pretty_diff::test::test_pretty ... ignored
test git::ddiff::tests::diff_encode_decode_ddiff_hunk ... ok
test git::unified_diff::test::test_diff_content_encode_decode_content ... ok
test commands::rad_patch::review::builder::tests::test_review_comments_before ... ok
test git::unified_diff::test::test_diff_encode_decode_diff ... ok
test terminal::format::test::test_bytes ... ok
test terminal::format::test::test_strip_comments ... ok
test terminal::patch::test::test_edit_display_message ... ok
test terminal::patch::test::test_create_display_message ... ok
test terminal::patch::test::test_update_display_message ... ok
test result: ok. 13 passed; 0 failed; 1 ignored; 0 measured; 0 filtered out; finished in 0.01s
Running unittests src/main.rs (target/debug/deps/rad-01072814f956d8cf)
running 0 tests
test result: ok. 0 passed; 0 failed; 0 ignored; 0 measured; 0 filtered out; finished in 0.00s
Running tests/commands.rs (target/debug/deps/commands-e9a839806588f1b1)
running 91 tests
test framework_home ... ok
test git_push_and_fetch ... ok
test git_push_amend ... ok
test git_push_diverge ... ok
test rad_auth ... ok
test rad_auth_errors ... ok
test rad_block ... ok
test rad_checkout ... ok
test git_push_rollback ... ok
test git_tag ... ok
test rad_clone ... ok
test rad_clean ... ok
test git_push_converge ... ok
test rad_clone_all ... ok
test rad_clone_unknown ... ok
test rad_clone_directory ... ok
test rad_cob_log ... ok
test rad_clone_connect ... ok
test rad_clone_partial_fail ... ok
test rad_config ... ok
test rad_cob_migrate ... ok
test rad_cob_show ... ok
test rad_diff ... ok
test rad_id_collaboration ... ignored, slow
test rad_id ... ok
test rad_id_conflict ... ok
test rad_id_private ... ok
test rad_id_threshold ... ok
test rad_id_multi_delegate ... ok
test rad_id_unknown_field ... ok
test rad_id_update_delete_field ... ok
test rad_id_threshold_soft_fork ... ok
test rad_init ... ok
test rad_init_existing ... ok
test rad_init_no_git ... ok
test rad_init_no_seed ... ok
test rad_init_private ... ok
test rad_inbox ... ok
test rad_init_private_clone ... ok
test rad_init_private_no_seed ... ok
test rad_init_private_clone_seed ... ok
test rad_init_private_seed ... ok
test rad_fetch ... ok
test rad_fork ... ok
test rad_init_sync_not_connected ... ok
test rad_init_sync_preferred ... ok
test rad_init_with_existing_remote ... ok
test rad_inspect ... ok
test rad_issue ... ok
test rad_job ... ok
test rad_merge_after_update ... ok
test rad_merge_no_ff ... ok
test rad_merge_via_push ... ok
test rad_node_connect ... ok
test rad_patch ... ok
test rad_patch_ahead_behind ... ok
test rad_node ... ok
test rad_patch_change_base ... ok
test rad_patch_checkout ... ok
test rad_patch_checkout_revision ... ok
test rad_patch_checkout_force ... ok
test rad_patch_detached_head ... ok
test rad_patch_diff ... ok
test rad_patch_draft ... ok
test rad_init_sync_timeout ... ok
test rad_init_sync_and_clone ... ok
test rad_patch_edit ... ok
test rad_patch_fetch_2 ... ok
test rad_patch_merge_draft ... ok
test rad_patch_fetch_1 ... ok
test rad_patch_delete ... ok
test rad_patch_revert_merge ... ok
test rad_patch_update ... ok
test rad_patch_open_explore ... ok
test rad_publish ... ok
test rad_patch_via_push ... ok
test rad_review_by_hunk ... ok
test rad_seed_and_follow ... ok
test rad_self ... ok
test rad_remote ... ok
test rad_sync_without_node ... ok
test rad_push_and_pull_patches ... ok
test rad_unseed ... ok
test rad_sync ... ok
test rad_watch ... ok
test test_clone_without_seeds ... ok
test test_cob_deletion ... ok
test test_cob_replication ... ok
test rad_workflow ... ok
test rad_patch_pull_update ... ok
test test_replication_via_seed ... ok
test result: ok. 90 passed; 0 failed; 1 ignored; 0 measured; 0 filtered out; finished in 70.66s
Running unittests src/lib.rs (target/debug/deps/radicle_cli_test-019416717c61773a)
running 3 tests
test tests::test_parse ... ok
test tests::test_run ... ok
test tests::test_example_spaced_brackets ... ok
test result: ok. 3 passed; 0 failed; 0 ignored; 0 measured; 0 filtered out; finished in 0.00s
Running unittests src/lib.rs (target/debug/deps/radicle_cob-51e2cb672c60c662)
running 8 tests
test object::tests::test_serde ... ok
test tests::invalid_parse_refstr ... ok
test tests::parse_refstr ... ok
test tests::traverse_cobs ... ok
test tests::list_cobs ... ok
test type_name::test::valid_typenames ... ok
test tests::roundtrip ... ok
test tests::update_cob ... ok
test result: ok. 8 passed; 0 failed; 0 ignored; 0 measured; 0 filtered out; finished in 0.02s
Running unittests src/lib.rs (target/debug/deps/radicle_crdt-7e149ccf4e56bbfc)
running 24 tests
test immutable::test::test_merge_equal ... ok
test immutable::test::test_merge_inequal - should panic ... ok
test lwwmap::tests::test_insert ... ok
test lwwmap::tests::test_insert_remove ... ok
test lwwmap::tests::test_is_empty ... ok
test lwwmap::tests::test_remove_insert ... ok
test lwwreg::tests::prop_semilattice ... ok
test lwwreg::tests::test_merge ... ok
test lwwreg::tests::test_set_get ... ok
test gset::tests::prop_semilattice ... ok
test lwwset::tests::test_insert ... ok
test lwwset::tests::test_insert_remove ... ok
test lwwset::tests::test_remove_insert ... ok
test redactable::test::prop_invariants ... ok
test redactable::test::test_both_present ... ok
test redactable::test::test_redacted ... ok
test test::test_generator ... ok
test tests::prop_bool_laws ... ok
test tests::prop_option_laws ... ok
test tests::test_bool ... ok
test tests::test_option ... ok
test lwwmap::tests::prop_semilattice ... ok
test gmap::tests::prop_semilattice ... ok
test lwwset::tests::prop_semilattice ... ok
test result: ok. 24 passed; 0 failed; 0 ignored; 0 measured; 0 filtered out; finished in 0.06s
Running unittests src/lib.rs (target/debug/deps/radicle_crypto-636ff488446c56b4)
running 12 tests
test ssh::fmt::test::test_key ... ok
test ssh::fmt::test::test_fingerprint ... ok
test ssh::keystore::tests::test_init_no_passphrase ... ok
test ssh::test::prop_encode_decode_sk ... ok
test ssh::test::test_agent_encoding_remove ... ok
test ssh::test::test_agent_encoding_sign ... ok
test tests::prop_encode_decode ... ok
test tests::test_e25519_dh ... ok
test tests::test_encode_decode ... ok
test tests::prop_key_equality ... ok
test ssh::keystore::tests::test_signer ... ok
test ssh::keystore::tests::test_init_passphrase ... ok
test result: ok. 12 passed; 0 failed; 0 ignored; 0 measured; 0 filtered out; finished in 0.79s
Running unittests src/lib.rs (target/debug/deps/radicle_dag-569b0a6854e86d64)
running 20 tests
test tests::test_contains ... ok
test tests::test_cycle ... ok
test tests::test_dependencies ... ok
test tests::test_fold_diamond ... ok
test tests::test_fold_multiple_roots ... ok
test tests::test_fold_reject ... ok
test tests::test_diamond ... ok
test tests::test_fold_sorting_1 ... ok
test tests::test_fold_sorting_2 ... ok
test tests::test_get ... ok
test tests::test_is_empty ... ok
test tests::test_len ... ok
test tests::test_merge_1 ... ok
test tests::test_complex ... ok
test tests::test_merge_2 ... ok
test tests::test_prune_2 ... ok
test tests::test_prune_1 ... ok
test tests::test_prune_by_sorting ... ok
test tests::test_remove ... ok
test tests::test_siblings ... ok
test result: ok. 20 passed; 0 failed; 0 ignored; 0 measured; 0 filtered out; finished in 0.00s
Running unittests src/lib.rs (target/debug/deps/radicle_fetch-05fcd46c986cb4cd)
running 0 tests
test result: ok. 0 passed; 0 failed; 0 ignored; 0 measured; 0 filtered out; finished in 0.00s
Running unittests src/lib.rs (target/debug/deps/radicle_node-a9151bc25a4f93b5)
running 113 tests
test deserializer::test::test_decode_next ... ok
test deserializer::test::prop_decode_next ... ok
test deserializer::test::test_unparsed ... ok
test control::tests::test_control_socket ... ok
test service::filter::test::test_parameters ... ok
test service::limiter::test::test_limitter_different_rates ... ok
test service::limiter::test::test_limitter_multi ... ok
test service::limiter::test::test_limitter_refill ... ok
test service::gossip::store::test::test_announced ... ok
test control::tests::test_seed_unseed ... ok
test service::filter::test::test_sizes ... ok
test service::message::tests::test_inventory_limit ... ok
test service::message::tests::test_ref_remote_limit ... ok
test service::message::tests::prop_refs_announcement_signing ... ok
test tests::e2e::missing_default_branch ... ok
test tests::e2e::missing_delegate_default_branch ... ok
test tests::e2e::test_background_foreground_fetch ... ok
test tests::e2e::test_channel_reader_limit ... FAILED
test tests::e2e::test_catchup_on_refs_announcements ... ok
test tests::e2e::test_clone ... ok
test service::message::tests::test_node_announcement_validate ... ok
test tests::e2e::test_dont_fetch_owned_refs ... ok
test tests::e2e::test_fetch_followed_remotes ... ok
test tests::e2e::test_connection_crossing ... ok
test tests::e2e::test_fetch_preserve_owned_refs ... ok
test tests::e2e::test_fetch_unseeded ... ok
test tests::e2e::test_concurrent_fetches ... ok
test tests::e2e::test_fetch_up_to_date ... ok
test tests::e2e::test_inventory_sync_basic ... ok
test tests::e2e::test_large_fetch ... ok
test tests::e2e::test_migrated_clone ... ok
test tests::e2e::test_missing_remote ... ok
test tests::e2e::test_multiple_offline_inits ... ok
test tests::e2e::test_non_fastforward_sigrefs ... ok
test tests::e2e::test_outdated_delegate_sigrefs ... ok
test tests::e2e::test_outdated_sigrefs ... ok
test tests::e2e::test_replication ... ok
test tests::e2e::test_replication_invalid ... ok
test tests::e2e::test_replication_ref_in_sigrefs ... ok
test tests::e2e::test_inventory_sync_bridge ... ok
test tests::e2e::test_inventory_sync_ring ... ok
test tests::e2e::test_inventory_sync_star ... ok
test tests::test_announcement_rebroadcast ... ok
test tests::test_announcement_rebroadcast_duplicates ... ok
test tests::test_announcement_rebroadcast_timestamp_filtered ... ok
test tests::test_announcement_relay ... ok
test tests::test_connection_kept_alive ... ok
test tests::test_disconnecting_unresponsive_peer ... ok
test tests::test_fetch_missing_inventory_on_gossip ... ok
test tests::test_fetch_missing_inventory_on_schedule ... ok
test tests::test_inbound_connection ... ok
test tests::test_inventory_decode ... ok
test tests::test_init_and_seed ... ok
test tests::test_inventory_relay ... ok
test tests::test_inventory_relay_bad_timestamp ... ok
test tests::test_inventory_sync ... ok
test tests::test_maintain_connections ... ok
test tests::test_maintain_connections_failed_attempt ... ok
test tests::test_maintain_connections_transient ... ok
test tests::test_outbound_connection ... ok
test tests::test_inventory_pruning ... ok
test tests::test_persistent_peer_connect ... ok
test tests::test_persistent_peer_reconnect_success ... ok
test tests::test_persistent_peer_reconnect_attempt ... ok
test tests::test_ping_response ... ok
test tests::test_queued_fetch_from_ann_same_rid ... ok
test tests::test_queued_fetch_from_command_same_rid ... ok
test tests::test_queued_fetch_max_capacity ... ok
test tests::test_redundant_connect ... ok
test tests::test_refs_announcement_followed ... ok
test tests::test_refs_announcement_fetch_trusted_no_inventory ... ok
test tests::test_refs_announcement_no_subscribe ... ok
test tests::test_refs_announcement_offline ... ok
test tests::test_refs_announcement_relay_private ... ok
test tests::test_refs_announcement_relay_public ... ok
test tests::test_refs_synced_event ... ok
test tests::test_seeding ... ok
test wire::frame::test::test_stream_id ... ok
test wire::message::tests::prop_addr ... ok
test tests::test_seed_repo_subscribe ... ok
test wire::message::tests::prop_message_encode_decode ... ok
test wire::message::tests::prop_zero_bytes_encode_decode ... ok
test wire::message::tests::test_inv_ann_max_size ... ok
test wire::message::tests::test_node_ann_max_size ... ok
test wire::message::tests::test_pingpong_encode_max_size ... ok
test wire::message::tests::test_pingpong_encode_size_overflow ... ok
test tests::prop_inventory_exchange_dense ... ok
test wire::protocol::test::test_inventory_ann_with_extension ... ok
test wire::protocol::test::test_pong_message_with_extension ... ok
test wire::tests::prop_filter ... ok
test wire::tests::prop_id ... ok
test wire::tests::prop_oid ... ok
test wire::tests::prop_pubkey ... ok
test wire::tests::prop_refs ... ok
test wire::tests::prop_signature ... ok
test wire::tests::prop_signed_refs ... ok
test wire::tests::prop_string ... ok
test wire::tests::prop_tuple ... ok
test wire::tests::prop_u16 ... ok
test wire::tests::prop_u32 ... ok
test wire::tests::prop_u64 ... ok
test wire::tests::prop_u8 ... ok
test wire::tests::prop_vec ... ok
test wire::tests::test_alias ... ok
test wire::tests::test_bounded_vec_limit ... ok
test wire::tests::test_filter_invalid ... ok
test wire::tests::test_string ... ok
test wire::varint::test::prop_encode_decode ... ok
test wire::varint::test::test_encode_overflow - should panic ... ok
test wire::varint::test::test_encoding ... ok
test wire::message::tests::prop_message_decoder ... ok
test wire::message::tests::test_refs_ann_max_size ... ok
test tests::test_announcement_message_amplification ... ok
failures:
---- tests::e2e::test_channel_reader_limit stdout ----
1788808623 test: Node::init alice: z6Mkq1UH16UDLYkacMT2bPVAE2swUYDKLxYGDygqe3gvYt1L
1788808623 test: Node::init bob: z6MkkNFtQ8rPWChdYE1yoGun1MBbYzDDbfN3xLWk4rigCXSB
1788808623 tests::e2e::test_channel_reader_limit storage: Setting ref: refs/rad/id -> f3d20ab34ec8148eed0f5977a1d207363c726e14
1788808623 tests::e2e::test_channel_reader_limit storage: Setting ref: refs/heads/master -> f2de534b5e81d7c6e2dcaf58c3dd91573c0a0354
1788808623 tests::e2e::test_channel_reader_limit storage: Setting ref: HEAD -> refs/heads/master
1788808623 test: Initialized project rad:z3T1qJh6kGYeCop3USPkyk1DZKkzv for node z6Mkq1UH16UDLYkacMT2bPVAE2swUYDKLxYGDygqe3gvYt1L
1788808623 tests::e2e::test_channel_reader_limit node: Opening policy database..
1788808623 tests::e2e::test_channel_reader_limit node: Migrating COBs cache..
1788808623 tests::e2e::test_channel_reader_limit node: Migration of COBs cache complete (version=2)..
1788808623 tests::e2e::test_channel_reader_limit node: Default seeding policy set to 'block (all)'
1788808623 tests::e2e::test_channel_reader_limit node: Initializing service (Test)..
1788808623 tests::e2e::test_channel_reader_limit node: Opening node database..
1788808623 tests::e2e::test_channel_reader_limit node: Address book is empty. Adding bootstrap nodes..
1788808623 tests::e2e::test_channel_reader_limit node: 0 nodes added to address book
1788808623 tests::e2e::test_channel_reader_limit service: Init @1788808623101
1788808623 tests::e2e::test_channel_reader_limit service: Empty refs database, populating from storage..
1788808623 tests::e2e::test_channel_reader_limit service: Saved local sync status for rad:z3T1qJh6kGYeCop3USPkyk1DZKkzv..
1788808623 tests::e2e::test_channel_reader_limit service: Adding refs announcement for rad:z3T1qJh6kGYeCop3USPkyk1DZKkzv to historical gossip messages..
1788808623 tests::e2e::test_channel_reader_limit service: Not enough available peers to connect to (available=0, wanted=8)
1788808623 z6Mkq1UH16UDLYkacMT2bPVAE2swUYDKLxYGDygqe3gvYt1L <service> node: Listening on 0.0.0.0:43379..
1788808623 tests::e2e::test_channel_reader_limit node: Binding control socket /tmp/.tmpjzhVkL/aLj0n21n/node/control.sock..
1788808623 tests::e2e::test_channel_reader_limit node: Opening policy database..
1788808623 z6Mkq1UH16UDLYkacMT2bPVAE2swUYDKLxYGDygqe3gvYt1L <runtime> node: Running node z6Mkq1UH16UDLYkacMT2bPVAE2swUYDKLxYGDygqe3gvYt1L in /tmp/.tmpjzhVkL/aLj0n21n..
1788808623 z6Mkq1UH16UDLYkacMT2bPVAE2swUYDKLxYGDygqe3gvYt1L <control> control: Control thread listening on socket..
1788808623 z6Mkq1UH16UDLYkacMT2bPVAE2swUYDKLxYGDygqe3gvYt1L <signals> node: Signal notifications channel error: receiving on an empty and disconnected channel
1788808623 z6Mkq1UH16UDLYkacMT2bPVAE2swUYDKLxYGDygqe3gvYt1L <service> service: Received command QueryState(..)
1788808623 tests::e2e::test_channel_reader_limit node: Migrating COBs cache..
1788808623 tests::e2e::test_channel_reader_limit node: Migration of COBs cache complete (version=2)..
1788808623 tests::e2e::test_channel_reader_limit node: Default seeding policy set to 'block (all)'
1788808623 tests::e2e::test_channel_reader_limit node: Initializing service (Test)..
1788808623 tests::e2e::test_channel_reader_limit node: Opening node database..
1788808623 tests::e2e::test_channel_reader_limit node: Address book is empty. Adding bootstrap nodes..
1788808623 tests::e2e::test_channel_reader_limit node: 0 nodes added to address book
1788808623 tests::e2e::test_channel_reader_limit service: Init @1788808623165
1788808623 tests::e2e::test_channel_reader_limit service: Empty refs database, populating from storage..
1788808623 tests::e2e::test_channel_reader_limit service: Not enough available peers to connect to (available=0, wanted=8)
1788808623 z6MkkNFtQ8rPWChdYE1yoGun1MBbYzDDbfN3xLWk4rigCXSB <service> node: Listening on 0.0.0.0:38869..
1788808623 tests::e2e::test_channel_reader_limit node: Binding control socket /tmp/.tmpjzhVkL/2iS3aVid/node/control.sock..
1788808623 z6MkkNFtQ8rPWChdYE1yoGun1MBbYzDDbfN3xLWk4rigCXSB <runtime> node: Running node z6MkkNFtQ8rPWChdYE1yoGun1MBbYzDDbfN3xLWk4rigCXSB in /tmp/.tmpjzhVkL/2iS3aVid..
1788808623 z6MkkNFtQ8rPWChdYE1yoGun1MBbYzDDbfN3xLWk4rigCXSB <control> control: Control thread listening on socket..
1788808623 z6MkkNFtQ8rPWChdYE1yoGun1MBbYzDDbfN3xLWk4rigCXSB <signals> node: Signal notifications channel error: receiving on an empty and disconnected channel
1788808623 z6MkkNFtQ8rPWChdYE1yoGun1MBbYzDDbfN3xLWk4rigCXSB <service> service: Received command QueryState(..)
1788808623 z6Mkq1UH16UDLYkacMT2bPVAE2swUYDKLxYGDygqe3gvYt1L <service> service: Received command QueryState(..)
1788808623 z6Mkq1UH16UDLYkacMT2bPVAE2swUYDKLxYGDygqe3gvYt1L <service> service: Received command Connect(z6MkkNFtQ8rPWChdYE1yoGun1MBbYzDDbfN3xLWk4rigCXSB, 0.0.0.0:38869, ConnectOptions { persistent: false, timeout: 30s })
1788808623 z6Mkq1UH16UDLYkacMT2bPVAE2swUYDKLxYGDygqe3gvYt1L <service> service: Connecting to z6MkkNFtQ8rPWChdYE1yoGun1MBbYzDDbfN3xLWk4rigCXSB (0.0.0.0:38869)..
1788808623 z6Mkq1UH16UDLYkacMT2bPVAE2swUYDKLxYGDygqe3gvYt1L <service> service: Attempted connection to z6MkkNFtQ8rPWChdYE1yoGun1MBbYzDDbfN3xLWk4rigCXSB (0.0.0.0:38869)
1788808623 z6MkkNFtQ8rPWChdYE1yoGun1MBbYzDDbfN3xLWk4rigCXSB <service> wire: Inbound connection from 127.0.0.1:47062 (fd=196)..
1788808623 z6Mkq1UH16UDLYkacMT2bPVAE2swUYDKLxYGDygqe3gvYt1L <service> wire: Registering outbound transport for z6MkkNFtQ8rPWChdYE1yoGun1MBbYzDDbfN3xLWk4rigCXSB (fd=181)..
1788808623 z6Mkq1UH16UDLYkacMT2bPVAE2swUYDKLxYGDygqe3gvYt1L <service> wire: Outbound peer resource registered for z6MkkNFtQ8rPWChdYE1yoGun1MBbYzDDbfN3xLWk4rigCXSB with id=2 (fd=181)
1788808623 z6MkkNFtQ8rPWChdYE1yoGun1MBbYzDDbfN3xLWk4rigCXSB <service> wire: Accepted inbound connection from 127.0.0.1:47062 (fd=196)..
1788808623 z6MkkNFtQ8rPWChdYE1yoGun1MBbYzDDbfN3xLWk4rigCXSB <service> wire: Inbound peer resource registered with id=2 (fd=196)
1788808623 z6Mkq1UH16UDLYkacMT2bPVAE2swUYDKLxYGDygqe3gvYt1L <service> wire: Session established with z6MkkNFtQ8rPWChdYE1yoGun1MBbYzDDbfN3xLWk4rigCXSB (id=2) (fd=181) (outbound)
1788808623 z6Mkq1UH16UDLYkacMT2bPVAE2swUYDKLxYGDygqe3gvYt1L <service> service: Connected to z6MkkNFtQ8rPWChdYE1yoGun1MBbYzDDbfN3xLWk4rigCXSB (0.0.0.0:38869) (Outbound)
1788808623 z6Mkq1UH16UDLYkacMT2bPVAE2swUYDKLxYGDygqe3gvYt1L <service> service: Subscribing to messages since timestamp 1788722223215..
1788808623 z6MkkNFtQ8rPWChdYE1yoGun1MBbYzDDbfN3xLWk4rigCXSB <service> wire: Session established with z6Mkq1UH16UDLYkacMT2bPVAE2swUYDKLxYGDygqe3gvYt1L (id=2) (fd=196) (inbound)
1788808623 z6MkkNFtQ8rPWChdYE1yoGun1MBbYzDDbfN3xLWk4rigCXSB <service> service: Connected to z6Mkq1UH16UDLYkacMT2bPVAE2swUYDKLxYGDygqe3gvYt1L (127.0.0.1:47062) (Inbound)
1788808623 z6MkkNFtQ8rPWChdYE1yoGun1MBbYzDDbfN3xLWk4rigCXSB <service> service: Subscribing to messages since timestamp 1788722223215..
1788808623 test: Node has missing routes: [(RepoId(rad:z3T1qJh6kGYeCop3USPkyk1DZKkzv), PublicKey(z6Mkq1UH16UDLYkacMT2bPVAE2swUYDKLxYGDygqe3gvYt1L))]
1788808623 test: Node z6Mkq1UH16UDLYkacMT2bPVAE2swUYDKLxYGDygqe3gvYt1L has converged
1788808623 z6Mkq1UH16UDLYkacMT2bPVAE2swUYDKLxYGDygqe3gvYt1L <service> service: Received node announcement of z6MkkNFtQ8rPWChdYE1yoGun1MBbYzDDbfN3xLWk4rigCXSB with 0 address(es) from z6MkkNFtQ8rPWChdYE1yoGun1MBbYzDDbfN3xLWk4rigCXSB (t=1788808623165)
1788808623 z6MkkNFtQ8rPWChdYE1yoGun1MBbYzDDbfN3xLWk4rigCXSB <service> service: Received node announcement of z6Mkq1UH16UDLYkacMT2bPVAE2swUYDKLxYGDygqe3gvYt1L with 0 address(es) from z6Mkq1UH16UDLYkacMT2bPVAE2swUYDKLxYGDygqe3gvYt1L (t=1788808623101)
1788808623 z6MkkNFtQ8rPWChdYE1yoGun1MBbYzDDbfN3xLWk4rigCXSB <service> service: Stored announcement from z6Mkq1UH16UDLYkacMT2bPVAE2swUYDKLxYGDygqe3gvYt1L to be broadcast in 0 millisecond(s) (t=1788808623101)
1788808623 z6MkkNFtQ8rPWChdYE1yoGun1MBbYzDDbfN3xLWk4rigCXSB <service> service: Address store entry for node z6Mkq1UH16UDLYkacMT2bPVAE2swUYDKLxYGDygqe3gvYt1L updated at 1788808623101
1788808623 z6MkkNFtQ8rPWChdYE1yoGun1MBbYzDDbfN3xLWk4rigCXSB <service> service: Received inventory announcement of z6Mkq1UH16UDLYkacMT2bPVAE2swUYDKLxYGDygqe3gvYt1L with 1 item(s) from z6Mkq1UH16UDLYkacMT2bPVAE2swUYDKLxYGDygqe3gvYt1L (t=1788808623103)
1788808623 z6Mkq1UH16UDLYkacMT2bPVAE2swUYDKLxYGDygqe3gvYt1L <service> service: Stored announcement from z6MkkNFtQ8rPWChdYE1yoGun1MBbYzDDbfN3xLWk4rigCXSB to be broadcast in 0 millisecond(s) (t=1788808623165)
1788808623 z6MkkNFtQ8rPWChdYE1yoGun1MBbYzDDbfN3xLWk4rigCXSB <service> service: Stored announcement from z6Mkq1UH16UDLYkacMT2bPVAE2swUYDKLxYGDygqe3gvYt1L to be broadcast in 0 millisecond(s) (t=1788808623103)
1788808623 z6Mkq1UH16UDLYkacMT2bPVAE2swUYDKLxYGDygqe3gvYt1L <service> service: Address store entry for node z6MkkNFtQ8rPWChdYE1yoGun1MBbYzDDbfN3xLWk4rigCXSB updated at 1788808623165
1788808623 z6Mkq1UH16UDLYkacMT2bPVAE2swUYDKLxYGDygqe3gvYt1L <service> service: Received inventory announcement of z6MkkNFtQ8rPWChdYE1yoGun1MBbYzDDbfN3xLWk4rigCXSB with 0 item(s) from z6MkkNFtQ8rPWChdYE1yoGun1MBbYzDDbfN3xLWk4rigCXSB (t=1788808623166)
1788808623 z6MkkNFtQ8rPWChdYE1yoGun1MBbYzDDbfN3xLWk4rigCXSB <service> service: Routing table updated for rad:z3T1qJh6kGYeCop3USPkyk1DZKkzv with seed z6Mkq1UH16UDLYkacMT2bPVAE2swUYDKLxYGDygqe3gvYt1L
1788808623 z6Mkq1UH16UDLYkacMT2bPVAE2swUYDKLxYGDygqe3gvYt1L <service> service: Stored announcement from z6MkkNFtQ8rPWChdYE1yoGun1MBbYzDDbfN3xLWk4rigCXSB to be broadcast in 0 millisecond(s) (t=1788808623166)
1788808623 z6Mkq1UH16UDLYkacMT2bPVAE2swUYDKLxYGDygqe3gvYt1L <service> service: Received subscription filter from z6MkkNFtQ8rPWChdYE1yoGun1MBbYzDDbfN3xLWk4rigCXSB
1788808623 z6MkkNFtQ8rPWChdYE1yoGun1MBbYzDDbfN3xLWk4rigCXSB <service> service: Received subscription filter from z6Mkq1UH16UDLYkacMT2bPVAE2swUYDKLxYGDygqe3gvYt1L
1788808623 test: Node z6MkkNFtQ8rPWChdYE1yoGun1MBbYzDDbfN3xLWk4rigCXSB has converged
1788808623 z6MkkNFtQ8rPWChdYE1yoGun1MBbYzDDbfN3xLWk4rigCXSB <service> service: Received command Seed(rad:z3T1qJh6kGYeCop3USPkyk1DZKkzv, all)
1788808623 z6MkkNFtQ8rPWChdYE1yoGun1MBbYzDDbfN3xLWk4rigCXSB <service> service: Sending subscription filter to z6Mkq1UH16UDLYkacMT2bPVAE2swUYDKLxYGDygqe3gvYt1L
1788808623 z6MkkNFtQ8rPWChdYE1yoGun1MBbYzDDbfN3xLWk4rigCXSB <service> service: Received command Fetch(rad:z3T1qJh6kGYeCop3USPkyk1DZKkzv, z6Mkq1UH16UDLYkacMT2bPVAE2swUYDKLxYGDygqe3gvYt1L)
1788808623 z6MkkNFtQ8rPWChdYE1yoGun1MBbYzDDbfN3xLWk4rigCXSB <service> service: Fetch initiated for rad:z3T1qJh6kGYeCop3USPkyk1DZKkzv with z6Mkq1UH16UDLYkacMT2bPVAE2swUYDKLxYGDygqe3gvYt1L [inbound connected] (all remotes)..
1788808623 z6Mkq1UH16UDLYkacMT2bPVAE2swUYDKLxYGDygqe3gvYt1L <service> service: Received subscription filter from z6MkkNFtQ8rPWChdYE1yoGun1MBbYzDDbfN3xLWk4rigCXSB
1788808623 z6MkkNFtQ8rPWChdYE1yoGun1MBbYzDDbfN3xLWk4rigCXSB <service> wire: Opened new stream with id 13 for rad:z3T1qJh6kGYeCop3USPkyk1DZKkzv and remote z6Mkq1UH16UDLYkacMT2bPVAE2swUYDKLxYGDygqe3gvYt1L
1788808623 z6MkkNFtQ8rPWChdYE1yoGun1MBbYzDDbfN3xLWk4rigCXSB <worker#0> worker: Worker processing outgoing fetch for rad:z3T1qJh6kGYeCop3USPkyk1DZKkzv
1788808623 z6Mkq1UH16UDLYkacMT2bPVAE2swUYDKLxYGDygqe3gvYt1L <service> wire: Received `open` command for stream 13 from z6MkkNFtQ8rPWChdYE1yoGun1MBbYzDDbfN3xLWk4rigCXSB
1788808623 z6Mkq1UH16UDLYkacMT2bPVAE2swUYDKLxYGDygqe3gvYt1L <worker#1> worker: Worker processing incoming fetch for z6MkkNFtQ8rPWChdYE1yoGun1MBbYzDDbfN3xLWk4rigCXSB on stream 13..
1788808623 z6MkkNFtQ8rPWChdYE1yoGun1MBbYzDDbfN3xLWk4rigCXSB <worker#0> worker: z6MkkNFtQ8rPWChdYE1yoGun1MBbYzDDbfN3xLWk4rigCXSB cloning from z6Mkq1UH16UDLYkacMT2bPVAE2swUYDKLxYGDygqe3gvYt1L
1788808623 z6Mkq1UH16UDLYkacMT2bPVAE2swUYDKLxYGDygqe3gvYt1L <worker#1> worker: Spawning upload-pack process for rad:z3T1qJh6kGYeCop3USPkyk1DZKkzv on stream 13..
1788808623 z6MkkNFtQ8rPWChdYE1yoGun1MBbYzDDbfN3xLWk4rigCXSB <worker#0> fetch: Fetched rad/id (12ms)
1788808623 z6MkkNFtQ8rPWChdYE1yoGun1MBbYzDDbfN3xLWk4rigCXSB <worker#0> fetch: Clone of rad:z3T1qJh6kGYeCop3USPkyk1DZKkzv from z6Mkq1UH16UDLYkacMT2bPVAE2swUYDKLxYGDygqe3gvYt1L failed with 'sender has exceeded number of allowed bytes, aborting read' (22ms)
1788808623 z6MkkNFtQ8rPWChdYE1yoGun1MBbYzDDbfN3xLWk4rigCXSB <service> wire: Received fetch result from worker for stream 13, remote z6Mkq1UH16UDLYkacMT2bPVAE2swUYDKLxYGDygqe3gvYt1L: Initiator { rid: RepoId(rad:z3T1qJh6kGYeCop3USPkyk1DZKkzv), result: Err(Fetch(Run(Protocol(Step(Io(Custom { kind: Other, error: Parse(Io(Custom { kind: Other, error: "sender has exceeded number of allowed bytes, aborting read" })) })))))) }
1788808623 z6MkkNFtQ8rPWChdYE1yoGun1MBbYzDDbfN3xLWk4rigCXSB <service> wire: Stream 13 of z6Mkq1UH16UDLYkacMT2bPVAE2swUYDKLxYGDygqe3gvYt1L closing with 0 byte(s) sent and 0 byte(s) received
1788808623 z6MkkNFtQ8rPWChdYE1yoGun1MBbYzDDbfN3xLWk4rigCXSB <service> service: Found existing fetch request from z6Mkq1UH16UDLYkacMT2bPVAE2swUYDKLxYGDygqe3gvYt1L, sending result..
1788808623 z6MkkNFtQ8rPWChdYE1yoGun1MBbYzDDbfN3xLWk4rigCXSB <service> service: Sent fetch result for rad:z3T1qJh6kGYeCop3USPkyk1DZKkzv from z6Mkq1UH16UDLYkacMT2bPVAE2swUYDKLxYGDygqe3gvYt1L..
1788808623 z6MkkNFtQ8rPWChdYE1yoGun1MBbYzDDbfN3xLWk4rigCXSB <service> service: Fetch failed for rad:z3T1qJh6kGYeCop3USPkyk1DZKkzv from z6Mkq1UH16UDLYkacMT2bPVAE2swUYDKLxYGDygqe3gvYt1L: sender has exceeded number of allowed bytes, aborting read
thread 'tests::e2e::test_channel_reader_limit' panicked at radicle-node/src/tests/e2e.rs:1531:5:
actual: sender has exceeded number of allowed bytes, aborting read
note: run with `RUST_BACKTRACE=1` environment variable to display a backtrace
1788808623 test: Node z6MkkNFtQ8rPWChdYE1yoGun1MBbYzDDbfN3xLWk4rigCXSB shutting down..
1788808623 z6MkkNFtQ8rPWChdYE1yoGun1MBbYzDDbfN3xLWk4rigCXSB <control> control: Received `{"command":"shutdown"}` on control socket
1788808623 z6MkkNFtQ8rPWChdYE1yoGun1MBbYzDDbfN3xLWk4rigCXSB <control> control: Shutdown requested..
1788808623 z6Mkq1UH16UDLYkacMT2bPVAE2swUYDKLxYGDygqe3gvYt1L <service> wire: Received `close` command for stream 13 from z6MkkNFtQ8rPWChdYE1yoGun1MBbYzDDbfN3xLWk4rigCXSB
1788808623 z6Mkq1UH16UDLYkacMT2bPVAE2swUYDKLxYGDygqe3gvYt1L <service> wire: Stream 13 of z6MkkNFtQ8rPWChdYE1yoGun1MBbYzDDbfN3xLWk4rigCXSB closed with 0 byte(s) sent and 0 byte(s) received
1788808623 z6Mkq1UH16UDLYkacMT2bPVAE2swUYDKLxYGDygqe3gvYt1L <service> wire: Disconnecting peer with id=2: connection reset
1788808623 z6Mkq1UH16UDLYkacMT2bPVAE2swUYDKLxYGDygqe3gvYt1L <service> wire: Transport handover for disconnecting peer with id=2 (fd=181)
1788808623 z6Mkq1UH16UDLYkacMT2bPVAE2swUYDKLxYGDygqe3gvYt1L <upload-pack> worker: Error on upload-pack channel read for rad:z3T1qJh6kGYeCop3USPkyk1DZKkzv: connection reset
1788808623 z6Mkq1UH16UDLYkacMT2bPVAE2swUYDKLxYGDygqe3gvYt1L <service> service: Disconnected from z6MkkNFtQ8rPWChdYE1yoGun1MBbYzDDbfN3xLWk4rigCXSB (connection reset)
1788808623 z6Mkq1UH16UDLYkacMT2bPVAE2swUYDKLxYGDygqe3gvYt1L <service> service: Dropping peer z6MkkNFtQ8rPWChdYE1yoGun1MBbYzDDbfN3xLWk4rigCXSB..
1788808623 z6Mkq1UH16UDLYkacMT2bPVAE2swUYDKLxYGDygqe3gvYt1L <service> service: Not enough available peers to connect to (available=0, wanted=8)
1788808623 z6Mkq1UH16UDLYkacMT2bPVAE2swUYDKLxYGDygqe3gvYt1L <worker#1> worker: Upload pack finished (23ms)
1788808623 z6Mkq1UH16UDLYkacMT2bPVAE2swUYDKLxYGDygqe3gvYt1L <worker#1> worker: Upload process on stream 13 exited with result Ok(())
1788808623 z6Mkq1UH16UDLYkacMT2bPVAE2swUYDKLxYGDygqe3gvYt1L <service> wire: Received fetch result from worker for stream 13, remote z6MkkNFtQ8rPWChdYE1yoGun1MBbYzDDbfN3xLWk4rigCXSB: Responder { rid: Some(RepoId(rad:z3T1qJh6kGYeCop3USPkyk1DZKkzv)), result: Ok(()) }
1788808623 z6Mkq1UH16UDLYkacMT2bPVAE2swUYDKLxYGDygqe3gvYt1L <service> wire: Peer z6MkkNFtQ8rPWChdYE1yoGun1MBbYzDDbfN3xLWk4rigCXSB not found; ignoring fetch result
1788808623 z6MkkNFtQ8rPWChdYE1yoGun1MBbYzDDbfN3xLWk4rigCXSB <runtime> pool: Worker pool shutting down..
1788808623 z6MkkNFtQ8rPWChdYE1yoGun1MBbYzDDbfN3xLWk4rigCXSB <runtime> node: Node shutdown completed for z6MkkNFtQ8rPWChdYE1yoGun1MBbYzDDbfN3xLWk4rigCXSB
1788808623 test: Node z6Mkq1UH16UDLYkacMT2bPVAE2swUYDKLxYGDygqe3gvYt1L shutting down..
1788808623 z6Mkq1UH16UDLYkacMT2bPVAE2swUYDKLxYGDygqe3gvYt1L <control> control: Received `{"command":"shutdown"}` on control socket
1788808623 z6Mkq1UH16UDLYkacMT2bPVAE2swUYDKLxYGDygqe3gvYt1L <control> control: Shutdown requested..
1788808623 z6Mkq1UH16UDLYkacMT2bPVAE2swUYDKLxYGDygqe3gvYt1L <runtime> pool: Worker pool shutting down..
1788808623 z6Mkq1UH16UDLYkacMT2bPVAE2swUYDKLxYGDygqe3gvYt1L <runtime> node: Node shutdown completed for z6Mkq1UH16UDLYkacMT2bPVAE2swUYDKLxYGDygqe3gvYt1L
failures:
tests::e2e::test_channel_reader_limit
test result: FAILED. 112 passed; 1 failed; 0 ignored; 0 measured; 0 filtered out; finished in 17.00s
error: test failed, to rerun pass `-p radicle-node --lib`
Running unittests src/main.rs (target/debug/deps/radicle_node-4820984cdb5701fb)
running 0 tests
test result: ok. 0 passed; 0 failed; 0 ignored; 0 measured; 0 filtered out; finished in 0.00s
Running unittests src/lib.rs (target/debug/deps/radicle_remote_helper-ec4b110573be437b)
running 0 tests
test result: ok. 0 passed; 0 failed; 0 ignored; 0 measured; 0 filtered out; finished in 0.00s
Running unittests src/git-remote-rad.rs (target/debug/deps/git_remote_rad-6e1e6e7941f73781)
running 0 tests
test result: ok. 0 passed; 0 failed; 0 ignored; 0 measured; 0 filtered out; finished in 0.00s
Running unittests src/lib.rs (target/debug/deps/radicle_signals-85fbd454a3bf0ac6)
running 0 tests
test result: ok. 0 passed; 0 failed; 0 ignored; 0 measured; 0 filtered out; finished in 0.00s
Running unittests src/lib.rs (target/debug/deps/radicle_ssh-9b2e5dfee304f504)
running 0 tests
test result: ok. 0 passed; 0 failed; 0 ignored; 0 measured; 0 filtered out; finished in 0.00s
Running unittests src/lib.rs (target/debug/deps/radicle_systemd-1b4159ebc8f1d2b1)
running 0 tests
test result: ok. 0 passed; 0 failed; 0 ignored; 0 measured; 0 filtered out; finished in 0.00s
Running unittests src/lib.rs (target/debug/deps/radicle_term-96f7925768df62cb)
running 20 tests
test ansi::tests::wrapping ... ok
test ansi::tests::colors_enabled ... ok
test ansi::tests::colors_disabled ... ok
test cell::test::test_width ... ok
test element::test::test_width ... ok
test table::test::test_table ... ok
test element::test::test_truncate ... ok
test table::test::test_table_border ... ok
test table::test::test_table_border_maximized ... ok
test table::test::test_table_truncate ... ok
test table::test::test_table_unicode ... ok
test table::test::test_table_border_truncated ... ok
test table::test::test_table_unicode_truncate ... ok
test table::test::test_truncate ... ok
test textarea::test::test_wrapping ... ok
test textarea::test::test_wrapping_code_block ... ok
test textarea::test::test_wrapping_fenced_block ... ok
test vstack::test::test_vstack ... ok
test vstack::test::test_vstack_maximize ... ok
test textarea::test::test_wrapping_paragraphs ... ok
test result: ok. 20 passed; 0 failed; 0 ignored; 0 measured; 0 filtered out; finished in 0.00s
Running unittests src/rad-agent.rs (target/debug/deps/rad_agent-ebde29902276e4db)
running 0 tests
test result: ok. 0 passed; 0 failed; 0 ignored; 0 measured; 0 filtered out; finished in 0.00s
Running unittests src/rad-cli-demo.rs (target/debug/deps/rad_cli_demo-b4888d9c25fd0e5a)
running 0 tests
test result: ok. 0 passed; 0 failed; 0 ignored; 0 measured; 0 filtered out; finished in 0.00s
Running unittests src/rad-init.rs (target/debug/deps/rad_init-247a667ed33dcb00)
running 0 tests
test result: ok. 0 passed; 0 failed; 0 ignored; 0 measured; 0 filtered out; finished in 0.00s
Running unittests src/rad-merge.rs (target/debug/deps/rad_merge-02c7555617034abf)
running 0 tests
test result: ok. 0 passed; 0 failed; 0 ignored; 0 measured; 0 filtered out; finished in 0.00s
Running unittests src/rad-push.rs (target/debug/deps/rad_push-3ff35bc35af21c62)
running 0 tests
test result: ok. 0 passed; 0 failed; 0 ignored; 0 measured; 0 filtered out; finished in 0.00s
Running unittests src/rad-self.rs (target/debug/deps/rad_self-b8e8c77c09a2ee71)
running 0 tests
test result: ok. 0 passed; 0 failed; 0 ignored; 0 measured; 0 filtered out; finished in 0.00s
Running unittests src/rad-set-canonical-refs.rs (target/debug/deps/rad_set_canonical_refs-81969bf711bec567)
running 0 tests
test result: ok. 0 passed; 0 failed; 0 ignored; 0 measured; 0 filtered out; finished in 0.00s
Doc-tests radicle
running 0 tests
test result: ok. 0 passed; 0 failed; 0 ignored; 0 measured; 0 filtered out; finished in 0.00s
Doc-tests radicle_cli
running 0 tests
test result: ok. 0 passed; 0 failed; 0 ignored; 0 measured; 0 filtered out; finished in 0.00s
Doc-tests radicle_cli_test
running 0 tests
test result: ok. 0 passed; 0 failed; 0 ignored; 0 measured; 0 filtered out; finished in 0.00s
Doc-tests radicle_cob
running 1 test
test radicle-cob/src/backend/git/stable.rs - backend::git::stable::with_advanced_timestamp (line 56) ... ignored
test result: ok. 0 passed; 0 failed; 1 ignored; 0 measured; 0 filtered out; finished in 0.00s
Doc-tests radicle_crdt
running 0 tests
test result: ok. 0 passed; 0 failed; 0 ignored; 0 measured; 0 filtered out; finished in 0.00s
Doc-tests radicle_crypto
running 0 tests
test result: ok. 0 passed; 0 failed; 0 ignored; 0 measured; 0 filtered out; finished in 0.00s
Doc-tests radicle_dag
running 0 tests
test result: ok. 0 passed; 0 failed; 0 ignored; 0 measured; 0 filtered out; finished in 0.00s
Doc-tests radicle_fetch
running 0 tests
test result: ok. 0 passed; 0 failed; 0 ignored; 0 measured; 0 filtered out; finished in 0.00s
Doc-tests radicle_node
running 6 tests
test radicle-node/src/bounded.rs - bounded::BoundedVec<T,N>::max (line 96) ... ok
test radicle-node/src/bounded.rs - bounded::BoundedVec<T,N>::truncate (line 50) ... ok
test radicle-node/src/bounded.rs - bounded::BoundedVec<T,N>::collect_from (line 30) ... ok
test radicle-node/src/bounded.rs - bounded::BoundedVec<T,N>::with_capacity (line 66) ... ok
test radicle-node/src/bounded.rs - bounded::BoundedVec<T,N>::unbound (line 149) ... ok
test radicle-node/src/bounded.rs - bounded::BoundedVec<T,N>::push (line 122) ... ok
test result: ok. 6 passed; 0 failed; 0 ignored; 0 measured; 0 filtered out; finished in 0.63s
Doc-tests radicle_remote_helper
running 0 tests
test result: ok. 0 passed; 0 failed; 0 ignored; 0 measured; 0 filtered out; finished in 0.00s
Doc-tests radicle_signals
running 0 tests
test result: ok. 0 passed; 0 failed; 0 ignored; 0 measured; 0 filtered out; finished in 0.00s
Doc-tests radicle_ssh
running 0 tests
test result: ok. 0 passed; 0 failed; 0 ignored; 0 measured; 0 filtered out; finished in 0.00s
Doc-tests radicle_systemd
running 0 tests
test result: ok. 0 passed; 0 failed; 0 ignored; 0 measured; 0 filtered out; finished in 0.00s
Doc-tests radicle_term
running 1 test
test radicle-term/src/table.rs - table (line 4) ... ok
test result: ok. 1 passed; 0 failed; 0 ignored; 0 measured; 0 filtered out; finished in 0.38s
error: 1 target failed:
`-p radicle-node --lib`
Exit code: 101
{
"response": "finished",
"result": "failure"
}