rad:z3gqcJUoA1n9HaHKufZs5FCSGazv5 heartwood0736977170c53c41aecf6321ae66560534c9409a
{
"request": "trigger",
"version": 1,
"event_type": "patch",
"repository": {
"id": "rad:z3gqcJUoA1n9HaHKufZs5FCSGazv5",
"name": "heartwood",
"description": "Radicle Heartwood Protocol & Stack",
"private": false,
"default_branch": "master",
"delegates": [
"did:key:z6MksFqXN3Yhqk8pTJdUGLwATkRfQvwZXPqR2qMEhbS9wzpT",
"did:key:z6MkireRatUThvd3qzfKht1S44wpm4FEWSSa4PRMTSQZ3voM",
"did:key:z6MkkPvBfjP4bQmco5Dm7UGsX2ruDBieEHi8n9DVJWX5sTEz"
]
},
"action": "Created",
"patch": {
"id": "f161a9dc44246d61b74772636969fbde75742d0d",
"author": {
"id": "did:key:z6MkkPvBfjP4bQmco5Dm7UGsX2ruDBieEHi8n9DVJWX5sTEz",
"alias": null
},
"title": "node: Migrate IPv6 addresses in database",
"state": {
"status": "merged",
"conflicts": []
},
"before": "9e8f09a1447f9c10536e5b278645688f68de8702",
"after": "0736977170c53c41aecf6321ae66560534c9409a",
"commits": [
"0736977170c53c41aecf6321ae66560534c9409a"
],
"target": "7e1cb406bb935c3de008d2171e8961f57b4336ea",
"labels": [],
"assignees": [],
"revisions": [
{
"id": "f161a9dc44246d61b74772636969fbde75742d0d",
"author": {
"id": "did:key:z6MkkPvBfjP4bQmco5Dm7UGsX2ruDBieEHi8n9DVJWX5sTEz",
"alias": null
},
"description": "The format for IPv6 addresses was changed in\ndf8e4e6c88a8bfb6c1ec6b07dcda64093b477cbe to require '[' and ']'.\n\nIPv6 addresses that were stored in the database in the past must be\nmigrated.",
"base": "9e8f09a1447f9c10536e5b278645688f68de8702",
"oid": "0736977170c53c41aecf6321ae66560534c9409a",
"timestamp": 1773699386
}
]
}
}
{
"response": "triggered",
"run_id": {
"id": "4caf264a-2270-4dd4-8432-bc4ae27e3de4"
},
"info_url": "https://cci.rad.levitte.org//4caf264a-2270-4dd4-8432-bc4ae27e3de4.html"
}
Started at: 2026-09-08 20:40:26.147397+02:00
Commands:
$ rad clone rad:z3gqcJUoA1n9HaHKufZs5FCSGazv5 .
✓ Creating checkout in ./...
✓ Remote cloudhead@z6MksFqXN3Yhqk8pTJdUGLwATkRfQvwZXPqR2qMEhbS9wzpT added
✓ Remote-tracking branch cloudhead@z6MksFqXN3Yhqk8pTJdUGLwATkRfQvwZXPqR2qMEhbS9wzpT/master created for z6MksFqXN3Yhqk8pTJdUGLwATkRfQvwZXPqR2qMEhbS9wzpT
✓ Remote fintohaps@z6MkireRatUThvd3qzfKht1S44wpm4FEWSSa4PRMTSQZ3voM added
✓ Remote-tracking branch fintohaps@z6MkireRatUThvd3qzfKht1S44wpm4FEWSSa4PRMTSQZ3voM/master created for z6MkireRatUThvd3qzfKht1S44wpm4FEWSSa4PRMTSQZ3voM
✓ Remote lorenz@z6MkkPvBfjP4bQmco5Dm7UGsX2ruDBieEHi8n9DVJWX5sTEz added
✓ Remote-tracking branch lorenz@z6MkkPvBfjP4bQmco5Dm7UGsX2ruDBieEHi8n9DVJWX5sTEz/master created for z6MkkPvBfjP4bQmco5Dm7UGsX2ruDBieEHi8n9DVJWX5sTEz
✓ Repository successfully cloned under /opt/radcis/ci.rad.levitte.org/cci/state/4caf264a-2270-4dd4-8432-bc4ae27e3de4/w/
╭────────────────────────────────────╮
│ heartwood │
│ Radicle Heartwood Protocol & Stack │
│ 189 issues · 39 patches │
╰────────────────────────────────────╯
Run `cd ./.` to go to the repository directory.
Exit code: 0
$ rad patch checkout f161a9dc44246d61b74772636969fbde75742d0d
✓ Switched to branch patch/f161a9d at revision f161a9d
✓ Branch patch/f161a9d setup to track rad/patches/f161a9dc44246d61b74772636969fbde75742d0d
Exit code: 0
$ git config advice.detachedHead false
Exit code: 0
$ git checkout 0736977170c53c41aecf6321ae66560534c9409a
HEAD is now at 07369771 node: Migrate IPv6 addresses in database
Exit code: 0
$ rad patch show f161a9dc44246d61b74772636969fbde75742d0d -p
╭──────────────────────────────────────────────────────────────────────────────╮
│ Title node: Migrate IPv6 addresses in database │
│ Patch f161a9dc44246d61b74772636969fbde75742d0d │
│ Author lorenz z6MkkPv…WX5sTEz │
│ Head 0736977170c53c41aecf6321ae66560534c9409a │
│ Base 9e8f09a1447f9c10536e5b278645688f68de8702 │
│ Target master │
│ Branches patch/f161a9d │
│ Commits ahead 0, behind 435 │
│ Status merged │
│ │
│ The format for IPv6 addresses was changed in │
│ df8e4e6c88a8bfb6c1ec6b07dcda64093b477cbe to require '[' and ']'. │
│ │
│ IPv6 addresses that were stored in the database in the past must be │
│ migrated. │
├──────────────────────────────────────────────────────────────────────────────┤
│ 0736977 node: Migrate IPv6 addresses in database │
├──────────────────────────────────────────────────────────────────────────────┤
│ ● Revision f161a9d @ 9e8f09a..0736977 by lorenz z6MkkPv…WX5sTEz 5 months ago │
│ └─ ✓ merged by fintohaps z6Mkire…SQZ3voM │
╰──────────────────────────────────────────────────────────────────────────────╯
commit 0736977170c53c41aecf6321ae66560534c9409a
Author: Lorenz Leutgeb <lorenz.leutgeb@radicle.xyz>
Date: Mon Mar 16 23:07:53 2026 +0100
node: Migrate IPv6 addresses in database
The format for IPv6 addresses was changed in
df8e4e6c88a8bfb6c1ec6b07dcda64093b477cbe to require '[' and ']'.
IPv6 addresses that were stored in the database in the past must be
migrated.
diff --git a/crates/radicle/src/node/db.rs b/crates/radicle/src/node/db.rs
index 4350bf9be1..e47d7e2392 100644
--- a/crates/radicle/src/node/db.rs
+++ b/crates/radicle/src/node/db.rs
@@ -37,6 +37,7 @@ const MIGRATIONS: &[&str] = &[
include_str!("db/migrations/4.sql"),
include_str!("db/migrations/5.sql"),
include_str!("db/migrations/6.sql"),
+ include_str!("db/migrations/7.sql"),
];
#[derive(Error, Debug)]
diff --git a/crates/radicle/src/node/db/migrations/7.sql b/crates/radicle/src/node/db/migrations/7.sql
new file mode 100644
index 0000000000..e7f9b2c67c
--- /dev/null
+++ b/crates/radicle/src/node/db/migrations/7.sql
@@ -0,0 +1 @@
+update addresses set value = concat('[', rtrim(ltrim(rtrim(value, replace(value, ':', '')), '['), ']:'), ']:', replace(value, rtrim(value, replace(value, ':', '')), '')) where type = "ipv6";
\ No newline at end of file
Exit code: 0
shell: 'export RUSTDOCFLAGS=''-D warnings'' cargo --version rustc --version cargo fmt --check cargo clippy --all-targets --workspace -- --deny warnings cargo build --all-targets --workspace cargo doc --workspace --no-deps --all-features cargo test --workspace --no-fail-fast '
Commands:
$ podman run --name 4caf264a-2270-4dd4-8432-bc4ae27e3de4 -v /opt/radcis/ci.rad.levitte.org/cci/state/4caf264a-2270-4dd4-8432-bc4ae27e3de4/s:/4caf264a-2270-4dd4-8432-bc4ae27e3de4/s:ro -v /opt/radcis/ci.rad.levitte.org/cci/state/4caf264a-2270-4dd4-8432-bc4ae27e3de4/w:/4caf264a-2270-4dd4-8432-bc4ae27e3de4/w -w /4caf264a-2270-4dd4-8432-bc4ae27e3de4/w -v /opt/radcis/ci.rad.levitte.org/.radicle:/${id}/.radicle:ro -e RAD_HOME=/${id}/.radicle rust:trixie bash /4caf264a-2270-4dd4-8432-bc4ae27e3de4/s/script.sh
+ export 'RUSTDOCFLAGS=-D warnings'
+ RUSTDOCFLAGS='-D warnings'
+ cargo --version
info: syncing channel updates for '1.90-x86_64-unknown-linux-gnu'
info: latest update on 2025-09-18, rust version 1.90.0 (1159e78c4 2025-09-14)
info: downloading component 'cargo'
info: downloading component 'clippy'
info: downloading component 'rust-docs'
info: downloading component 'rust-src'
info: downloading component 'rust-std'
info: downloading component 'rustc'
info: downloading component 'rustfmt'
info: installing component 'cargo'
info: installing component 'clippy'
info: installing component 'rust-docs'
info: installing component 'rust-src'
info: installing component 'rust-std'
info: installing component 'rustc'
info: installing component 'rustfmt'
cargo 1.90.0 (840b83a10 2025-07-30)
+ rustc --version
rustc 1.90.0 (1159e78c4 2025-09-14)
+ cargo fmt --check
+ cargo clippy --all-targets --workspace -- --deny warnings
Updating crates.io index
Downloading crates ...
Downloaded dyn-clone v1.0.17
Downloaded fnv v1.0.7
Downloaded crossterm v0.29.0
Downloaded gix-object v0.56.0
Downloaded fast-glob v0.3.3
Downloaded equivalent v1.0.1
Downloaded crypto-common v0.1.6
Downloaded crypto-bigint v0.5.5
Downloaded faster-hex v0.10.0
Downloaded env_filter v0.1.3
Downloaded fastrand v2.3.0
Downloaded ct-codecs v1.1.1
Downloaded clap_lex v0.7.5
Downloaded email_address v0.2.9
Downloaded document-features v0.2.11
Downloaded noise-framework v0.4.0
Downloaded clap_derive v4.5.41
Downloaded env_logger v0.11.8
Downloaded num v0.4.3
Downloaded emojis v0.6.4
Downloaded pem-rfc7468 v0.7.0
Downloaded opaque-debug v0.3.1
Downloaded outref v0.5.2
Downloaded phf v0.11.3
Downloaded ppv-lite86 v0.2.17
Downloaded pkcs8 v0.10.2
Downloaded qcheck-macros v1.0.0
Downloaded radicle-std-ext v0.2.0
Downloaded num-bigint-dig v0.8.4
Downloaded ref-cast-impl v1.0.24
Downloaded pin-project-lite v0.2.16
Downloaded rand_core v0.9.3
Downloaded same-file v1.0.6
Downloaded rfc6979 v0.4.0
Downloaded qcheck v1.0.0
Downloaded pretty_assertions v1.4.0
Downloaded rsa v0.9.6
Downloaded scrypt v0.11.0
Downloaded rusty-fork v0.3.1
Downloaded rand_chacha v0.3.1
Downloaded siphasher v1.0.1
Downloaded sha1 v0.10.6
Downloaded siphasher v0.3.11
Downloaded object v0.37.3
Downloaded sval_json v2.14.1
Downloaded sha2 v0.10.8
Downloaded gix-revwalk v0.27.0
Downloaded nu-ansi-term v0.50.3
Downloaded smallvec v1.15.1
Downloaded sval_serde v2.14.1
Downloaded snapbox v0.4.17
Downloaded rustix v0.38.34
Downloaded zerofrom v0.1.6
Downloaded wait-timeout v0.2.1
Downloaded unicode-width v0.1.11
Downloaded gix-path v0.11.1
Downloaded fluent-uri v0.3.2
Downloaded zerofrom-derive v0.1.6
Downloaded typenum v1.17.0
Downloaded tree-sitter-html v0.23.2
Downloaded value-bag v1.11.1
Downloaded tinyvec v1.6.0
Downloaded zerovec-derive v0.10.3
Downloaded uuid v1.20.0
Downloaded writeable v0.5.5
Downloaded regex-syntax v0.8.5
Downloaded zeroize v1.7.0
Downloaded rustix v1.1.3
Downloaded unicode-segmentation v1.11.0
Downloaded unicode-ident v1.0.12
Downloaded unicode-normalization v0.1.23
Downloaded libm v0.2.8
Downloaded url v2.5.4
Downloaded tree-sitter-python v0.23.4
Downloaded zlib-rs v0.6.0
Downloaded tracing-subscriber v0.3.22
Downloaded zerovec v0.10.4
Downloaded vcpkg v0.2.15
Downloaded zerocopy v0.7.35
Downloaded winnow v0.7.14
Downloaded tree-sitter-md v0.3.2
Downloaded tree-sitter-c v0.23.2
Downloaded tree-sitter-rust v0.23.2
Downloaded icu_properties_data v1.5.1
Downloaded gimli v0.32.3
Downloaded git2 v0.20.4
Downloaded unicode-width v0.2.1
Downloaded tree-sitter v0.24.4
Downloaded tracing v0.1.44
Downloaded sha1-checked v0.10.0
Downloaded tree-sitter-ruby v0.23.1
Downloaded syn v2.0.106
Downloaded tree-sitter-bash v0.23.3
Downloaded serde_json v1.0.140
Downloaded itertools v0.14.0
Downloaded hashbrown v0.16.1
Downloaded syn v1.0.109
Downloaded idna v1.0.3
Downloaded sysinfo v0.37.2
Downloaded hashbrown v0.14.3
Downloaded jsonschema v0.30.0
Downloaded jiff-static v0.2.20
Downloaded inquire v0.7.5
Downloaded gix-pack v0.65.0
Downloaded tree-sitter-typescript v0.23.2
Downloaded tree-sitter-go v0.23.4
Downloaded sha3 v0.10.8
Downloaded tokio v1.47.1
Downloaded linux-raw-sys v0.4.13
Downloaded jiff v0.2.20
Downloaded libc v0.2.182
Downloaded ssh-key v0.6.6
Downloaded regex-automata v0.4.9
Downloaded indicatif v0.18.0
Downloaded indexmap v2.2.6
Downloaded icu_collections v1.5.0
Downloaded tar v0.4.40
Downloaded serde v1.0.228
Downloaded icu_properties v1.5.1
Downloaded icu_normalizer_data v1.5.1
Downloaded icu_normalizer v1.5.0
Downloaded icu_locid v1.5.0
Downloaded heapless v0.8.0
Downloaded gix-transport v0.54.0
Downloaded flate2 v1.1.1
Downloaded yoke v0.7.5
Downloaded similar v2.5.0
Downloaded gix-diff v0.58.0
Downloaded walkdir v2.5.0
Downloaded vsimd v0.8.0
Downloaded tracing-core v0.1.36
Downloaded toml_datetime v0.7.5+spec-1.1.0
Downloaded tempfile v3.25.0
Downloaded socket2 v0.5.7
Downloaded gix-traverse v0.52.0
Downloaded spki v0.7.3
Downloaded ryu v1.0.17
Downloaded gix-object v0.55.0
Downloaded toml v0.9.12+spec-1.1.0
Downloaded icu_provider v1.5.0
Downloaded gix-ref v0.59.0
Downloaded gix-protocol v0.57.0
Downloaded gix-odb v0.75.0
Downloaded signal-hook v0.3.18
Downloaded getrandom v0.2.15
Downloaded yansi v0.5.1
Downloaded typeid v1.0.3
Downloaded toml_writer v1.0.6+spec-1.1.0
Downloaded tinystr v0.7.6
Downloaded timeago v0.4.2
Downloaded systemd-journal-logger v2.2.2
Downloaded sval_nested v2.14.1
Downloaded tree-sitter-css v0.23.1
Downloaded thiserror v1.0.69
Downloaded spin v0.9.8
Downloaded uuid-simd v0.8.0
Downloaded utf8parse v0.2.2
Downloaded utf8_iter v1.0.4
Downloaded utf16_iter v1.0.5
Downloaded universal-hash v0.5.1
Downloaded unit-prefix v0.5.1
Downloaded tree-sitter-toml-ng v0.6.0
Downloaded tree-sitter-json v0.24.8
Downloaded tracing-log v0.2.0
Downloaded tinyvec_macros v0.1.1
Downloaded thread_local v1.1.9
Downloaded thiserror-impl v2.0.18
Downloaded thiserror-impl v1.0.69
Downloaded thiserror v2.0.18
Downloaded synstructure v0.13.1
Downloaded sval_fmt v2.14.1
Downloaded ssh-encoding v0.2.0
Downloaded ssh-cipher v0.2.0
Downloaded snapbox-macros v0.3.8
Downloaded icu_locid_transform_data v1.5.1
Downloaded gix-tempfile v21.0.1
Downloaded gix-error v0.1.0
Downloaded getrandom v0.3.3
Downloaded yoke-derive v0.7.5
Downloaded xattr v1.3.1
Downloaded write16 v1.0.0
Downloaded version_check v0.9.4
Downloaded value-bag-sval2 v1.11.1
Downloaded value-bag-serde1 v1.11.1
Downloaded unicode-display-width v0.3.0
Downloaded unarray v0.1.4
Downloaded tree-sitter-language v0.1.2
Downloaded tree-sitter-highlight v0.24.4
Downloaded test-log-macros v0.2.19
Downloaded test-log v0.2.19
Downloaded sval_ref v2.14.1
Downloaded sval_dynamic v2.14.1
Downloaded sval_buffer v2.14.1
Downloaded subtle v2.5.0
Downloaded structured-logger v1.0.4
Downloaded strsim v0.11.1
Downloaded streaming-iterator v0.1.9
Downloaded sqlite v0.32.0
Downloaded signature v1.6.4
Downloaded shlex v1.3.0
Downloaded serde_derive_internals v0.29.1
Downloaded lexopt v0.3.0
Downloaded jobserver v0.1.31
Downloaded hmac v0.12.1
Downloaded gix-fs v0.19.1
Downloaded serde_derive v1.0.228
Downloaded serde_core v1.0.228
Downloaded quick-error v1.2.3
Downloaded gix-packetline v0.21.1
Downloaded sval v2.14.1
Downloaded stable_deref_trait v1.2.0
Downloaded socks5-client v0.4.1
Downloaded signal-hook-mio v0.2.4
Downloaded rustversion v1.0.20
Downloaded rand_core v0.6.4
Downloaded signals_receipts v0.2.0
Downloaded signal-hook-registry v1.4.5
Downloaded sharded-slab v0.1.7
Downloaded schemars v1.0.4
Downloaded gix-commitgraph v0.32.0
Downloaded gix-date v0.14.0
Downloaded serde-untagged v0.1.7
Downloaded sem_safe v0.2.0
Downloaded schemars_derive v1.0.4
Downloaded rustc-demangle v0.1.26
Downloaded regex v1.11.1
Downloaded p384 v0.13.0
Downloaded itoa v1.0.17
Downloaded gix-error v0.0.0
Downloaded gix-credentials v0.36.0
Downloaded gix-commitgraph v0.33.0
Downloaded sqlite3-sys v0.15.2
Downloaded signature v2.2.0
Downloaded shell-words v1.1.0
Downloaded rand v0.9.2
Downloaded icu_locid_transform v1.5.0
Downloaded iana-time-zone v0.1.60
Downloaded human-panic v2.0.6
Downloaded gix-url v0.35.1
Downloaded gix-revwalk v0.26.0
Downloaded gix-revision v0.41.0
Downloaded gix-refspec v0.37.0
Downloaded group v0.13.0
Downloaded gix-date v0.13.0
Downloaded ff v0.13.0
Downloaded salsa20 v0.10.2
Downloaded referencing v0.30.0
Downloaded parking_lot_core v0.9.12
Downloaded serde_spanned v1.0.4
Downloaded serde_fmt v1.0.3
Downloaded sec1 v0.7.3
Downloaded git-ref-format-macro v0.6.0
Downloaded radicle-git-ext v0.12.0
Downloaded heck v0.5.0
Downloaded proptest v1.9.0
Downloaded polyval v0.6.2
Downloaded poly1305 v0.8.0
Downloaded pkg-config v0.3.30
Downloaded paste v1.0.15
Downloaded p256 v0.13.2
Downloaded bstr v1.12.0
Downloaded scopeguard v1.2.0
Downloaded prodash v31.0.0
Downloaded gix-prompt v0.13.1
Downloaded bloomy v1.2.0
Downloaded ref-cast v1.0.24
Downloaded gix-trace v0.1.18
Downloaded gix-quote v0.6.2
Downloaded generic-array v0.14.7
Downloaded portable-atomic v1.11.0
Downloaded num-integer v0.1.46
Downloaded gix-negotiate v0.27.0
Downloaded rand v0.8.5
Downloaded radicle-surf v0.27.0
Downloaded rand_xorshift v0.4.0
Downloaded proc-macro2 v1.0.101
Downloaded num-iter v0.1.45
Downloaded gix-sec v0.13.1
Downloaded chrono v0.4.38
Downloaded proc-macro-error2 v2.0.1
Downloaded pkcs1 v0.7.5
Downloaded p521 v0.13.3
Downloaded normalize-line-endings v0.3.0
Downloaded idna_adapter v1.2.0
Downloaded gix-utils v0.3.1
Downloaded num-rational v0.4.2
Downloaded multibase v0.9.1
Downloaded lazy_static v1.5.0
Downloaded ghash v0.5.1
Downloaded aho-corasick v1.1.3
Downloaded rand_chacha v0.9.0
Downloaded quote v1.0.41
Downloaded primeorder v0.13.6
Downloaded mio v1.0.4
Downloaded gix-config-value v0.17.1
Downloaded gix-command v0.7.1
Downloaded num-bigint v0.4.6
Downloaded mio v0.8.11
Downloaded is_terminal_polyfill v1.70.2
Downloaded inout v0.1.3
Downloaded icu_provider_macros v1.5.0
Downloaded hash32 v0.3.1
Downloaded gix-chunk v0.5.0
Downloaded cyphernet v0.5.2
Downloaded proc-macro-error-attr2 v2.0.0
Downloaded percent-encoding v2.3.1
Downloaded num-cmp v0.1.0
Downloaded maybe-async v0.2.10
Downloaded gix-lock v21.0.1
Downloaded gix-actor v0.39.0
Downloaded aes v0.8.4
Downloaded phf_shared v0.11.3
Downloaded num-traits v0.2.19
Downloaded matchers v0.2.0
Downloaded keccak v0.1.6
Downloaded gix-chunk v0.6.0
Downloaded git-ref-format-core v0.6.0
Downloaded fxhash v0.2.1
Downloaded crossterm v0.25.0
Downloaded once_cell v1.21.3
Downloaded miniz_oxide v0.8.8
Downloaded memchr v2.7.2
Downloaded gix-validate v0.11.0
Downloaded pbkdf2 v0.12.2
Downloaded cc v1.2.2
Downloaded backtrace v0.3.76
Downloaded parking_lot v0.12.5
Downloaded num-complex v0.4.6
Downloaded memmap2 v0.9.8
Downloaded gix-glob v0.24.0
Downloaded fraction v0.15.3
Downloaded form_urlencoded v1.2.1
Downloaded derive_more-impl v2.0.1
Downloaded clap_builder v4.5.44
Downloaded gix-hashtable v0.12.0
Downloaded chacha20poly1305 v0.10.1
Downloaded base64 v0.21.7
Downloaded arc-swap v1.8.2
Downloaded aes-gcm v0.10.3
Downloaded log v0.4.27
Downloaded gix-shallow v0.8.1
Downloaded gix-hash v0.22.1
Downloaded gix-features v0.46.1
Downloaded gix-actor v0.38.0
Downloaded git-ref-format v0.6.0
Downloaded derive_more v2.0.1
Downloaded newline-converter v0.3.0
Downloaded litrs v0.4.1
Downloaded elliptic-curve v0.13.8
Downloaded clap v4.5.44
Downloaded bytes v1.11.1
Downloaded anyhow v1.0.82
Downloaded addr2line v0.25.1
Downloaded nonempty v0.9.0
Downloaded lock_api v0.4.14
Downloaded litemap v0.7.5
Downloaded crc32fast v1.5.0
Downloaded clap_complete v4.5.60
Downloaded amplify v4.6.0
Downloaded diff v0.1.13
Downloaded autocfg v1.2.0
Downloaded bytesize v2.0.1
Downloaded anstyle-query v1.0.2
Downloaded anstyle-parse v0.2.3
Downloaded anstyle v1.0.13
Downloaded displaydoc v0.2.5
Downloaded digest v0.10.7
Downloaded data-encoding v2.5.0
Downloaded cpufeatures v0.2.12
Downloaded byteorder v1.5.0
Downloaded bitflags v1.3.2
Downloaded crossbeam-channel v0.5.15
Downloaded cbc v0.1.2
Downloaded block-padding v0.3.3
Downloaded bit-vec v0.8.0
Downloaded ec25519 v0.1.0
Downloaded data-encoding-macro-internal v0.1.12
Downloaded colorchoice v1.0.0
Downloaded cipher v0.4.4
Downloaded base16ct v0.2.0
Downloaded base-x v0.2.11
Downloaded amplify_derive v4.0.0
Downloaded bytecount v0.6.8
Downloaded either v1.11.0
Downloaded convert_case v0.7.1
Downloaded bit-set v0.8.0
Downloaded base64 v0.22.1
Downloaded aead v0.5.2
Downloaded blowfish v0.9.1
Downloaded bcrypt-pbkdf v0.10.0
Downloaded base32 v0.4.0
Downloaded der v0.7.9
Downloaded base64ct v1.6.0
Downloaded amplify_syn v2.0.1
Downloaded erased-serde v0.4.6
Downloaded ed25519 v1.5.3
Downloaded ecdsa v0.16.9
Downloaded crossbeam-utils v0.8.19
Downloaded console v0.16.0
Downloaded colored v2.1.0
Downloaded cfg-if v1.0.0
Downloaded ascii v1.1.0
Downloaded amplify_num v0.5.2
Downloaded ahash v0.8.11
Downloaded adler2 v2.0.0
Downloaded filetime v0.2.23
Downloaded fancy-regex v0.14.0
Downloaded escargot v0.5.10
Downloaded errno v0.3.13
Downloaded dunce v1.0.5
Downloaded data-encoding-macro v0.1.14
Downloaded cyphergraphy v0.3.0
Downloaded cypheraddr v0.4.0
Downloaded ctr v0.9.2
Downloaded const-oid v0.9.6
Downloaded chacha20 v0.9.1
Downloaded borrow-or-share v0.2.2
Downloaded bitflags v2.9.1
Downloaded anstream v0.6.21
Downloaded block-buffer v0.10.4
Downloaded libgit2-sys v0.18.3+1.9.2
Downloaded sqlite3-src v0.5.1
Downloaded linux-raw-sys v0.11.0
Downloaded libz-sys v1.1.16
Compiling libc v0.2.182
Compiling proc-macro2 v1.0.101
Compiling unicode-ident v1.0.12
Compiling quote v1.0.41
Checking cfg-if v1.0.0
Checking memchr v2.7.2
Compiling version_check v0.9.4
Compiling syn v2.0.106
Compiling shlex v1.3.0
Checking getrandom v0.2.15
Compiling typenum v1.17.0
Checking regex-syntax v0.8.5
Compiling jobserver v0.1.31
Compiling cc v1.2.2
Compiling generic-array v0.14.7
Checking aho-corasick v1.1.3
Checking regex-automata v0.4.9
Checking rand_core v0.6.4
Compiling serde_core v1.0.228
Checking crypto-common v0.1.6
Checking smallvec v1.15.1
Compiling serde v1.0.228
Checking subtle v2.5.0
Compiling thiserror v2.0.18
Checking cpufeatures v0.2.12
Checking stable_deref_trait v1.2.0
Checking fastrand v2.3.0
Compiling parking_lot_core v0.9.12
Checking bstr v1.12.0
Checking scopeguard v1.2.0
Checking lock_api v0.4.14
Checking block-buffer v0.10.4
Checking parking_lot v0.12.5
Checking tinyvec_macros v0.1.1
Checking digest v0.10.7
Checking byteorder v1.5.0
Checking tinyvec v1.6.0
Checking bitflags v2.9.1
Checking gix-trace v0.1.18
Compiling crc32fast v1.5.0
Compiling serde_derive v1.0.228
Compiling thiserror-impl v2.0.18
Checking unicode-normalization v0.1.23
Checking gix-validate v0.11.0
Checking itoa v1.0.17
Compiling typeid v1.0.3
Checking gix-utils v0.3.1
Checking same-file v1.0.6
Checking walkdir v2.5.0
Checking prodash v31.0.0
Checking zlib-rs v0.6.0
Compiling heapless v0.8.0
Checking gix-path v0.11.1
Checking hash32 v0.3.1
Compiling synstructure v0.13.1
Checking faster-hex v0.10.0
Checking gix-features v0.46.1
Compiling getrandom v0.3.3
Compiling zerofrom-derive v0.1.6
Checking sha1 v0.10.6
Checking zeroize v1.7.0
Checking sha1-checked v0.10.0
Compiling yoke-derive v0.7.5
Compiling rustix v1.1.3
Compiling pkg-config v0.3.30
Checking zerofrom v0.1.6
Checking erased-serde v0.4.6
Checking serde_fmt v1.0.3
Checking yoke v0.7.5
Checking gix-hash v0.22.1
Compiling zerovec-derive v0.10.3
Checking linux-raw-sys v0.11.0
Checking value-bag-serde1 v1.11.1
Checking value-bag v1.11.1
Compiling displaydoc v0.2.5
Checking log v0.4.27
Checking block-padding v0.3.3
Checking once_cell v1.21.3
Checking inout v0.1.3
Checking zerovec v0.10.4
Compiling syn v1.0.109
Checking cipher v0.4.4
Compiling icu_locid_transform_data v1.5.1
Checking writeable v0.5.5
Checking litemap v0.7.5
Compiling icu_provider_macros v1.5.0
Checking tinystr v0.7.6
Checking icu_locid v1.5.0
Checking percent-encoding v2.3.1
Compiling icu_properties_data v1.5.1
Compiling icu_normalizer_data v1.5.1
Checking icu_provider v1.5.0
Compiling thiserror v1.0.69
Checking icu_locid_transform v1.5.0
Checking icu_collections v1.5.0
Compiling thiserror-impl v1.0.69
Checking hashbrown v0.14.3
Checking equivalent v1.0.1
Compiling serde_json v1.0.140
Checking indexmap v2.2.6
Checking icu_properties v1.5.1
Checking sha2 v0.10.8
Checking write16 v1.0.0
Compiling vcpkg v0.2.15
Compiling ref-cast v1.0.24
Checking utf8_iter v1.0.4
Checking ryu v1.0.17
Checking utf16_iter v1.0.5
Checking tempfile v3.25.0
Compiling ref-cast-impl v1.0.24
Compiling libz-sys v1.1.16
Checking universal-hash v0.5.1
Checking opaque-debug v0.3.1
Compiling autocfg v1.2.0
Checking dyn-clone v1.0.17
Checking icu_normalizer v1.5.0
Compiling amplify_syn v2.0.1
Compiling libgit2-sys v0.18.3+1.9.2
Compiling num-traits v0.2.19
Checking signature v1.6.4
Checking idna_adapter v1.2.0
Checking ed25519 v1.5.3
Checking idna v1.0.3
Checking form_urlencoded v1.2.1
Compiling serde_derive_internals v0.29.1
Compiling amplify_derive v4.0.0
Checking aead v0.5.2
Checking amplify_num v0.5.2
Checking ascii v1.1.0
Checking ct-codecs v1.1.1
Checking ec25519 v0.1.0
Compiling schemars_derive v1.0.4
Checking url v2.5.4
Checking amplify v4.6.0
Checking git-ref-format-core v0.6.0
Checking poly1305 v0.8.0
Checking chacha20 v0.9.1
Checking cyphergraphy v0.3.0
Checking polyval v0.6.2
Checking schemars v1.0.4
Compiling sqlite3-src v0.5.1
Checking hmac v0.12.1
Checking keccak v0.1.6
Checking base64ct v1.6.0
Checking pem-rfc7468 v0.7.0
Checking sha3 v0.10.8
Checking pbkdf2 v0.12.2
Checking ghash v0.5.1
Checking aes v0.8.4
Checking ctr v0.9.2
Checking rand v0.8.5
Compiling data-encoding v2.5.0
Checking base32 v0.4.0
Checking cypheraddr v0.4.0
Compiling data-encoding-macro-internal v0.1.12
Checking qcheck v1.0.0
Checking aes-gcm v0.10.3
Checking ssh-encoding v0.2.0
Checking chacha20poly1305 v0.10.1
Checking cbc v0.1.2
Checking blowfish v0.9.1
Checking jiff v0.2.20
Checking data-encoding-macro v0.1.14
Checking bcrypt-pbkdf v0.10.0
Checking ssh-cipher v0.2.0
Checking noise-framework v0.4.0
Checking socks5-client v0.4.1
Compiling crossbeam-utils v0.8.19
Checking signature v2.2.0
Checking base-x v0.2.11
Checking multibase v0.9.1
Checking ssh-key v0.6.6
Checking cyphernet v0.5.2
Checking radicle-ssh v0.10.0 (/4caf264a-2270-4dd4-8432-bc4ae27e3de4/w/crates/radicle-ssh)
Checking winnow v0.7.14
Checking crossbeam-channel v0.5.15
Checking hashbrown v0.16.1
Checking lazy_static v1.5.0
Checking gix-hashtable v0.12.0
Checking nonempty v0.9.0
Checking anstyle-query v1.0.2
Checking siphasher v1.0.1
Checking radicle-git-metadata v0.1.0 (/4caf264a-2270-4dd4-8432-bc4ae27e3de4/w/crates/radicle-git-metadata)
Checking gix-error v0.1.0
Checking radicle-dag v0.10.0 (/4caf264a-2270-4dd4-8432-bc4ae27e3de4/w/crates/radicle-dag)
Checking memmap2 v0.9.8
Checking utf8parse v0.2.2
Checking radicle-git-ref-format v0.1.0 (/4caf264a-2270-4dd4-8432-bc4ae27e3de4/w/crates/radicle-git-ref-format)
Checking anstyle-parse v0.2.3
Checking colorchoice v1.0.0
Checking anstyle v1.0.13
Checking is_terminal_polyfill v1.70.2
Checking base64 v0.21.7
Checking iana-time-zone v0.1.60
Checking chrono v0.4.38
Checking anstream v0.6.21
Checking colored v2.1.0
Checking radicle-localtime v0.1.0 (/4caf264a-2270-4dd4-8432-bc4ae27e3de4/w/crates/radicle-localtime)
Checking serde-untagged v0.1.7
Checking bytesize v2.0.1
Checking gix-error v0.0.0
Checking tree-sitter-language v0.1.2
Checking dunce v1.0.5
Checking fast-glob v0.3.3
Checking gix-date v0.14.0
Checking gix-date v0.13.0
Checking gix-actor v0.39.0
Checking gix-fs v0.19.1
Checking gix-object v0.56.0
Checking gix-tempfile v21.0.1
Checking gix-actor v0.38.0
Checking gix-chunk v0.6.0
Checking mio v1.0.4
Checking gix-quote v0.6.2
Checking gix-commitgraph v0.33.0
Checking gix-object v0.55.0
Checking gix-chunk v0.5.0
Checking errno v0.3.13
Checking sem_safe v0.2.0
Checking shell-words v1.1.0
Checking either v1.11.0
Checking gix-command v0.7.1
Checking signals_receipts v0.2.0
Checking gix-commitgraph v0.32.0
Checking gix-revwalk v0.27.0
Compiling object v0.37.3
Compiling rustversion v1.0.20
Compiling signal-hook v0.3.18
Checking gix-revwalk v0.26.0
Checking gix-lock v21.0.1
Checking gix-url v0.35.1
Checking gix-config-value v0.17.1
Checking gix-sec v0.13.1
Checking signal-hook-registry v1.4.5
Compiling rustix v0.38.34
Checking adler2 v2.0.0
Checking gimli v0.32.3
Checking miniz_oxide v0.8.8
Checking gix-prompt v0.13.1
Checking gix-traverse v0.52.0
Checking addr2line v0.25.1
Checking gix-revision v0.41.0
Checking radicle-signals v0.11.0 (/4caf264a-2270-4dd4-8432-bc4ae27e3de4/w/crates/radicle-signals)
Checking gix-diff v0.58.0
Checking mio v0.8.11
Checking gix-glob v0.24.0
Checking gix-packetline v0.21.1
Compiling tree-sitter v0.24.4
Compiling unicode-segmentation v1.11.0
Compiling linux-raw-sys v0.4.13
Compiling anyhow v1.0.82
Checking rustc-demangle v0.1.26
Checking backtrace v0.3.76
Compiling convert_case v0.7.1
Checking gix-transport v0.54.0
Checking gix-refspec v0.37.0
Checking signal-hook-mio v0.2.4
Checking gix-pack v0.65.0
Checking arc-swap v1.8.2
Checking gix-credentials v0.36.0
Checking gix-shallow v0.8.1
Checking gix-ref v0.59.0
Checking gix-negotiate v0.27.0
Compiling maybe-async v0.2.10
Checking regex v1.11.1
Compiling proc-macro-error-attr2 v2.0.0
Compiling portable-atomic v1.11.0
Compiling proc-macro-error2 v2.0.1
Checking gix-protocol v0.57.0
Checking gix-odb v0.75.0
Compiling xattr v1.3.1
Compiling derive_more-impl v2.0.1
Compiling filetime v0.2.23
Checking uuid v1.20.0
Checking unicode-width v0.2.1
Compiling litrs v0.4.1
Checking bytes v1.11.1
Checking sqlite3-sys v0.15.2
Checking bitflags v1.3.2
Checking sqlite v0.32.0
Checking crossterm v0.25.0
Compiling document-features v0.2.11
Checking radicle-crypto v0.15.0 (/4caf264a-2270-4dd4-8432-bc4ae27e3de4/w/crates/radicle-crypto)
Checking console v0.16.0
Checking derive_more v2.0.1
Compiling tar v0.4.40
Compiling flate2 v1.1.1
Compiling git-ref-format-macro v0.6.0
Checking newline-converter v0.3.0
Checking snapbox-macros v0.3.8
Checking salsa20 v0.10.2
Checking fxhash v0.2.1
Checking clap_lex v0.7.5
Checking siphasher v0.3.11
Checking strsim v0.11.1
Compiling heck v0.5.0
Checking streaming-iterator v0.1.9
Checking unit-prefix v0.5.1
Checking similar v2.5.0
Checking normalize-line-endings v0.3.0
Checking unicode-width v0.1.11
Checking inquire v0.7.5
Checking snapbox v0.4.17
Checking indicatif v0.18.0
Checking bloomy v1.2.0
Compiling clap_derive v4.5.41
Checking clap_builder v4.5.44
Checking scrypt v0.11.0
Compiling radicle-surf v0.27.0
Checking git-ref-format v0.6.0
Checking crossterm v0.29.0
Checking unicode-display-width v0.3.0
Checking systemd-journal-logger v2.2.2
Checking toml_datetime v0.7.5+spec-1.1.0
Checking serde_spanned v1.0.4
Compiling tree-sitter-bash v0.23.3
Compiling tree-sitter-python v0.23.4
Compiling tree-sitter-json v0.24.8
Compiling tree-sitter-ruby v0.23.1
Compiling tree-sitter-go v0.23.4
Compiling tree-sitter-rust v0.23.2
Compiling tree-sitter-html v0.23.2
Compiling tree-sitter-typescript v0.23.2
Compiling tree-sitter-c v0.23.2
Compiling tree-sitter-css v0.23.1
Compiling tree-sitter-toml-ng v0.6.0
Compiling tree-sitter-md v0.3.2
Checking toml_writer v1.0.6+spec-1.1.0
Checking radicle-std-ext v0.2.0
Checking pin-project-lite v0.2.16
Checking tokio v1.47.1
Checking toml v0.9.12+spec-1.1.0
Checking clap v4.5.44
Checking sysinfo v0.37.2
Checking diff v0.1.13
Compiling radicle-cli v0.18.0 (/4caf264a-2270-4dd4-8432-bc4ae27e3de4/w/crates/radicle-cli)
Compiling radicle-node v0.17.0 (/4caf264a-2270-4dd4-8432-bc4ae27e3de4/w/crates/radicle-node)
Checking yansi v0.5.1
Checking pretty_assertions v1.4.0
Checking human-panic v2.0.6
Checking clap_complete v4.5.60
Checking structured-logger v1.0.4
Checking radicle-systemd v0.12.0 (/4caf264a-2270-4dd4-8432-bc4ae27e3de4/w/crates/radicle-systemd)
Checking tree-sitter-highlight v0.24.4
Checking itertools v0.14.0
Checking num-integer v0.1.46
Compiling qcheck-macros v1.0.0
Checking socket2 v0.5.7
Compiling escargot v0.5.10
Checking lexopt v0.3.0
Checking timeago v0.4.2
Checking bit-vec v0.8.0
Checking bit-set v0.8.0
Checking num-bigint v0.4.6
Checking rand_core v0.9.3
Compiling ahash v0.8.11
Checking num-iter v0.1.45
Checking num-complex v0.4.6
Checking env_filter v0.1.3
Checking zerocopy v0.7.35
Checking borrow-or-share v0.2.2
Checking fluent-uri v0.3.2
Checking num-rational v0.4.2
Checking env_logger v0.11.8
Checking phf_shared v0.11.3
Checking num v0.4.3
Compiling test-log-macros v0.2.19
Checking wait-timeout v0.2.1
Checking quick-error v1.2.3
Checking outref v0.5.2
Compiling paste v1.0.15
Compiling radicle-remote-helper v0.14.0 (/4caf264a-2270-4dd4-8432-bc4ae27e3de4/w/crates/radicle-remote-helper)
Checking fnv v1.0.7
Checking vsimd v0.8.0
Checking ppv-lite86 v0.2.17
Checking rand_chacha v0.9.0
Checking uuid-simd v0.8.0
Checking rusty-fork v0.3.1
Checking test-log v0.2.19
Checking fraction v0.15.3
Checking phf v0.11.3
Checking referencing v0.30.0
Checking rand v0.9.2
Checking rand_xorshift v0.4.0
Checking fancy-regex v0.14.0
Checking email_address v0.2.9
Checking unarray v0.1.4
Checking num-cmp v0.1.0
Checking bytecount v0.6.8
Checking base64 v0.22.1
Checking proptest v1.9.0
Checking emojis v0.6.4
Checking jsonschema v0.30.0
Checking radicle-windows v0.1.0 (/4caf264a-2270-4dd4-8432-bc4ae27e3de4/w/crates/radicle-windows)
Checking git2 v0.20.4
Checking radicle-oid v0.1.0 (/4caf264a-2270-4dd4-8432-bc4ae27e3de4/w/crates/radicle-oid)
Checking radicle-git-ext v0.12.0
Checking radicle-term v0.17.0 (/4caf264a-2270-4dd4-8432-bc4ae27e3de4/w/crates/radicle-term)
Checking radicle-cob v0.18.0 (/4caf264a-2270-4dd4-8432-bc4ae27e3de4/w/crates/radicle-cob)
Checking radicle-core v0.1.0 (/4caf264a-2270-4dd4-8432-bc4ae27e3de4/w/crates/radicle-core)
Checking radicle v0.21.0 (/4caf264a-2270-4dd4-8432-bc4ae27e3de4/w/crates/radicle)
Checking radicle-fetch v0.17.0 (/4caf264a-2270-4dd4-8432-bc4ae27e3de4/w/crates/radicle-fetch)
Checking radicle-cli-test v0.13.0 (/4caf264a-2270-4dd4-8432-bc4ae27e3de4/w/crates/radicle-cli-test)
Checking radicle-protocol v0.5.0 (/4caf264a-2270-4dd4-8432-bc4ae27e3de4/w/crates/radicle-protocol)
Checking radicle-schemars v0.6.0 (/4caf264a-2270-4dd4-8432-bc4ae27e3de4/w/crates/radicle-schemars)
Finished `dev` profile [unoptimized + debuginfo] target(s) in 54.11s
+ cargo build --all-targets --workspace
Compiling libc v0.2.182
Compiling cfg-if v1.0.0
Compiling memchr v2.7.2
Compiling shlex v1.3.0
Compiling regex-syntax v0.8.5
Compiling typenum v1.17.0
Compiling aho-corasick v1.1.3
Compiling generic-array v0.14.7
Compiling jobserver v0.1.31
Compiling cc v1.2.2
Compiling getrandom v0.2.15
Compiling rand_core v0.6.4
Compiling serde_core v1.0.228
Compiling regex-automata v0.4.9
Compiling crypto-common v0.1.6
Compiling smallvec v1.15.1
Compiling subtle v2.5.0
Compiling thiserror v2.0.18
Compiling fastrand v2.3.0
Compiling cpufeatures v0.2.12
Compiling stable_deref_trait v1.2.0
Compiling serde v1.0.228
Compiling scopeguard v1.2.0
Compiling lock_api v0.4.14
Compiling parking_lot_core v0.9.12
Compiling block-buffer v0.10.4
Compiling digest v0.10.7
Compiling parking_lot v0.12.5
Compiling bitflags v2.9.1
Compiling byteorder v1.5.0
Compiling tinyvec_macros v0.1.1
Compiling tinyvec v1.6.0
Compiling gix-trace v0.1.18
Compiling crc32fast v1.5.0
Compiling itoa v1.0.17
Compiling same-file v1.0.6
Compiling walkdir v2.5.0
Compiling typeid v1.0.3
Compiling prodash v31.0.0
Compiling unicode-normalization v0.1.23
Compiling zlib-rs v0.6.0
Compiling erased-serde v0.4.6
Compiling gix-utils v0.3.1
Compiling bstr v1.12.0
Compiling hash32 v0.3.1
Compiling serde_fmt v1.0.3
Compiling value-bag-serde1 v1.11.1
Compiling heapless v0.8.0
Compiling gix-validate v0.11.0
Compiling faster-hex v0.10.0
Compiling gix-path v0.11.1
Compiling value-bag v1.11.1
Compiling log v0.4.27
Compiling sha1 v0.10.6
Compiling zeroize v1.7.0
Compiling sha1-checked v0.10.0
Compiling zerofrom v0.1.6
Compiling getrandom v0.3.3
Compiling yoke v0.7.5
Compiling linux-raw-sys v0.11.0
Compiling zerovec v0.10.4
Compiling gix-features v0.46.1
Compiling gix-hash v0.22.1
Compiling rustix v1.1.3
Compiling block-padding v0.3.3
Compiling once_cell v1.21.3
Compiling inout v0.1.3
Compiling tinystr v0.7.6
Compiling litemap v0.7.5
Compiling cipher v0.4.4
Compiling writeable v0.5.5
Compiling percent-encoding v2.3.1
Compiling icu_locid_transform_data v1.5.1
Compiling icu_properties_data v1.5.1
Compiling icu_locid v1.5.0
Compiling icu_collections v1.5.0
Compiling hashbrown v0.14.3
Compiling icu_provider v1.5.0
Compiling equivalent v1.0.1
Compiling indexmap v2.2.6
Compiling icu_locid_transform v1.5.0
Compiling icu_normalizer_data v1.5.1
Compiling sha2 v0.10.8
Compiling icu_properties v1.5.1
Compiling utf16_iter v1.0.5
Compiling utf8_iter v1.0.4
Compiling ryu v1.0.17
Compiling write16 v1.0.0
Compiling serde_json v1.0.140
Compiling libz-sys v1.1.16
Compiling thiserror v1.0.69
Compiling tempfile v3.25.0
Compiling universal-hash v0.5.1
Compiling opaque-debug v0.3.1
Compiling ref-cast v1.0.24
Compiling dyn-clone v1.0.17
Compiling libgit2-sys v0.18.3+1.9.2
Compiling signature v1.6.4
Compiling icu_normalizer v1.5.0
Compiling ed25519 v1.5.3
Compiling idna_adapter v1.2.0
Compiling form_urlencoded v1.2.1
Compiling idna v1.0.3
Compiling aead v0.5.2
Compiling ct-codecs v1.1.1
Compiling amplify_num v0.5.2
Compiling ascii v1.1.0
Compiling url v2.5.4
Compiling ec25519 v0.1.0
Compiling num-traits v0.2.19
Compiling poly1305 v0.8.0
Compiling amplify v4.6.0
Compiling git-ref-format-core v0.6.0
Compiling chacha20 v0.9.1
Compiling cyphergraphy v0.3.0
Compiling schemars v1.0.4
Compiling polyval v0.6.2
Compiling sqlite3-src v0.5.1
Compiling hmac v0.12.1
Compiling keccak v0.1.6
Compiling base64ct v1.6.0
Compiling sha3 v0.10.8
Compiling pem-rfc7468 v0.7.0
Compiling pbkdf2 v0.12.2
Compiling ghash v0.5.1
Compiling ctr v0.9.2
Compiling aes v0.8.4
Compiling rand v0.8.5
Compiling base32 v0.4.0
Compiling cypheraddr v0.4.0
Compiling qcheck v1.0.0
Compiling aes-gcm v0.10.3
Compiling ssh-encoding v0.2.0
Compiling chacha20poly1305 v0.10.1
Compiling blowfish v0.9.1
Compiling cbc v0.1.2
Compiling jiff v0.2.20
Compiling data-encoding v2.5.0
Compiling data-encoding-macro v0.1.14
Compiling ssh-cipher v0.2.0
Compiling bcrypt-pbkdf v0.10.0
Compiling noise-framework v0.4.0
Compiling socks5-client v0.4.1
Compiling base-x v0.2.11
Compiling signature v2.2.0
Compiling ssh-key v0.6.6
Compiling multibase v0.9.1
Compiling cyphernet v0.5.2
Compiling radicle-ssh v0.10.0 (/4caf264a-2270-4dd4-8432-bc4ae27e3de4/w/crates/radicle-ssh)
Compiling crossbeam-utils v0.8.19
Compiling winnow v0.7.14
Compiling crossbeam-channel v0.5.15
Compiling lazy_static v1.5.0
Compiling hashbrown v0.16.1
Compiling gix-hashtable v0.12.0
Compiling nonempty v0.9.0
Compiling anstyle-query v1.0.2
Compiling siphasher v1.0.1
Compiling gix-error v0.1.0
Compiling radicle-dag v0.10.0 (/4caf264a-2270-4dd4-8432-bc4ae27e3de4/w/crates/radicle-dag)
Compiling radicle-git-metadata v0.1.0 (/4caf264a-2270-4dd4-8432-bc4ae27e3de4/w/crates/radicle-git-metadata)
Compiling memmap2 v0.9.8
Compiling utf8parse v0.2.2
Compiling anstyle-parse v0.2.3
Compiling radicle-git-ref-format v0.1.0 (/4caf264a-2270-4dd4-8432-bc4ae27e3de4/w/crates/radicle-git-ref-format)
Compiling anstyle v1.0.13
Compiling base64 v0.21.7
Compiling iana-time-zone v0.1.60
Compiling is_terminal_polyfill v1.70.2
Compiling colorchoice v1.0.0
Compiling anstream v0.6.21
Compiling chrono v0.4.38
Compiling colored v2.1.0
Compiling radicle-localtime v0.1.0 (/4caf264a-2270-4dd4-8432-bc4ae27e3de4/w/crates/radicle-localtime)
Compiling gix-error v0.0.0
Compiling serde-untagged v0.1.7
Compiling bytesize v2.0.1
Compiling dunce v1.0.5
Compiling tree-sitter-language v0.1.2
Compiling fast-glob v0.3.3
Compiling gix-date v0.14.0
Compiling adler2 v2.0.0
Compiling gix-actor v0.39.0
Compiling gix-date v0.13.0
Compiling gix-fs v0.19.1
Compiling gix-actor v0.38.0
Compiling gix-tempfile v21.0.1
Compiling gix-object v0.56.0
Compiling gix-chunk v0.6.0
Compiling mio v1.0.4
Compiling gix-quote v0.6.2
Compiling gix-commitgraph v0.33.0
Compiling gix-object v0.55.0
Compiling gix-chunk v0.5.0
Compiling sem_safe v0.2.0
Compiling errno v0.3.13
Compiling shell-words v1.1.0
Compiling either v1.11.0
Compiling unicode-segmentation v1.11.0
Compiling gix-command v0.7.1
Compiling signals_receipts v0.2.0
Compiling gix-commitgraph v0.32.0
Compiling gix-revwalk v0.27.0
Compiling gix-revwalk v0.26.0
Compiling gix-lock v21.0.1
Compiling gix-url v0.35.1
Compiling gix-config-value v0.17.1
Compiling gix-sec v0.13.1
Compiling signal-hook-registry v1.4.5
Compiling gimli v0.32.3
Compiling signal-hook v0.3.18
Compiling gix-prompt v0.13.1
Compiling gix-traverse v0.52.0
Compiling object v0.37.3
Compiling addr2line v0.25.1
Compiling gix-revision v0.41.0
Compiling radicle-signals v0.11.0 (/4caf264a-2270-4dd4-8432-bc4ae27e3de4/w/crates/radicle-signals)
Compiling sqlite3-sys v0.15.2
Compiling sqlite v0.32.0
Compiling radicle-crypto v0.15.0 (/4caf264a-2270-4dd4-8432-bc4ae27e3de4/w/crates/radicle-crypto)
Compiling gix-diff v0.58.0
Compiling miniz_oxide v0.8.8
Compiling gix-glob v0.24.0
Compiling mio v0.8.11
Compiling gix-packetline v0.21.1
Compiling tree-sitter v0.24.4
Compiling rustc-demangle v0.1.26
Compiling rustix v0.38.34
Compiling backtrace v0.3.76
Compiling signal-hook-mio v0.2.4
Compiling gix-transport v0.54.0
Compiling gix-refspec v0.37.0
Compiling gix-pack v0.65.0
Compiling arc-swap v1.8.2
Compiling gix-credentials v0.36.0
Compiling gix-shallow v0.8.1
Compiling gix-ref v0.59.0
Compiling gix-negotiate v0.27.0
Compiling convert_case v0.7.1
Compiling regex v1.11.1
Compiling gix-protocol v0.57.0
Compiling derive_more-impl v2.0.1
Compiling gix-odb v0.75.0
Compiling xattr v1.3.1
Compiling uuid v1.20.0
Compiling filetime v0.2.23
Compiling bytes v1.11.1
Compiling bitflags v1.3.2
Compiling unicode-width v0.2.1
Compiling console v0.16.0
Compiling crossterm v0.25.0
Compiling tar v0.4.40
Compiling git-ref-format-macro v0.6.0
Compiling flate2 v1.1.1
Compiling derive_more v2.0.1
Compiling anyhow v1.0.82
Compiling portable-atomic v1.11.0
Compiling newline-converter v0.3.0
Compiling snapbox-macros v0.3.8
Compiling salsa20 v0.10.2
Compiling fxhash v0.2.1
Compiling normalize-line-endings v0.3.0
Compiling siphasher v0.3.11
Compiling clap_lex v0.7.5
Compiling strsim v0.11.1
Compiling unit-prefix v0.5.1
Compiling similar v2.5.0
Compiling unicode-width v0.1.11
Compiling streaming-iterator v0.1.9
Compiling inquire v0.7.5
Compiling snapbox v0.4.17
Compiling indicatif v0.18.0
Compiling clap_builder v4.5.44
Compiling bloomy v1.2.0
Compiling scrypt v0.11.0
Compiling radicle-surf v0.27.0
Compiling crossterm v0.29.0
Compiling git-ref-format v0.6.0
Compiling unicode-display-width v0.3.0
Compiling systemd-journal-logger v2.2.2
Compiling toml_datetime v0.7.5+spec-1.1.0
Compiling serde_spanned v1.0.4
Compiling tree-sitter-rust v0.23.2
Compiling tree-sitter-go v0.23.4
Compiling tree-sitter-typescript v0.23.2
Compiling tree-sitter-c v0.23.2
Compiling tree-sitter-md v0.3.2
Compiling tree-sitter-bash v0.23.3
Compiling tree-sitter-toml-ng v0.6.0
Compiling tree-sitter-json v0.24.8
Compiling tree-sitter-python v0.23.4
Compiling tree-sitter-html v0.23.2
Compiling tree-sitter-ruby v0.23.1
Compiling tree-sitter-css v0.23.1
Compiling pin-project-lite v0.2.16
Compiling radicle-std-ext v0.2.0
Compiling toml_writer v1.0.6+spec-1.1.0
Compiling toml v0.9.12+spec-1.1.0
Compiling tokio v1.47.1
Compiling clap v4.5.44
Compiling sysinfo v0.37.2
Compiling radicle-cli v0.18.0 (/4caf264a-2270-4dd4-8432-bc4ae27e3de4/w/crates/radicle-cli)
Compiling yansi v0.5.1
Compiling radicle-node v0.17.0 (/4caf264a-2270-4dd4-8432-bc4ae27e3de4/w/crates/radicle-node)
Compiling diff v0.1.13
Compiling pretty_assertions v1.4.0
Compiling human-panic v2.0.6
Compiling clap_complete v4.5.60
Compiling structured-logger v1.0.4
Compiling radicle-systemd v0.12.0 (/4caf264a-2270-4dd4-8432-bc4ae27e3de4/w/crates/radicle-systemd)
Compiling tree-sitter-highlight v0.24.4
Compiling itertools v0.14.0
Compiling num-integer v0.1.46
Compiling socket2 v0.5.7
Compiling timeago v0.4.2
Compiling lexopt v0.3.0
Compiling bit-vec v0.8.0
Compiling escargot v0.5.10
Compiling bit-set v0.8.0
Compiling num-bigint v0.4.6
Compiling rand_core v0.9.3
Compiling num-iter v0.1.45
Compiling num-complex v0.4.6
Compiling env_filter v0.1.3
Compiling num-rational v0.4.2
Compiling borrow-or-share v0.2.2
Compiling zerocopy v0.7.35
Compiling ahash v0.8.11
Compiling num v0.4.3
Compiling fluent-uri v0.3.2
Compiling env_logger v0.11.8
Compiling phf_shared v0.11.3
Compiling wait-timeout v0.2.1
Compiling ppv-lite86 v0.2.17
Compiling vsimd v0.8.0
Compiling quick-error v1.2.3
Compiling fnv v1.0.7
Compiling radicle-remote-helper v0.14.0 (/4caf264a-2270-4dd4-8432-bc4ae27e3de4/w/crates/radicle-remote-helper)
Compiling outref v0.5.2
Compiling rusty-fork v0.3.1
Compiling uuid-simd v0.8.0
Compiling rand_chacha v0.9.0
Compiling referencing v0.30.0
Compiling test-log v0.2.19
Compiling phf v0.11.3
Compiling fraction v0.15.3
Compiling rand v0.9.2
Compiling rand_xorshift v0.4.0
Compiling fancy-regex v0.14.0
Compiling email_address v0.2.9
Compiling num-cmp v0.1.0
Compiling base64 v0.22.1
Compiling bytecount v0.6.8
Compiling git2 v0.20.4
Compiling unarray v0.1.4
Compiling jsonschema v0.30.0
Compiling proptest v1.9.0
Compiling emojis v0.6.4
Compiling radicle-oid v0.1.0 (/4caf264a-2270-4dd4-8432-bc4ae27e3de4/w/crates/radicle-oid)
Compiling radicle-cob v0.18.0 (/4caf264a-2270-4dd4-8432-bc4ae27e3de4/w/crates/radicle-cob)
Compiling radicle-core v0.1.0 (/4caf264a-2270-4dd4-8432-bc4ae27e3de4/w/crates/radicle-core)
Compiling radicle-git-ext v0.12.0
Compiling radicle v0.21.0 (/4caf264a-2270-4dd4-8432-bc4ae27e3de4/w/crates/radicle)
Compiling radicle-term v0.17.0 (/4caf264a-2270-4dd4-8432-bc4ae27e3de4/w/crates/radicle-term)
Compiling radicle-windows v0.1.0 (/4caf264a-2270-4dd4-8432-bc4ae27e3de4/w/crates/radicle-windows)
Compiling radicle-fetch v0.17.0 (/4caf264a-2270-4dd4-8432-bc4ae27e3de4/w/crates/radicle-fetch)
Compiling radicle-protocol v0.5.0 (/4caf264a-2270-4dd4-8432-bc4ae27e3de4/w/crates/radicle-protocol)
Compiling radicle-cli-test v0.13.0 (/4caf264a-2270-4dd4-8432-bc4ae27e3de4/w/crates/radicle-cli-test)
Compiling radicle-schemars v0.6.0 (/4caf264a-2270-4dd4-8432-bc4ae27e3de4/w/crates/radicle-schemars)
Finished `dev` profile [unoptimized + debuginfo] target(s) in 1m 11s
+ cargo doc --workspace --no-deps --all-features
Checking regex-automata v0.4.9
Compiling syn v1.0.109
Checking idna v1.0.3
Compiling num-traits v0.2.19
Checking radicle-ssh v0.10.0 (/4caf264a-2270-4dd4-8432-bc4ae27e3de4/w/crates/radicle-ssh)
Checking url v2.5.4
Checking git2 v0.20.4
Checking proptest v1.9.0
Checking bstr v1.12.0
Checking gix-validate v0.11.0
Checking gix-path v0.11.1
Checking gix-features v0.46.1
Checking git-ref-format-core v0.6.0
Checking gix-hash v0.22.1
Compiling amplify_syn v2.0.1
Compiling data-encoding-macro-internal v0.1.12
Checking radicle-git-ref-format v0.1.0 (/4caf264a-2270-4dd4-8432-bc4ae27e3de4/w/crates/radicle-git-ref-format)
Checking gix-hashtable v0.12.0
Checking radicle-oid v0.1.0 (/4caf264a-2270-4dd4-8432-bc4ae27e3de4/w/crates/radicle-oid)
Checking data-encoding-macro v0.1.14
Checking gix-error v0.1.0
Checking multibase v0.9.1
Checking gix-error v0.0.0
Checking radicle-dag v0.10.0 (/4caf264a-2270-4dd4-8432-bc4ae27e3de4/w/crates/radicle-dag)
Checking radicle-git-metadata v0.1.0 (/4caf264a-2270-4dd4-8432-bc4ae27e3de4/w/crates/radicle-git-metadata)
Checking gix-date v0.14.0
Checking chrono v0.4.38
Checking radicle-localtime v0.1.0 (/4caf264a-2270-4dd4-8432-bc4ae27e3de4/w/crates/radicle-localtime)
Compiling amplify_derive v4.0.0
Checking gix-actor v0.39.0
Checking gix-date v0.13.0
Checking gix-fs v0.19.1
Checking gix-actor v0.38.0
Checking gix-tempfile v21.0.1
Checking gix-object v0.56.0
Checking gix-chunk v0.6.0
Checking gix-quote v0.6.2
Checking gix-object v0.55.0
Checking gix-commitgraph v0.33.0
Checking gix-chunk v0.5.0
Checking gix-command v0.7.1
Checking gix-commitgraph v0.32.0
Checking gix-revwalk v0.27.0
Checking gix-lock v21.0.1
Checking gix-revwalk v0.26.0
Checking gix-config-value v0.17.1
Checking gix-url v0.35.1
Checking gix-traverse v0.52.0
Checking gix-prompt v0.13.1
Checking gix-revision v0.41.0
Checking gix-diff v0.58.0
Checking radicle-signals v0.11.0 (/4caf264a-2270-4dd4-8432-bc4ae27e3de4/w/crates/radicle-signals)
Checking amplify v4.6.0
Checking gix-glob v0.24.0
Checking gix-packetline v0.21.1
Checking regex v1.11.1
Checking gix-transport v0.54.0
Checking gix-refspec v0.37.0
Checking cyphergraphy v0.3.0
Checking gix-pack v0.65.0
Checking git-ref-format v0.6.0
Checking cypheraddr v0.4.0
Checking noise-framework v0.4.0
Checking tree-sitter v0.24.4
Checking socks5-client v0.4.1
Checking gix-credentials v0.36.0
Checking cyphernet v0.5.2
Checking gix-shallow v0.8.1
Checking radicle-crypto v0.15.0 (/4caf264a-2270-4dd4-8432-bc4ae27e3de4/w/crates/radicle-crypto)
Checking gix-ref v0.59.0
Checking gix-negotiate v0.27.0
Checking radicle-git-ext v0.12.0
Checking radicle-cob v0.18.0 (/4caf264a-2270-4dd4-8432-bc4ae27e3de4/w/crates/radicle-cob)
Checking radicle-core v0.1.0 (/4caf264a-2270-4dd4-8432-bc4ae27e3de4/w/crates/radicle-core)
Checking gix-odb v0.75.0
Checking uuid v1.20.0
Checking gix-protocol v0.57.0
Compiling radicle-cli v0.18.0 (/4caf264a-2270-4dd4-8432-bc4ae27e3de4/w/crates/radicle-cli)
Checking human-panic v2.0.6
Checking radicle-surf v0.27.0
Checking radicle v0.21.0 (/4caf264a-2270-4dd4-8432-bc4ae27e3de4/w/crates/radicle)
Checking tree-sitter-toml-ng v0.6.0
Checking radicle-term v0.17.0 (/4caf264a-2270-4dd4-8432-bc4ae27e3de4/w/crates/radicle-term)
Checking tree-sitter-highlight v0.24.4
Checking radicle-systemd v0.12.0 (/4caf264a-2270-4dd4-8432-bc4ae27e3de4/w/crates/radicle-systemd)
Documenting radicle-systemd v0.12.0 (/4caf264a-2270-4dd4-8432-bc4ae27e3de4/w/crates/radicle-systemd)
Documenting radicle v0.21.0 (/4caf264a-2270-4dd4-8432-bc4ae27e3de4/w/crates/radicle)
Documenting radicle-cob v0.18.0 (/4caf264a-2270-4dd4-8432-bc4ae27e3de4/w/crates/radicle-cob)
Documenting radicle-core v0.1.0 (/4caf264a-2270-4dd4-8432-bc4ae27e3de4/w/crates/radicle-core)
Documenting radicle-term v0.17.0 (/4caf264a-2270-4dd4-8432-bc4ae27e3de4/w/crates/radicle-term)
Documenting radicle-crypto v0.15.0 (/4caf264a-2270-4dd4-8432-bc4ae27e3de4/w/crates/radicle-crypto)
Documenting radicle-signals v0.11.0 (/4caf264a-2270-4dd4-8432-bc4ae27e3de4/w/crates/radicle-signals)
Documenting radicle-oid v0.1.0 (/4caf264a-2270-4dd4-8432-bc4ae27e3de4/w/crates/radicle-oid)
Documenting radicle-git-ref-format v0.1.0 (/4caf264a-2270-4dd4-8432-bc4ae27e3de4/w/crates/radicle-git-ref-format)
Documenting radicle-localtime v0.1.0 (/4caf264a-2270-4dd4-8432-bc4ae27e3de4/w/crates/radicle-localtime)
Documenting radicle-ssh v0.10.0 (/4caf264a-2270-4dd4-8432-bc4ae27e3de4/w/crates/radicle-ssh)
Documenting radicle-dag v0.10.0 (/4caf264a-2270-4dd4-8432-bc4ae27e3de4/w/crates/radicle-dag)
Documenting radicle-git-metadata v0.1.0 (/4caf264a-2270-4dd4-8432-bc4ae27e3de4/w/crates/radicle-git-metadata)
Documenting radicle-windows v0.1.0 (/4caf264a-2270-4dd4-8432-bc4ae27e3de4/w/crates/radicle-windows)
Checking radicle-fetch v0.17.0 (/4caf264a-2270-4dd4-8432-bc4ae27e3de4/w/crates/radicle-fetch)
Documenting radicle-cli v0.18.0 (/4caf264a-2270-4dd4-8432-bc4ae27e3de4/w/crates/radicle-cli)
Documenting radicle-cli-test v0.13.0 (/4caf264a-2270-4dd4-8432-bc4ae27e3de4/w/crates/radicle-cli-test)
Checking radicle-protocol v0.5.0 (/4caf264a-2270-4dd4-8432-bc4ae27e3de4/w/crates/radicle-protocol)
Documenting radicle-protocol v0.5.0 (/4caf264a-2270-4dd4-8432-bc4ae27e3de4/w/crates/radicle-protocol)
Documenting radicle-node v0.17.0 (/4caf264a-2270-4dd4-8432-bc4ae27e3de4/w/crates/radicle-node)
Documenting radicle-schemars v0.6.0 (/4caf264a-2270-4dd4-8432-bc4ae27e3de4/w/crates/radicle-schemars)
Documenting radicle-fetch v0.17.0 (/4caf264a-2270-4dd4-8432-bc4ae27e3de4/w/crates/radicle-fetch)
Documenting radicle-remote-helper v0.14.0 (/4caf264a-2270-4dd4-8432-bc4ae27e3de4/w/crates/radicle-remote-helper)
Finished `dev` profile [unoptimized + debuginfo] target(s) in 12.65s
Generated /4caf264a-2270-4dd4-8432-bc4ae27e3de4/w/target/doc/radicle/index.html and 21 other files
+ cargo test --workspace --no-fail-fast
Finished `test` profile [unoptimized + debuginfo] target(s) in 0.23s
Running unittests src/lib.rs (target/debug/deps/radicle-5d7696ca4698d814)
running 240 tests
test canonical::formatter::test::ascii_control_characters ... ok
test canonical::formatter::test::securesystemslib_asserts ... ok
test canonical::formatter::test::ordered_nested_object ... ok
test cob::cache::migrations::_2::tests::test_patch_json_deserialization ... ok
test cob::common::test::test_color ... ok
test cob::cache::tests::test_migrate_to ... ok
test cob::common::test::test_emojis ... ok
test cob::cache::tests::test_check_version ... ok
test cob::common::test::test_title ... ok
test cob::cache::migrations::_2::tests::test_migration_2 ... ok
test cob::identity::test::prop_json_eq_str ... ok
test cob::identity::test::test_identity_redact_revision ... ok
test cob::identity::test::test_identity_update_rejected ... ok
test cob::identity::test::test_identity_remove_delegate_concurrent ... ok
test cob::identity::test::test_identity_reject_concurrent ... ok
test cob::identity::test::test_identity_updates ... ok
test cob::issue::cache::tests::test_counts ... ok
test cob::issue::cache::tests::test_get ... ok
test cob::issue::cache::tests::test_is_empty ... ok
test cob::issue::cache::tests::test_list ... ok
test cob::issue::cache::tests::test_list_by_status ... ok
test cob::issue::cache::tests::test_remove ... ok
test cob::identity::test::test_identity_updates_concurrent ... ok
test cob::identity::test::test_identity_updates_concurrent_outdated ... ok
test cob::identity::test::test_valid_identity ... ok
test cob::issue::test::test_embeds ... ok
test cob::issue::test::test_embeds_edit ... ok
test cob::issue::test::test_invalid_actions ... ok
test cob::issue::test::test_invalid_cob ... ok
test cob::issue::test::test_invalid_tx ... ok
test cob::issue::test::test_invalid_tx_reference ... ok
test cob::issue::test::test_issue_all ... ok
test cob::issue::test::test_concurrency ... ok
test cob::issue::test::test_issue_comment ... ok
test cob::issue::test::test_issue_comment_redact ... ok
test cob::issue::test::test_issue_create_and_assign ... ok
test cob::issue::test::test_issue_create_and_get ... ok
test cob::issue::test::test_issue_create_and_change_state ... ok
test cob::issue::test::test_issue_create_and_reassign ... ok
test cob::issue::test::test_issue_create_and_unassign ... ok
test cob::issue::test::test_issue_edit ... ok
test cob::issue::test::test_issue_edit_description ... ok
test cob::issue::test::test_issue_multilines ... ok
test cob::issue::test::test_issue_state_serde ... ok
test cob::issue::test::test_ordering ... ok
test cob::patch::actions::test::test_review_edit ... ok
test cob::issue::test::test_issue_label ... ok
test cob::issue::test::test_issue_react ... ok
test cob::issue::test::test_issue_reply ... ok
test cob::patch::cache::tests::test_is_empty ... ok
test cob::patch::cache::tests::test_counts ... ok
test cob::patch::cache::tests::test_list ... ok
test cob::patch::cache::tests::test_list_by_status ... ok
test cob::patch::cache::tests::test_get ... ok
test cob::patch::encoding::review::test::test_review_deserialize_summary_migration_with_summary ... ok
test cob::patch::encoding::review::test::test_review_deserialize_summary_migration_without_summary ... ok
test cob::patch::encoding::review::test::test_review_deserialize_summary_migration_null_summary ... ok
test cob::patch::encoding::review::test::test_review_deserialize_summary_v2 ... ok
test cob::patch::encoding::review::test::test_review_summary ... ok
test cob::patch::test::test_json ... ok
test cob::patch::test::test_json_serialization ... ok
test cob::patch::cache::tests::test_remove ... ok
test cob::patch::test::test_patch_create_and_get ... ok
test cob::patch::test::test_patch_discussion ... ok
test cob::patch::test::test_patch_merge ... ok
test cob::patch::test::test_patch_review_comment ... ok
test cob::patch::test::test_patch_review ... ok
test cob::patch::test::test_patch_redact ... ok
test cob::patch::test::test_patch_review_duplicate ... ok
test cob::patch::test::test_patch_review_edit ... ok
test cob::patch::test::test_patch_review_remove_summary ... ok
test cob::patch::test::test_patch_review_edit_comment ... ok
test cob::patch::test::test_reactions_json_serialization ... ok
test cob::patch::test::test_revision_edit_redact ... ok
test cob::patch::test::test_revision_reaction ... ok
test cob::patch::test::test_revision_review_merge_redacted ... ok
test cob::stream::tests::test_all_from ... ok
test cob::stream::tests::test_all_from_until ... ok
test cob::stream::tests::test_all_until ... ok
test cob::patch::test::test_patch_review_revision_redact ... ok
test cob::stream::tests::test_regression_from_until ... ok
test cob::stream::tests::test_from_until ... ok
test cob::thread::tests::test_comment_edit_missing ... ok
test cob::patch::test::test_patch_update ... ok
test cob::thread::tests::test_comment_edit_redacted ... ok
test cob::thread::tests::test_comment_redact_missing ... ok
test cob::thread::tests::test_edit_comment ... ok
test cob::thread::tests::test_duplicate_comments ... ok
test cob::thread::tests::test_redact_comment ... ok
test git::canonical::quorum::test::merge_base_commutative ... ok
test git::canonical::quorum::test::test_merge_bases ... ok
test cob::thread::tests::test_timeline ... ok
test git::canonical::rules::tests::test_deserialization ... ok
test git::canonical::rules::tests::test_deserialize_extensions ... ok
test git::canonical::rules::tests::test_order ... ok
test git::canonical::rules::tests::test_roundtrip ... ok
test git::canonical::rules::tests::test_canonical ... ok
test git::canonical::rules::tests::test_rule_validate_failures ... ok
test git::canonical::rules::tests::test_special_branches ... ok
test git::canonical::tests::test_commit_quorum_fork_of_a_fork ... ok
test git::canonical::tests::test_commit_quorum_forked_merge_commits ... ok
test git::canonical::tests::test_commit_quorum_groups ... ok
test git::canonical::rules::tests::test_rule_validate_success ... ok
test git::canonical::tests::test_commit_quorum_linear ... ok
test git::canonical::tests::test_commit_quorum_merges ... ok
test git::canonical::tests::test_commit_quorum_single ... ok
test git::canonical::tests::test_commit_quorum_three_way_fork ... ok
test git::canonical::tests::test_commit_quorum_two_way_fork ... ok
test git::canonical::tests::test_quorum_different_types ... ok
test git::canonical::tests::test_tag_quorum ... ok
test git::test::test_version_from_str ... ok
test git::test::test_version_ord ... ok
test identity::did::test::test_did_encode_decode ... ok
test identity::did::test::test_did_vectors ... ok
test cob::thread::tests::prop_ordering ... ok
test identity::doc::test::test_canonical_doc ... ok
test identity::doc::test::test_canonical_example ... ok
test identity::doc::test::test_duplicate_dids ... ok
test identity::doc::test::test_future_version_error ... ok
test identity::doc::test::test_is_valid_version ... ok
test git::canonical::tests::test_quorum_properties ... ok
test identity::doc::test::test_max_delegates ... ok
test identity::doc::test::test_parse_version ... ok
test identity::doc::test::test_visibility_json ... ok
test identity::doc::update::test::test_can_update_crefs ... ok
test identity::doc::update::test::test_cannot_include_default_branch_rule ... ok
test identity::doc::update::test::test_default_branch_rule_exists_after_verification ... ok
test identity::doc::test::test_not_found ... ok
test identity::project::test::test_project_name ... ok
test node::address::store::test::test_alias ... FAILED
test node::address::store::test::test_disconnected ... FAILED
test node::address::store::test::test_disconnected_ban ... FAILED
test node::address::store::test::test_entries ... FAILED
test node::address::store::test::test_get_none ... FAILED
test node::address::store::test::test_insert_and_get ... FAILED
test node::address::store::test::test_insert_and_remove ... FAILED
test node::address::store::test::test_insert_and_update ... FAILED
test node::address::store::test::test_insert_duplicate ... FAILED
test node::address::store::test::test_node_aliases ... FAILED
test node::address::store::test::test_remove_nothing ... FAILED
test node::command::test::command_result ... ok
test node::config::test::deserialize_migrating_scope ... ok
test node::config::test::partial ... ok
test node::config::test::serialize_migrating_scope ... ok
test node::db::config::test::database_config_valid_combinations ... ok
test node::db::config::test::invalid ... ok
test node::db::test::test_version ... FAILED
test node::features::test::test_operations ... ok
test node::notifications::store::test::test_branch_notifications ... ok
test node::notifications::store::test::test_clear ... ok
test node::notifications::store::test::test_cob_notifications ... ok
test node::notifications::store::test::test_counts_by_repo ... ok
test node::notifications::store::test::test_duplicate_notifications ... ok
test node::notifications::store::test::test_notification_status ... ok
test node::policy::store::test::test_follow_and_unfollow_node ... ok
test node::policy::store::test::test_node_aliases ... ok
test node::policy::store::test::test_node_policies ... ok
test node::policy::store::test::test_node_policy ... ok
test node::policy::store::test::test_repo_policies ... ok
test node::policy::store::test::test_repo_policy ... ok
test node::policy::store::test::test_seed_and_unseed_repo ... ok
test node::policy::store::test::test_update_alias ... ok
test node::policy::store::test::test_update_scope ... ok
test node::refs::store::test::test_count ... FAILED
test node::refs::store::test::test_set_and_delete ... FAILED
test node::refs::store::test::test_set_and_get ... FAILED
test node::routing::test::test_count ... FAILED
test node::routing::test::test_entries ... FAILED
test node::routing::test::test_insert_and_get ... FAILED
test node::routing::test::test_insert_and_get_resources ... FAILED
test node::routing::test::test_insert_and_remove ... FAILED
test node::routing::test::test_insert_duplicate ... FAILED
test node::routing::test::test_insert_existing_updated_time ... FAILED
test node::routing::test::test_len ... FAILED
test node::address::store::test::test_empty ... FAILED
test node::routing::test::test_remove_many ... FAILED
test node::routing::test::test_prune ... FAILED
test node::routing::test::test_remove_redundant ... FAILED
test node::routing::test::test_update_existing_multi ... FAILED
test node::sync::announce::test::all_synced_nodes_are_preferred_seeds ... ok
test node::sync::announce::test::announcer_adapts_target_to_reach ... ok
test node::sync::announce::test::announcer_preferred_seeds_or_replica_factor ... ok
test node::sync::announce::test::announcer_reached_max_replication_target ... ok
test node::sync::announce::test::announcer_reached_min_replication_target ... ok
test node::sync::announce::test::announcer_synced_with_unknown_node ... ok
test node::sync::announce::test::announcer_reached_preferred_seeds ... ok
test node::sync::announce::test::announcer_timed_out ... ok
test node::sync::announce::test::announcer_with_replication_factor_zero_and_preferred_seeds ... ok
test node::sync::announce::test::construct_node_appears_in_multiple_input_sets ... ok
test node::sync::announce::test::cannot_construct_announcer ... ok
test node::sync::announce::test::construct_only_preferred_seeds_provided ... ok
test node::sync::announce::test::invariant_progress_should_match_state ... ok
test node::sync::announce::test::local_node_in_multiple_sets ... ok
test node::sync::announce::test::local_node_in_preferred_seeds ... ok
test node::sync::announce::test::local_node_in_synced_set ... ok
test node::sync::announce::test::local_node_in_unsynced_set ... ok
test node::sync::announce::test::local_node_only_in_all_sets_results_in_no_seeds_error ... ok
test node::sync::announce::test::synced_with_local_node_is_ignored ... ok
test node::sync::announce::test::synced_with_same_node_multiple_times ... ok
test node::sync::announce::test::timed_out_after_reaching_success ... ok
test node::sync::announce::test::preferred_seeds_already_synced ... ok
test node::sync::fetch::test::all_nodes_are_candidates ... ok
test node::sync::fetch::test::could_not_reach_target ... ok
test node::sync::fetch::test::all_nodes_are_fetchable ... ok
test node::sync::fetch::test::ignores_duplicates_and_local_node ... ok
test node::sync::fetch::test::preferred_seeds_target_returned_over_replicas ... ok
test node::sync::fetch::test::reaches_target_of_max_replicas ... ok
test node::sync::fetch::test::reaches_target_of_replicas ... ok
test node::sync::fetch::test::reaches_target_of_preferred_seeds ... ok
test node::sync::test::ensure_replicas_construction ... ok
test node::sync::test::replicas_constrain_to ... ok
test node::test::test_address ... ok
test node::test::test_alias ... ok
test node::test::test_command_result ... ok
test node::test::test_user_agent ... ok
test node::timestamp::tests::test_timestamp_max ... ok
test profile::test::canonicalize_home ... ok
test profile::test::test_config ... ok
test rad::tests::test_checkout ... ok
test profile::config::test::schema ... ok
test rad::tests::test_fork ... ok
test rad::tests::test_init ... ok
test storage::git::tests::test_references_of ... ok
test storage::git::transport::local::url::test::test_url_parse ... ok
test storage::git::transport::local::url::test::test_url_to_string ... ok
test storage::git::transport::remote::url::test::test_url_parse ... ok
test storage::refs::tests::prop_canonical_roundtrip ... ok
test storage::git::tests::test_sign_refs ... ok
test storage::tests::test_storage ... ok
test test::assert::test::assert_with_message ... ok
test test::assert::test::test_assert_no_move ... ok
test test::assert::test::test_assert_panic_0 - should panic ... ok
test test::assert::test::test_assert_panic_1 - should panic ... ok
test test::assert::test::test_assert_panic_2 - should panic ... ok
test test::assert::test::test_assert_succeed ... ok
test test::assert::test::test_panic_message ... ok
test version::test::test_version ... ok
test storage::refs::tests::test_rid_verification ... ok
test identity::doc::test::prop_encode_decode ... ok
test cob::patch::cache::tests::test_find_by_revision ... ok
failures:
---- node::address::store::test::test_alias stdout ----
thread 'node::address::store::test::test_alias' panicked at crates/radicle/src/node/address/store.rs:597:44:
called `Result::unwrap()` on an `Err` value: Internal(Error { code: Some(1), message: Some("no such function: concat") })
note: run with `RUST_BACKTRACE=1` environment variable to display a backtrace
---- node::address::store::test::test_disconnected stdout ----
thread 'node::address::store::test::test_disconnected' panicked at crates/radicle/src/node/address/store.rs:873:44:
called `Result::unwrap()` on an `Err` value: Internal(Error { code: Some(1), message: Some("no such function: concat") })
---- node::address::store::test::test_disconnected_ban stdout ----
thread 'node::address::store::test::test_disconnected_ban' panicked at crates/radicle/src/node/address/store.rs:926:41:
called `Result::unwrap()` on an `Err` value: Internal(Error { code: Some(1), message: Some("no such function: concat") })
---- node::address::store::test::test_entries stdout ----
thread 'node::address::store::test::test_entries' panicked at crates/radicle/src/node/address/store.rs:831:44:
called `Result::unwrap()` on an `Err` value: Internal(Error { code: Some(1), message: Some("no such function: concat") })
---- node::address::store::test::test_get_none stdout ----
thread 'node::address::store::test::test_get_none' panicked at crates/radicle/src/node/address/store.rs:579:40:
called `Result::unwrap()` on an `Err` value: Internal(Error { code: Some(1), message: Some("no such function: concat") })
---- node::address::store::test::test_insert_and_get stdout ----
thread 'node::address::store::test::test_insert_and_get' panicked at crates/radicle/src/node/address/store.rs:636:44:
called `Result::unwrap()` on an `Err` value: Internal(Error { code: Some(1), message: Some("no such function: concat") })
---- node::address::store::test::test_insert_and_remove stdout ----
thread 'node::address::store::test::test_insert_and_remove' panicked at crates/radicle/src/node/address/store.rs:781:44:
called `Result::unwrap()` on an `Err` value: Internal(Error { code: Some(1), message: Some("no such function: concat") })
---- node::address::store::test::test_insert_and_update stdout ----
thread 'node::address::store::test::test_insert_and_update' panicked at crates/radicle/src/node/address/store.rs:705:44:
called `Result::unwrap()` on an `Err` value: Internal(Error { code: Some(1), message: Some("no such function: concat") })
---- node::address::store::test::test_insert_duplicate stdout ----
thread 'node::address::store::test::test_insert_duplicate' panicked at crates/radicle/src/node/address/store.rs:676:44:
called `Result::unwrap()` on an `Err` value: Internal(Error { code: Some(1), message: Some("no such function: concat") })
---- node::address::store::test::test_node_aliases stdout ----
thread 'node::address::store::test::test_node_aliases' panicked at crates/radicle/src/node/address/store.rs:976:41:
called `Result::unwrap()` on an `Err` value: Internal(Error { code: Some(1), message: Some("no such function: concat") })
---- node::address::store::test::test_remove_nothing stdout ----
thread 'node::address::store::test::test_remove_nothing' panicked at crates/radicle/src/node/address/store.rs:588:44:
called `Result::unwrap()` on an `Err` value: Internal(Error { code: Some(1), message: Some("no such function: concat") })
---- node::db::test::test_version stdout ----
thread 'node::db::test::test_version' panicked at crates/radicle/src/node/db.rs:220:37:
called `Result::unwrap()` on an `Err` value: Internal(Error { code: Some(1), message: Some("no such function: concat") })
---- node::refs::store::test::test_count stdout ----
thread 'node::refs::store::test::test_count' panicked at crates/radicle/src/node/refs/store.rs:186:41:
called `Result::unwrap()` on an `Err` value: Internal(Error { code: Some(1), message: Some("no such function: concat") })
---- node::refs::store::test::test_set_and_delete stdout ----
thread 'node::refs::store::test::test_set_and_delete' panicked at crates/radicle/src/node/refs/store.rs:212:41:
called `Result::unwrap()` on an `Err` value: Internal(Error { code: Some(1), message: Some("no such function: concat") })
---- node::refs::store::test::test_set_and_get stdout ----
thread 'node::refs::store::test::test_set_and_get' panicked at crates/radicle/src/node/refs/store.rs:229:41:
called `Result::unwrap()` on an `Err` value: Internal(Error { code: Some(1), message: Some("no such function: concat") })
---- node::routing::test::test_count stdout ----
thread 'node::routing::test::test_count' panicked at crates/radicle/src/node/routing.rs:268:83:
called `Result::unwrap()` on an `Err` value: Internal(Error { code: Some(1), message: Some("no such function: concat") })
---- node::routing::test::test_entries stdout ----
thread 'node::routing::test::test_entries' panicked at crates/radicle/src/node/routing.rs:268:83:
called `Result::unwrap()` on an `Err` value: Internal(Error { code: Some(1), message: Some("no such function: concat") })
---- node::routing::test::test_insert_and_get stdout ----
thread 'node::routing::test::test_insert_and_get' panicked at crates/radicle/src/node/routing.rs:268:83:
called `Result::unwrap()` on an `Err` value: Internal(Error { code: Some(1), message: Some("no such function: concat") })
---- node::routing::test::test_insert_and_get_resources stdout ----
thread 'node::routing::test::test_insert_and_get_resources' panicked at crates/radicle/src/node/routing.rs:268:83:
called `Result::unwrap()` on an `Err` value: Internal(Error { code: Some(1), message: Some("no such function: concat") })
---- node::routing::test::test_insert_and_remove stdout ----
thread 'node::routing::test::test_insert_and_remove' panicked at crates/radicle/src/node/routing.rs:268:83:
called `Result::unwrap()` on an `Err` value: Internal(Error { code: Some(1), message: Some("no such function: concat") })
---- node::routing::test::test_insert_duplicate stdout ----
thread 'node::routing::test::test_insert_duplicate' panicked at crates/radicle/src/node/routing.rs:268:83:
called `Result::unwrap()` on an `Err` value: Internal(Error { code: Some(1), message: Some("no such function: concat") })
---- node::routing::test::test_insert_existing_updated_time stdout ----
thread 'node::routing::test::test_insert_existing_updated_time' panicked at crates/radicle/src/node/routing.rs:268:83:
called `Result::unwrap()` on an `Err` value: Internal(Error { code: Some(1), message: Some("no such function: concat") })
---- node::routing::test::test_len stdout ----
thread 'node::routing::test::test_len' panicked at crates/radicle/src/node/routing.rs:268:83:
called `Result::unwrap()` on an `Err` value: Internal(Error { code: Some(1), message: Some("no such function: concat") })
---- node::address::store::test::test_empty stdout ----
thread 'node::address::store::test::test_empty' panicked at crates/radicle/src/node/address/store.rs:571:86:
called `Result::unwrap()` on an `Err` value: Internal(Error { code: Some(1), message: Some("no such function: concat") })
---- node::routing::test::test_remove_many stdout ----
thread 'node::routing::test::test_remove_many' panicked at crates/radicle/src/node/routing.rs:268:83:
called `Result::unwrap()` on an `Err` value: Internal(Error { code: Some(1), message: Some("no such function: concat") })
---- node::routing::test::test_prune stdout ----
thread 'node::routing::test::test_prune' panicked at crates/radicle/src/node/routing.rs:268:83:
called `Result::unwrap()` on an `Err` value: Internal(Error { code: Some(1), message: Some("no such function: concat") })
---- node::routing::test::test_remove_redundant stdout ----
thread 'node::routing::test::test_remove_redundant' panicked at crates/radicle/src/node/routing.rs:268:83:
called `Result::unwrap()` on an `Err` value: Internal(Error { code: Some(1), message: Some("no such function: concat") })
---- node::routing::test::test_update_existing_multi stdout ----
thread 'node::routing::test::test_update_existing_multi' panicked at crates/radicle/src/node/routing.rs:268:83:
called `Result::unwrap()` on an `Err` value: Internal(Error { code: Some(1), message: Some("no such function: concat") })
failures:
node::address::store::test::test_alias
node::address::store::test::test_disconnected
node::address::store::test::test_disconnected_ban
node::address::store::test::test_empty
node::address::store::test::test_entries
node::address::store::test::test_get_none
node::address::store::test::test_insert_and_get
node::address::store::test::test_insert_and_remove
node::address::store::test::test_insert_and_update
node::address::store::test::test_insert_duplicate
node::address::store::test::test_node_aliases
node::address::store::test::test_remove_nothing
node::db::test::test_version
node::refs::store::test::test_count
node::refs::store::test::test_set_and_delete
node::refs::store::test::test_set_and_get
node::routing::test::test_count
node::routing::test::test_entries
node::routing::test::test_insert_and_get
node::routing::test::test_insert_and_get_resources
node::routing::test::test_insert_and_remove
node::routing::test::test_insert_duplicate
node::routing::test::test_insert_existing_updated_time
node::routing::test::test_len
node::routing::test::test_prune
node::routing::test::test_remove_many
node::routing::test::test_remove_redundant
node::routing::test::test_update_existing_multi
test result: FAILED. 212 passed; 28 failed; 0 ignored; 0 measured; 0 filtered out; finished in 3.40s
error: test failed, to rerun pass `-p radicle --lib`
Running unittests src/lib.rs (target/debug/deps/radicle_cli-03b96c66aa09c126)
running 46 tests
test commands::block::args::test::should_not_parse ... ok
test commands::block::args::test::should_parse_rid ... ok
test commands::block::args::test::should_parse_nid ... ok
test commands::clone::args::test::should_parse_rid_non_urn ... ok
test commands::clone::args::test::should_parse_rid_url ... ok
test commands::cob::args::test::should_allow_log_json_format ... ok
test commands::cob::args::test::should_allow_log_pretty_format ... ok
test commands::clone::args::test::should_parse_rid_urn ... ok
test commands::cob::args::test::should_allow_show_json_format ... ok
test commands::cob::args::test::should_allow_update_json_format ... ok
test commands::cob::args::test::should_not_allow_show_pretty_format ... ok
test commands::cob::args::test::should_not_allow_update_pretty_format ... ok
test commands::fork::args::test::should_parse_rid_non_urn ... ok
test commands::fork::args::test::should_not_parse_rid_url ... ok
test commands::fork::args::test::should_parse_rid_urn ... ok
test commands::id::args::test::should_not_parse_into_payload - should panic ... ok
test commands::id::args::test::should_not_clobber_payload_args ... ok
test commands::id::args::test::should_not_parse_single_payload ... ok
test commands::id::args::test::should_not_parse_single_payloads ... ok
test commands::id::args::test::should_parse_into_payload ... ok
test commands::id::args::test::should_parse_multiple_payloads ... ok
test commands::init::args::test::should_not_parse_rid_url ... ok
test commands::id::args::test::should_parse_single_payload ... ok
test commands::init::args::test::should_parse_rid_non_urn ... ok
test commands::init::args::test::should_parse_rid_urn ... ok
test commands::inspect::test::test_tree ... ok
test commands::patch::review::builder::tests::test_review_comments_basic ... ok
test commands::patch::review::builder::tests::test_review_comments_before ... ok
test commands::patch::review::builder::tests::test_review_comments_multiline ... ok
test commands::publish::args::test::should_not_parse_rid_url ... ok
test commands::patch::review::builder::tests::test_review_comments_split_hunk ... ok
test commands::publish::args::test::should_parse_rid_non_urn ... ok
test commands::publish::args::test::should_parse_rid_urn ... ok
test commands::watch::args::test::should_parse_ref_str ... ok
test git::ddiff::tests::diff_encode_decode_ddiff_hunk ... ok
test git::pretty_diff::test::test_pretty ... ignored
test git::unified_diff::test::test_diff_content_encode_decode_content ... ok
test terminal::args::test::should_not_parse ... ok
test git::unified_diff::test::test_diff_encode_decode_diff ... ok
test terminal::args::test::should_parse_nid ... ok
test terminal::format::test::test_bytes ... ok
test terminal::args::test::should_parse_rid ... ok
test terminal::format::test::test_strip_comments ... ok
test terminal::patch::test::test_edit_display_message ... ok
test terminal::patch::test::test_update_display_message ... ok
test terminal::patch::test::test_create_display_message ... ok
test result: ok. 45 passed; 0 failed; 1 ignored; 0 measured; 0 filtered out; finished in 0.01s
Running unittests src/main.rs (target/debug/deps/rad-d085b1d82f7b7af6)
running 0 tests
test result: ok. 0 passed; 0 failed; 0 ignored; 0 measured; 0 filtered out; finished in 0.00s
Running tests/commands.rs (target/debug/deps/commands-4bab3ac2ca96e045)
running 113 tests
test commands::clone::rad_clone_all ... FAILED
test commands::clone::rad_clone_bare ... FAILED
test commands::clone::rad_clone ... FAILED
test commands::checkout::rad_checkout ... FAILED
test commands::clone::rad_clone_directory ... FAILED
test commands::clone::rad_clone_unknown ... FAILED
test commands::clone::rad_clone_partial_fail ... FAILED
test commands::clone::rad_clone_connect ... FAILED
test commands::cob::rad_cob_multiset ... ok
test commands::cob::rad_cob_log ... FAILED
test commands::cob::rad_cob_migrate ... FAILED
test commands::clone::test_clone_without_seeds ... FAILED
test commands::cob::rad_cob_operations ... FAILED
test commands::cob::test_cob_deletion ... FAILED
test commands::cob::rad_cob_update ... FAILED
test commands::cob::rad_cob_update_identity ... FAILED
test commands::cob::rad_cob_show ... FAILED
test commands::git::git_push_amend ... FAILED
test commands::git::git_push_canonical_annotated_tags ... FAILED
test commands::cob::test_cob_replication ... FAILED
test commands::git::git_push_and_fetch ... FAILED
test commands::git::git_push_converge ... FAILED
test commands::git::git_push_canonical_lightweight_tags ... FAILED
test commands::git::git_push_diverge ... FAILED
test commands::git::git_push_force_with_lease ... FAILED
test commands::id::rad_id_collaboration ... ignored, slow
test commands::git::git_push_rollback ... FAILED
test commands::id::rad_id ... FAILED
test commands::git::git_tag ... FAILED
test commands::id::rad_id_conflict ... FAILED
test commands::id::rad_id_multi_delegate ... FAILED
test commands::id::rad_id_private ... FAILED
test commands::id::rad_id_threshold ... FAILED
test commands::id::rad_id_threshold_soft_fork ... FAILED
test commands::id::rad_id_unauthorized_delegate ... FAILED
test commands::init::rad_init ... ignored, part of many other tests
test commands::id::rad_id_unknown_field ... FAILED
test commands::id::rad_id_update_delete_field ... FAILED
test commands::inbox::rad_inbox ... FAILED
test commands::init::rad_init_bare ... FAILED
test commands::init::rad_init_detached_head ... FAILED
test commands::init::rad_init_existing_bare ... FAILED
test commands::init::rad_init_existing ... FAILED
test commands::init::rad_init_no_git ... FAILED
test commands::init::rad_init_no_seed ... FAILED
test commands::init::rad_init_private_clone ... FAILED
test commands::init::rad_init_private ... FAILED
test commands::init::rad_init_private_clone_seed ... FAILED
test commands::init::rad_init_private_no_seed ... FAILED
test commands::init::rad_init_sync_and_clone ... FAILED
test commands::init::rad_init_private_seed ... FAILED
test commands::init::rad_init_sync_not_connected ... FAILED
test commands::init::rad_init_sync_preferred ... FAILED
test commands::init::rad_init_with_existing_remote ... FAILED
test commands::init::rad_init_sync_timeout ... FAILED
test commands::jj::rad_jj_bare ... ok
test commands::jj::rad_jj_colocated_patch ... ok
test commands::init::rad_publish ... FAILED
test commands::issue::rad_issue ... FAILED
test commands::issue::rad_issue_list ... FAILED
test commands::node::rad_node ... FAILED
test commands::node::rad_node_connect ... FAILED
test commands::node::rad_node_connect_without_address ... FAILED
test commands::patch::rad_merge_after_update ... FAILED
test commands::patch::rad_merge_no_ff ... FAILED
test commands::patch::rad_merge_via_push ... FAILED
test commands::patch::rad_patch_ahead_behind ... FAILED
test commands::patch::rad_patch ... FAILED
test commands::patch::rad_patch_change_base ... FAILED
test commands::patch::rad_patch_checkout ... FAILED
test commands::patch::rad_patch_checkout_force ... FAILED
test commands::patch::rad_patch_checkout_revision ... FAILED
test commands::patch::rad_patch_delete ... FAILED
test commands::patch::rad_patch_detached_head ... FAILED
test commands::patch::rad_patch_diff ... FAILED
test commands::patch::rad_patch_edit ... FAILED
test commands::patch::rad_patch_draft ... FAILED
test commands::patch::rad_patch_fetch_1 ... FAILED
test commands::patch::rad_patch_fetch_2 ... FAILED
test commands::patch::rad_patch_open_explore ... FAILED
test commands::patch::rad_patch_merge_draft ... FAILED
test commands::patch::rad_patch_pull_update ... FAILED
test commands::patch::rad_patch_revert_merge ... FAILED
test commands::patch::rad_patch_via_push ... FAILED
test commands::patch::rad_patch_update ... FAILED
test commands::patch::rad_push_and_pull_patches ... FAILED
test commands::patch::rad_review_by_hunk ... FAILED
test commands::policy::rad_seed_and_follow ... FAILED
test commands::policy::rad_block ... FAILED
test commands::policy::rad_seed_many ... FAILED
test commands::policy::rad_seed_policy_allow_no_scope ... FAILED
test commands::policy::rad_unseed ... FAILED
test commands::policy::rad_unseed_many ... FAILED
test commands::remote::rad_remote ... FAILED
test commands::sync::rad_sync ... FAILED
test commands::sync::rad_fetch ... FAILED
test commands::sync::rad_sync_without_node ... FAILED
test commands::sync::test_replication_via_seed ... FAILED
test commands::utility::framework_home ... FAILED
test commands::utility::rad_clean ... FAILED
test commands::utility::rad_config ... FAILED
test commands::utility::rad_fork ... FAILED
test commands::utility::rad_help ... FAILED
test commands::utility::rad_inspect ... FAILED
test commands::utility::rad_key_mismatch ... FAILED
test commands::utility::rad_self ... FAILED
test commands::utility::rad_warn_old_nodes ... FAILED
test commands::watch::rad_watch ... FAILED
test commands::workflow::rad_workflow ... FAILED
test rad_remote ... FAILED
test commands::utility::rad_auth_errors ... ok
test commands::utility::rad_diff ... ok
test commands::utility::rad_auth ... FAILED
failures:
---- commands::clone::rad_clone_all stdout ----
thread 'commands::clone::rad_clone_all' panicked at crates/radicle-cli/tests/util/environment.rs:160:14:
called `Result::unwrap()` on an `Err` value: Internal(Error { code: Some(1), message: Some("no such function: concat") })
note: run with `RUST_BACKTRACE=1` environment variable to display a backtrace
---- commands::clone::rad_clone_bare stdout ----
thread 'commands::clone::rad_clone_bare' panicked at crates/radicle-cli/tests/util/environment.rs:160:14:
called `Result::unwrap()` on an `Err` value: Internal(Error { code: Some(1), message: Some("no such function: concat") })
---- commands::clone::rad_clone stdout ----
thread 'commands::clone::rad_clone' panicked at crates/radicle-cli/tests/util/environment.rs:160:14:
called `Result::unwrap()` on an `Err` value: Internal(Error { code: Some(1), message: Some("no such function: concat") })
---- commands::checkout::rad_checkout stdout ----
thread 'commands::checkout::rad_checkout' panicked at crates/radicle-cli/tests/util/environment.rs:160:14:
called `Result::unwrap()` on an `Err` value: Internal(Error { code: Some(1), message: Some("no such function: concat") })
---- commands::clone::rad_clone_directory stdout ----
thread 'commands::clone::rad_clone_directory' panicked at crates/radicle-cli/tests/util/environment.rs:160:14:
called `Result::unwrap()` on an `Err` value: Internal(Error { code: Some(1), message: Some("no such function: concat") })
---- commands::clone::rad_clone_unknown stdout ----
thread 'commands::clone::rad_clone_unknown' panicked at crates/radicle-cli/tests/util/environment.rs:160:14:
called `Result::unwrap()` on an `Err` value: Internal(Error { code: Some(1), message: Some("no such function: concat") })
---- commands::clone::rad_clone_partial_fail stdout ----
thread 'commands::clone::rad_clone_partial_fail' panicked at crates/radicle-cli/tests/util/environment.rs:160:14:
called `Result::unwrap()` on an `Err` value: Internal(Error { code: Some(1), message: Some("no such function: concat") })
---- commands::clone::rad_clone_connect stdout ----
thread 'commands::clone::rad_clone_connect' panicked at crates/radicle-cli/tests/util/environment.rs:160:14:
called `Result::unwrap()` on an `Err` value: Internal(Error { code: Some(1), message: Some("no such function: concat") })
---- commands::cob::rad_cob_log stdout ----
thread 'commands::cob::rad_cob_log' panicked at crates/radicle-cli/tests/util/environment.rs:160:14:
called `Result::unwrap()` on an `Err` value: Internal(Error { code: Some(1), message: Some("no such function: concat") })
---- commands::cob::rad_cob_migrate stdout ----
thread 'commands::cob::rad_cob_migrate' panicked at crates/radicle-cli/tests/util/environment.rs:160:14:
called `Result::unwrap()` on an `Err` value: Internal(Error { code: Some(1), message: Some("no such function: concat") })
---- commands::clone::test_clone_without_seeds stdout ----
thread 'commands::clone::test_clone_without_seeds' panicked at crates/radicle-cli/tests/util/environment.rs:160:14:
called `Result::unwrap()` on an `Err` value: Internal(Error { code: Some(1), message: Some("no such function: concat") })
---- commands::cob::rad_cob_operations stdout ----
thread 'commands::cob::rad_cob_operations' panicked at crates/radicle-cli/tests/util/environment.rs:160:14:
called `Result::unwrap()` on an `Err` value: Internal(Error { code: Some(1), message: Some("no such function: concat") })
---- commands::cob::test_cob_deletion stdout ----
thread 'commands::cob::test_cob_deletion' panicked at crates/radicle-cli/tests/util/environment.rs:160:14:
called `Result::unwrap()` on an `Err` value: Internal(Error { code: Some(1), message: Some("no such function: concat") })
---- commands::cob::rad_cob_update stdout ----
thread 'commands::cob::rad_cob_update' panicked at crates/radicle-cli/tests/util/environment.rs:160:14:
called `Result::unwrap()` on an `Err` value: Internal(Error { code: Some(1), message: Some("no such function: concat") })
---- commands::cob::rad_cob_update_identity stdout ----
thread 'commands::cob::rad_cob_update_identity' panicked at crates/radicle-cli/tests/util/environment.rs:160:14:
called `Result::unwrap()` on an `Err` value: Internal(Error { code: Some(1), message: Some("no such function: concat") })
---- commands::cob::rad_cob_show stdout ----
thread 'commands::cob::rad_cob_show' panicked at crates/radicle-cli/tests/util/environment.rs:160:14:
called `Result::unwrap()` on an `Err` value: Internal(Error { code: Some(1), message: Some("no such function: concat") })
---- commands::git::git_push_amend stdout ----
thread 'commands::git::git_push_amend' panicked at crates/radicle-cli/tests/util/environment.rs:160:14:
called `Result::unwrap()` on an `Err` value: Internal(Error { code: Some(1), message: Some("no such function: concat") })
---- commands::git::git_push_canonical_annotated_tags stdout ----
thread 'commands::git::git_push_canonical_annotated_tags' panicked at crates/radicle-cli/tests/util/environment.rs:160:14:
called `Result::unwrap()` on an `Err` value: Internal(Error { code: Some(1), message: Some("no such function: concat") })
---- commands::cob::test_cob_replication stdout ----
thread 'commands::cob::test_cob_replication' panicked at crates/radicle-cli/tests/util/environment.rs:160:14:
called `Result::unwrap()` on an `Err` value: Internal(Error { code: Some(1), message: Some("no such function: concat") })
---- commands::git::git_push_and_fetch stdout ----
thread 'commands::git::git_push_and_fetch' panicked at crates/radicle-cli/tests/util/environment.rs:160:14:
called `Result::unwrap()` on an `Err` value: Internal(Error { code: Some(1), message: Some("no such function: concat") })
---- commands::git::git_push_converge stdout ----
thread 'commands::git::git_push_converge' panicked at crates/radicle-cli/tests/util/environment.rs:160:14:
called `Result::unwrap()` on an `Err` value: Internal(Error { code: Some(1), message: Some("no such function: concat") })
---- commands::git::git_push_canonical_lightweight_tags stdout ----
thread 'commands::git::git_push_canonical_lightweight_tags' panicked at crates/radicle-cli/tests/util/environment.rs:160:14:
called `Result::unwrap()` on an `Err` value: Internal(Error { code: Some(1), message: Some("no such function: concat") })
---- commands::git::git_push_diverge stdout ----
thread 'commands::git::git_push_diverge' panicked at crates/radicle-cli/tests/util/environment.rs:160:14:
called `Result::unwrap()` on an `Err` value: Internal(Error { code: Some(1), message: Some("no such function: concat") })
---- commands::git::git_push_force_with_lease stdout ----
thread 'commands::git::git_push_force_with_lease' panicked at crates/radicle-cli/tests/util/environment.rs:160:14:
called `Result::unwrap()` on an `Err` value: Internal(Error { code: Some(1), message: Some("no such function: concat") })
---- commands::git::git_push_rollback stdout ----
thread 'commands::git::git_push_rollback' panicked at crates/radicle-cli/tests/util/environment.rs:160:14:
called `Result::unwrap()` on an `Err` value: Internal(Error { code: Some(1), message: Some("no such function: concat") })
---- commands::id::rad_id stdout ----
thread 'commands::id::rad_id' panicked at crates/radicle-cli/tests/util/environment.rs:160:14:
called `Result::unwrap()` on an `Err` value: Internal(Error { code: Some(1), message: Some("no such function: concat") })
---- commands::git::git_tag stdout ----
thread 'commands::git::git_tag' panicked at crates/radicle-cli/tests/util/environment.rs:160:14:
called `Result::unwrap()` on an `Err` value: Internal(Error { code: Some(1), message: Some("no such function: concat") })
---- commands::id::rad_id_conflict stdout ----
thread 'commands::id::rad_id_conflict' panicked at crates/radicle-cli/tests/util/environment.rs:160:14:
called `Result::unwrap()` on an `Err` value: Internal(Error { code: Some(1), message: Some("no such function: concat") })
---- commands::id::rad_id_multi_delegate stdout ----
thread 'commands::id::rad_id_multi_delegate' panicked at crates/radicle-cli/tests/util/environment.rs:160:14:
called `Result::unwrap()` on an `Err` value: Internal(Error { code: Some(1), message: Some("no such function: concat") })
---- commands::id::rad_id_private stdout ----
thread 'commands::id::rad_id_private' panicked at crates/radicle-cli/tests/util/environment.rs:160:14:
called `Result::unwrap()` on an `Err` value: Internal(Error { code: Some(1), message: Some("no such function: concat") })
---- commands::id::rad_id_threshold stdout ----
thread 'commands::id::rad_id_threshold' panicked at crates/radicle-cli/tests/util/environment.rs:160:14:
called `Result::unwrap()` on an `Err` value: Internal(Error { code: Some(1), message: Some("no such function: concat") })
---- commands::id::rad_id_threshold_soft_fork stdout ----
thread 'commands::id::rad_id_threshold_soft_fork' panicked at crates/radicle-cli/tests/util/environment.rs:160:14:
called `Result::unwrap()` on an `Err` value: Internal(Error { code: Some(1), message: Some("no such function: concat") })
---- commands::id::rad_id_unauthorized_delegate stdout ----
thread 'commands::id::rad_id_unauthorized_delegate' panicked at crates/radicle-cli/tests/util/environment.rs:160:14:
called `Result::unwrap()` on an `Err` value: Internal(Error { code: Some(1), message: Some("no such function: concat") })
---- commands::id::rad_id_unknown_field stdout ----
thread 'commands::id::rad_id_unknown_field' panicked at crates/radicle-cli/tests/util/environment.rs:160:14:
called `Result::unwrap()` on an `Err` value: Internal(Error { code: Some(1), message: Some("no such function: concat") })
---- commands::id::rad_id_update_delete_field stdout ----
thread 'commands::id::rad_id_update_delete_field' panicked at crates/radicle-cli/tests/util/environment.rs:160:14:
called `Result::unwrap()` on an `Err` value: Internal(Error { code: Some(1), message: Some("no such function: concat") })
---- commands::inbox::rad_inbox stdout ----
thread 'commands::inbox::rad_inbox' panicked at crates/radicle-cli/tests/util/environment.rs:160:14:
called `Result::unwrap()` on an `Err` value: Internal(Error { code: Some(1), message: Some("no such function: concat") })
---- commands::init::rad_init_bare stdout ----
thread 'commands::init::rad_init_bare' panicked at crates/radicle-cli/tests/util/environment.rs:160:14:
called `Result::unwrap()` on an `Err` value: Internal(Error { code: Some(1), message: Some("no such function: concat") })
---- commands::init::rad_init_detached_head stdout ----
thread 'commands::init::rad_init_detached_head' panicked at crates/radicle-cli/tests/util/environment.rs:160:14:
called `Result::unwrap()` on an `Err` value: Internal(Error { code: Some(1), message: Some("no such function: concat") })
---- commands::init::rad_init_existing_bare stdout ----
thread 'commands::init::rad_init_existing_bare' panicked at crates/radicle-cli/tests/util/environment.rs:160:14:
called `Result::unwrap()` on an `Err` value: Internal(Error { code: Some(1), message: Some("no such function: concat") })
---- commands::init::rad_init_existing stdout ----
thread 'commands::init::rad_init_existing' panicked at crates/radicle-cli/tests/util/environment.rs:160:14:
called `Result::unwrap()` on an `Err` value: Internal(Error { code: Some(1), message: Some("no such function: concat") })
---- commands::init::rad_init_no_git stdout ----
thread 'commands::init::rad_init_no_git' panicked at crates/radicle-cli/tests/util/environment.rs:160:14:
called `Result::unwrap()` on an `Err` value: Internal(Error { code: Some(1), message: Some("no such function: concat") })
---- commands::init::rad_init_no_seed stdout ----
thread 'commands::init::rad_init_no_seed' panicked at crates/radicle-cli/tests/util/environment.rs:160:14:
called `Result::unwrap()` on an `Err` value: Internal(Error { code: Some(1), message: Some("no such function: concat") })
---- commands::init::rad_init_private_clone stdout ----
thread 'commands::init::rad_init_private_clone' panicked at crates/radicle-cli/tests/util/environment.rs:160:14:
called `Result::unwrap()` on an `Err` value: Internal(Error { code: Some(1), message: Some("no such function: concat") })
---- commands::init::rad_init_private stdout ----
thread 'commands::init::rad_init_private' panicked at crates/radicle-cli/tests/util/environment.rs:160:14:
called `Result::unwrap()` on an `Err` value: Internal(Error { code: Some(1), message: Some("no such function: concat") })
---- commands::init::rad_init_private_clone_seed stdout ----
thread 'commands::init::rad_init_private_clone_seed' panicked at crates/radicle-cli/tests/util/environment.rs:160:14:
called `Result::unwrap()` on an `Err` value: Internal(Error { code: Some(1), message: Some("no such function: concat") })
---- commands::init::rad_init_private_no_seed stdout ----
thread 'commands::init::rad_init_private_no_seed' panicked at crates/radicle-cli/tests/util/environment.rs:160:14:
called `Result::unwrap()` on an `Err` value: Internal(Error { code: Some(1), message: Some("no such function: concat") })
---- commands::init::rad_init_sync_and_clone stdout ----
thread 'commands::init::rad_init_sync_and_clone' panicked at crates/radicle-cli/tests/util/environment.rs:160:14:
called `Result::unwrap()` on an `Err` value: Internal(Error { code: Some(1), message: Some("no such function: concat") })
---- commands::init::rad_init_private_seed stdout ----
thread 'commands::init::rad_init_private_seed' panicked at crates/radicle-cli/tests/util/environment.rs:160:14:
called `Result::unwrap()` on an `Err` value: Internal(Error { code: Some(1), message: Some("no such function: concat") })
---- commands::init::rad_init_sync_not_connected stdout ----
thread 'commands::init::rad_init_sync_not_connected' panicked at crates/radicle-cli/tests/util/environment.rs:160:14:
called `Result::unwrap()` on an `Err` value: Internal(Error { code: Some(1), message: Some("no such function: concat") })
---- commands::init::rad_init_sync_preferred stdout ----
thread 'commands::init::rad_init_sync_preferred' panicked at crates/radicle-cli/tests/util/environment.rs:160:14:
called `Result::unwrap()` on an `Err` value: Internal(Error { code: Some(1), message: Some("no such function: concat") })
---- commands::init::rad_init_with_existing_remote stdout ----
thread 'commands::init::rad_init_with_existing_remote' panicked at crates/radicle-cli/tests/util/environment.rs:160:14:
called `Result::unwrap()` on an `Err` value: Internal(Error { code: Some(1), message: Some("no such function: concat") })
---- commands::init::rad_init_sync_timeout stdout ----
thread 'commands::init::rad_init_sync_timeout' panicked at crates/radicle-cli/tests/util/environment.rs:160:14:
called `Result::unwrap()` on an `Err` value: Internal(Error { code: Some(1), message: Some("no such function: concat") })
---- commands::init::rad_publish stdout ----
thread 'commands::init::rad_publish' panicked at crates/radicle-cli/tests/util/environment.rs:160:14:
called `Result::unwrap()` on an `Err` value: Internal(Error { code: Some(1), message: Some("no such function: concat") })
---- commands::issue::rad_issue stdout ----
thread 'commands::issue::rad_issue' panicked at crates/radicle-cli/tests/util/environment.rs:160:14:
called `Result::unwrap()` on an `Err` value: Internal(Error { code: Some(1), message: Some("no such function: concat") })
---- commands::issue::rad_issue_list stdout ----
thread 'commands::issue::rad_issue_list' panicked at crates/radicle-cli/tests/util/environment.rs:160:14:
called `Result::unwrap()` on an `Err` value: Internal(Error { code: Some(1), message: Some("no such function: concat") })
---- commands::node::rad_node stdout ----
thread 'commands::node::rad_node' panicked at crates/radicle-cli/tests/util/environment.rs:160:14:
called `Result::unwrap()` on an `Err` value: Internal(Error { code: Some(1), message: Some("no such function: concat") })
---- commands::node::rad_node_connect stdout ----
thread 'commands::node::rad_node_connect' panicked at crates/radicle-cli/tests/util/environment.rs:160:14:
called `Result::unwrap()` on an `Err` value: Internal(Error { code: Some(1), message: Some("no such function: concat") })
---- commands::node::rad_node_connect_without_address stdout ----
thread 'commands::node::rad_node_connect_without_address' panicked at crates/radicle-cli/tests/util/environment.rs:160:14:
called `Result::unwrap()` on an `Err` value: Internal(Error { code: Some(1), message: Some("no such function: concat") })
---- commands::patch::rad_merge_after_update stdout ----
thread 'commands::patch::rad_merge_after_update' panicked at crates/radicle-cli/tests/util/environment.rs:160:14:
called `Result::unwrap()` on an `Err` value: Internal(Error { code: Some(1), message: Some("no such function: concat") })
---- commands::patch::rad_merge_no_ff stdout ----
thread 'commands::patch::rad_merge_no_ff' panicked at crates/radicle-cli/tests/util/environment.rs:160:14:
called `Result::unwrap()` on an `Err` value: Internal(Error { code: Some(1), message: Some("no such function: concat") })
---- commands::patch::rad_merge_via_push stdout ----
thread 'commands::patch::rad_merge_via_push' panicked at crates/radicle-cli/tests/util/environment.rs:160:14:
called `Result::unwrap()` on an `Err` value: Internal(Error { code: Some(1), message: Some("no such function: concat") })
---- commands::patch::rad_patch_ahead_behind stdout ----
thread 'commands::patch::rad_patch_ahead_behind' panicked at crates/radicle-cli/tests/util/environment.rs:160:14:
called `Result::unwrap()` on an `Err` value: Internal(Error { code: Some(1), message: Some("no such function: concat") })
---- commands::patch::rad_patch stdout ----
thread 'commands::patch::rad_patch' panicked at crates/radicle-cli/tests/util/environment.rs:160:14:
called `Result::unwrap()` on an `Err` value: Internal(Error { code: Some(1), message: Some("no such function: concat") })
---- commands::patch::rad_patch_change_base stdout ----
thread 'commands::patch::rad_patch_change_base' panicked at crates/radicle-cli/tests/util/environment.rs:160:14:
called `Result::unwrap()` on an `Err` value: Internal(Error { code: Some(1), message: Some("no such function: concat") })
---- commands::patch::rad_patch_checkout stdout ----
thread 'commands::patch::rad_patch_checkout' panicked at crates/radicle-cli/tests/util/environment.rs:160:14:
called `Result::unwrap()` on an `Err` value: Internal(Error { code: Some(1), message: Some("no such function: concat") })
---- commands::patch::rad_patch_checkout_force stdout ----
thread 'commands::patch::rad_patch_checkout_force' panicked at crates/radicle-cli/tests/util/environment.rs:160:14:
called `Result::unwrap()` on an `Err` value: Internal(Error { code: Some(1), message: Some("no such function: concat") })
---- commands::patch::rad_patch_checkout_revision stdout ----
thread 'commands::patch::rad_patch_checkout_revision' panicked at crates/radicle-cli/tests/util/environment.rs:160:14:
called `Result::unwrap()` on an `Err` value: Internal(Error { code: Some(1), message: Some("no such function: concat") })
---- commands::patch::rad_patch_delete stdout ----
thread 'commands::patch::rad_patch_delete' panicked at crates/radicle-cli/tests/util/environment.rs:160:14:
called `Result::unwrap()` on an `Err` value: Internal(Error { code: Some(1), message: Some("no such function: concat") })
---- commands::patch::rad_patch_detached_head stdout ----
thread 'commands::patch::rad_patch_detached_head' panicked at crates/radicle-cli/tests/util/environment.rs:160:14:
called `Result::unwrap()` on an `Err` value: Internal(Error { code: Some(1), message: Some("no such function: concat") })
---- commands::patch::rad_patch_diff stdout ----
thread 'commands::patch::rad_patch_diff' panicked at crates/radicle-cli/tests/util/environment.rs:160:14:
called `Result::unwrap()` on an `Err` value: Internal(Error { code: Some(1), message: Some("no such function: concat") })
---- commands::patch::rad_patch_edit stdout ----
thread 'commands::patch::rad_patch_edit' panicked at crates/radicle-cli/tests/util/environment.rs:160:14:
called `Result::unwrap()` on an `Err` value: Internal(Error { code: Some(1), message: Some("no such function: concat") })
---- commands::patch::rad_patch_draft stdout ----
thread 'commands::patch::rad_patch_draft' panicked at crates/radicle-cli/tests/util/environment.rs:160:14:
called `Result::unwrap()` on an `Err` value: Internal(Error { code: Some(1), message: Some("no such function: concat") })
---- commands::patch::rad_patch_fetch_1 stdout ----
thread 'commands::patch::rad_patch_fetch_1' panicked at crates/radicle-cli/tests/util/environment.rs:160:14:
called `Result::unwrap()` on an `Err` value: Internal(Error { code: Some(1), message: Some("no such function: concat") })
---- commands::patch::rad_patch_fetch_2 stdout ----
thread 'commands::patch::rad_patch_fetch_2' panicked at crates/radicle-cli/tests/util/environment.rs:160:14:
called `Result::unwrap()` on an `Err` value: Internal(Error { code: Some(1), message: Some("no such function: concat") })
---- commands::patch::rad_patch_open_explore stdout ----
thread 'commands::patch::rad_patch_open_explore' panicked at crates/radicle-cli/tests/util/environment.rs:160:14:
called `Result::unwrap()` on an `Err` value: Internal(Error { code: Some(1), message: Some("no such function: concat") })
---- commands::patch::rad_patch_merge_draft stdout ----
thread 'commands::patch::rad_patch_merge_draft' panicked at crates/radicle-cli/tests/util/environment.rs:160:14:
called `Result::unwrap()` on an `Err` value: Internal(Error { code: Some(1), message: Some("no such function: concat") })
---- commands::patch::rad_patch_pull_update stdout ----
thread 'commands::patch::rad_patch_pull_update' panicked at crates/radicle-cli/tests/util/environment.rs:160:14:
called `Result::unwrap()` on an `Err` value: Internal(Error { code: Some(1), message: Some("no such function: concat") })
---- commands::patch::rad_patch_revert_merge stdout ----
thread 'commands::patch::rad_patch_revert_merge' panicked at crates/radicle-cli/tests/util/environment.rs:160:14:
called `Result::unwrap()` on an `Err` value: Internal(Error { code: Some(1), message: Some("no such function: concat") })
---- commands::patch::rad_patch_via_push stdout ----
thread 'commands::patch::rad_patch_via_push' panicked at crates/radicle-cli/tests/util/environment.rs:160:14:
called `Result::unwrap()` on an `Err` value: Internal(Error { code: Some(1), message: Some("no such function: concat") })
---- commands::patch::rad_patch_update stdout ----
thread 'commands::patch::rad_patch_update' panicked at crates/radicle-cli/tests/util/environment.rs:160:14:
called `Result::unwrap()` on an `Err` value: Internal(Error { code: Some(1), message: Some("no such function: concat") })
---- commands::patch::rad_push_and_pull_patches stdout ----
thread 'commands::patch::rad_push_and_pull_patches' panicked at crates/radicle-cli/tests/util/environment.rs:160:14:
called `Result::unwrap()` on an `Err` value: Internal(Error { code: Some(1), message: Some("no such function: concat") })
---- commands::patch::rad_review_by_hunk stdout ----
thread 'commands::patch::rad_review_by_hunk' panicked at crates/radicle-cli/tests/util/environment.rs:160:14:
called `Result::unwrap()` on an `Err` value: Internal(Error { code: Some(1), message: Some("no such function: concat") })
---- commands::policy::rad_seed_and_follow stdout ----
thread 'commands::policy::rad_seed_and_follow' panicked at crates/radicle-cli/tests/util/environment.rs:160:14:
called `Result::unwrap()` on an `Err` value: Internal(Error { code: Some(1), message: Some("no such function: concat") })
---- commands::policy::rad_block stdout ----
thread 'commands::policy::rad_block' panicked at crates/radicle-cli/tests/util/environment.rs:160:14:
called `Result::unwrap()` on an `Err` value: Internal(Error { code: Some(1), message: Some("no such function: concat") })
---- commands::policy::rad_seed_many stdout ----
thread 'commands::policy::rad_seed_many' panicked at crates/radicle-cli/tests/util/environment.rs:160:14:
called `Result::unwrap()` on an `Err` value: Internal(Error { code: Some(1), message: Some("no such function: concat") })
---- commands::policy::rad_seed_policy_allow_no_scope stdout ----
thread 'commands::policy::rad_seed_policy_allow_no_scope' panicked at crates/radicle-cli/tests/util/environment.rs:160:14:
called `Result::unwrap()` on an `Err` value: Internal(Error { code: Some(1), message: Some("no such function: concat") })
---- commands::policy::rad_unseed stdout ----
thread 'commands::policy::rad_unseed' panicked at crates/radicle-cli/tests/util/environment.rs:160:14:
called `Result::unwrap()` on an `Err` value: Internal(Error { code: Some(1), message: Some("no such function: concat") })
---- commands::policy::rad_unseed_many stdout ----
thread 'commands::policy::rad_unseed_many' panicked at crates/radicle-cli/tests/util/environment.rs:160:14:
called `Result::unwrap()` on an `Err` value: Internal(Error { code: Some(1), message: Some("no such function: concat") })
---- commands::remote::rad_remote stdout ----
thread 'commands::remote::rad_remote' panicked at crates/radicle-cli/tests/util/environment.rs:160:14:
called `Result::unwrap()` on an `Err` value: Internal(Error { code: Some(1), message: Some("no such function: concat") })
---- commands::sync::rad_sync stdout ----
thread 'commands::sync::rad_sync' panicked at crates/radicle-cli/tests/util/environment.rs:160:14:
called `Result::unwrap()` on an `Err` value: Internal(Error { code: Some(1), message: Some("no such function: concat") })
---- commands::sync::rad_fetch stdout ----
thread 'commands::sync::rad_fetch' panicked at crates/radicle-cli/tests/util/environment.rs:160:14:
called `Result::unwrap()` on an `Err` value: Internal(Error { code: Some(1), message: Some("no such function: concat") })
---- commands::sync::rad_sync_without_node stdout ----
thread 'commands::sync::rad_sync_without_node' panicked at crates/radicle-cli/tests/util/environment.rs:160:14:
called `Result::unwrap()` on an `Err` value: Internal(Error { code: Some(1), message: Some("no such function: concat") })
---- commands::sync::test_replication_via_seed stdout ----
thread 'commands::sync::test_replication_via_seed' panicked at crates/radicle-cli/tests/util/environment.rs:160:14:
called `Result::unwrap()` on an `Err` value: Internal(Error { code: Some(1), message: Some("no such function: concat") })
---- commands::utility::framework_home stdout ----
thread 'commands::utility::framework_home' panicked at crates/radicle-cli/tests/util/environment.rs:160:14:
called `Result::unwrap()` on an `Err` value: Internal(Error { code: Some(1), message: Some("no such function: concat") })
---- commands::utility::rad_clean stdout ----
thread 'commands::utility::rad_clean' panicked at crates/radicle-cli/tests/util/environment.rs:160:14:
called `Result::unwrap()` on an `Err` value: Internal(Error { code: Some(1), message: Some("no such function: concat") })
---- commands::utility::rad_config stdout ----
thread 'commands::utility::rad_config' panicked at crates/radicle-cli/tests/util/environment.rs:160:14:
called `Result::unwrap()` on an `Err` value: Internal(Error { code: Some(1), message: Some("no such function: concat") })
---- commands::utility::rad_fork stdout ----
thread 'commands::utility::rad_fork' panicked at crates/radicle-cli/tests/util/environment.rs:160:14:
called `Result::unwrap()` on an `Err` value: Internal(Error { code: Some(1), message: Some("no such function: concat") })
---- commands::utility::rad_help stdout ----
thread 'commands::utility::rad_help' panicked at crates/radicle-cli/tests/util/environment.rs:160:14:
called `Result::unwrap()` on an `Err` value: Internal(Error { code: Some(1), message: Some("no such function: concat") })
---- commands::utility::rad_inspect stdout ----
thread 'commands::utility::rad_inspect' panicked at crates/radicle-cli/tests/util/environment.rs:160:14:
called `Result::unwrap()` on an `Err` value: Internal(Error { code: Some(1), message: Some("no such function: concat") })
---- commands::utility::rad_key_mismatch stdout ----
thread 'commands::utility::rad_key_mismatch' panicked at crates/radicle-cli/tests/util/environment.rs:160:14:
called `Result::unwrap()` on an `Err` value: Internal(Error { code: Some(1), message: Some("no such function: concat") })
---- commands::utility::rad_self stdout ----
thread 'commands::utility::rad_self' panicked at crates/radicle-cli/tests/util/environment.rs:160:14:
called `Result::unwrap()` on an `Err` value: Internal(Error { code: Some(1), message: Some("no such function: concat") })
---- commands::utility::rad_warn_old_nodes stdout ----
thread 'commands::utility::rad_warn_old_nodes' panicked at crates/radicle-cli/tests/util/environment.rs:160:14:
called `Result::unwrap()` on an `Err` value: Internal(Error { code: Some(1), message: Some("no such function: concat") })
---- commands::watch::rad_watch stdout ----
thread 'commands::watch::rad_watch' panicked at crates/radicle-cli/tests/util/environment.rs:160:14:
called `Result::unwrap()` on an `Err` value: Internal(Error { code: Some(1), message: Some("no such function: concat") })
---- commands::workflow::rad_workflow stdout ----
thread 'commands::workflow::rad_workflow' panicked at crates/radicle-cli/tests/util/environment.rs:160:14:
called `Result::unwrap()` on an `Err` value: Internal(Error { code: Some(1), message: Some("no such function: concat") })
---- rad_remote stdout ----
thread 'rad_remote' panicked at crates/radicle-cli/tests/util/environment.rs:160:14:
called `Result::unwrap()` on an `Err` value: Internal(Error { code: Some(1), message: Some("no such function: concat") })
---- commands::utility::rad_auth stdout ----
1788892982 test: Building binaries for package `radicle-remote-helper`..
1788893027 test: Built /4caf264a-2270-4dd4-8432-bc4ae27e3de4/w/crates/radicle-cli/target/debug/git-remote-rad
1788893027 test: Building binaries for package `radicle-cli`..
1788893029 test: Built /4caf264a-2270-4dd4-8432-bc4ae27e3de4/w/crates/radicle-cli/target/debug/rad
1788893029 test: rad-auth:5: `rad auth --alias alice` @ .
thread 'commands::utility::rad_auth' panicked at crates/radicle-cli-test/src/lib.rs:502:36:
--- Expected
++++ actual: stdout
1 1 |
2 2 | Initializing your radicle 👾 identity
3 3 |
4 - ✓ Creating your Ed25519 keypair...
5 - ✓ Your Radicle DID is did:key:z6MknSLrJoTcukLrE435hVNQT4JUhbvWLX4kUzqkEStBU8Vi. This identifies your device. Run `rad self` to show it at all times.
6 - ✓ You're all set.
7 -
8 - ✗ Hint: install ssh-agent to have it fill in your passphrase for you when signing.
9 -
10 - To create a Radicle repository, run `rad init` from a Git repository with at least one commit.
11 - To clone a repository, run `rad clone <rid>`. For example, `rad clone rad:z3gqcJUoA1n9HaHKufZs5FCSGazv5` clones the Radicle 'heartwood' repository.
12 - To get a list of all commands, run `rad`.
4 + ✗ Creating your Ed25519 keypair... <canceled>
5 + ✗ Error: internal error: no such function: concat (code 1)
Exit status: 1
failures:
commands::checkout::rad_checkout
commands::clone::rad_clone
commands::clone::rad_clone_all
commands::clone::rad_clone_bare
commands::clone::rad_clone_connect
commands::clone::rad_clone_directory
commands::clone::rad_clone_partial_fail
commands::clone::rad_clone_unknown
commands::clone::test_clone_without_seeds
commands::cob::rad_cob_log
commands::cob::rad_cob_migrate
commands::cob::rad_cob_operations
commands::cob::rad_cob_show
commands::cob::rad_cob_update
commands::cob::rad_cob_update_identity
commands::cob::test_cob_deletion
commands::cob::test_cob_replication
commands::git::git_push_amend
commands::git::git_push_and_fetch
commands::git::git_push_canonical_annotated_tags
commands::git::git_push_canonical_lightweight_tags
commands::git::git_push_converge
commands::git::git_push_diverge
commands::git::git_push_force_with_lease
commands::git::git_push_rollback
commands::git::git_tag
commands::id::rad_id
commands::id::rad_id_conflict
commands::id::rad_id_multi_delegate
commands::id::rad_id_private
commands::id::rad_id_threshold
commands::id::rad_id_threshold_soft_fork
commands::id::rad_id_unauthorized_delegate
comerror: test failed, to rerun pass `-p radicle-cli --test commands`
Running unittests src/lib.rs (target/debug/deps/radicle_cli_test-25ce6b1213d3da11)
mands::id::rad_id_unknown_field
commands::id::rad_id_update_delete_field
commands::inbox::rad_inbox
commands::init::rad_init_bare
commands::init::rad_init_detached_head
commands::init::rad_init_existing
commands::init::rad_init_existing_bare
commands::init::rad_init_no_git
commands::init::rad_init_no_seed
commands::init::rad_init_private
commands::init::rad_init_private_clone
commands::init::rad_init_private_clone_seed
commands::init::rad_init_private_no_seed
commands::init::rad_init_private_seed
commands::init::rad_init_sync_and_clone
commands::init::rad_init_sync_not_connected
commands::init::rad_init_sync_preferred
commands::init::rad_init_sync_timeout
commands::init::rad_init_with_existing_remote
commands::init::rad_publish
commands::issue::rad_issue
commands::issue::rad_issue_list
commands::node::rad_node
commands::node::rad_node_connect
commands::node::rad_node_connect_without_address
commands::patch::rad_merge_after_update
commands::patch::rad_merge_no_ff
commands::patch::rad_merge_via_push
commands::patch::rad_patch
commands::patch::rad_patch_ahead_behind
commands::patch::rad_patch_change_base
commands::patch::rad_patch_checkout
commands::patch::rad_patch_checkout_force
commands::patch::rad_patch_checkout_revision
commands::patch::rad_patch_delete
commands::patch::rad_patch_detached_head
commands::patch::rad_patch_diff
commands::patch::rad_patch_draft
commands::patch::rad_patch_edit
commands::patch::rad_patch_fetch_1
commands::patch::rad_patch_fetch_2
commands::patch::rad_patch_merge_draft
commands::patch::rad_patch_open_explore
commands::patch::rad_patch_pull_update
commands::patch::rad_patch_revert_merge
commands::patch::rad_patch_update
commands::patch::rad_patch_via_push
commands::patch::rad_push_and_pull_patches
commands::patch::rad_review_by_hunk
commands::policy::rad_block
commands::policy::rad_seed_and_follow
commands::policy::rad_seed_many
commands::policy::rad_seed_policy_allow_no_scope
commands::policy::rad_unseed
commands::policy::rad_unseed_many
commands::remote::rad_remote
commands::sync::rad_fetch
commands::sync::rad_sync
commands::sync::rad_sync_without_node
commands::sync::test_replication_via_seed
commands::utility::framework_home
commands::utility::rad_auth
commands::utility::rad_clean
commands::utility::rad_config
commands::utility::rad_fork
commands::utility::rad_help
commands::utility::rad_inspect
commands::utility::rad_key_mismatch
commands::utility::rad_self
commands::utility::rad_warn_old_nodes
commands::watch::rad_watch
commands::workflow::rad_workflow
rad_remote
test result: FAILED. 5 passed; 106 failed; 2 ignored; 0 measured; 0 filtered out; finished in 49.65s
running 3 tests
test tests::test_parse ... ok
test tests::test_run ... ok
test tests::test_example_spaced_brackets ... ok
test result: ok. 3 passed; 0 failed; 0 ignored; 0 measured; 0 filtered out; finished in 0.01s
running 9 tests
test object::tests::test_serde ... ok
Running unittests src/lib.rs (target/debug/deps/radicle_cob-bab4a18d71357639)
test tests::git::roundtrip ... ok
test tests::git::traverse_cobs ... ok
test tests::invalid_parse_refstr ... ok
test tests::parse_refstr ... ok
test type_name::test::invalid_typenames ... ok
test type_name::test::valid_typenames ... ok
test tests::git::list_cobs ... ok
test tests::git::update_cob ... ok
test result: ok. 9 passed; 0 failed; 0 ignored; 0 measured; 0 filtered out; finished in 0.02s
Running unittests src/lib.rs (target/debug/deps/radicle_core-ce5b02681caf3c49)
running 4 tests
test repo::test::valid ... ok
test repo::test::invalid ... ok
test repo::test::assert_prop_roundtrip_parse ... ok
test repo::serde_impls::test::assert_prop_roundtrip_serde_json ... ok
test result: ok. 4 passed; 0 failed; 0 ignored; 0 measured; 0 filtered out; finished in 0.00s
Running unittests src/lib.rs (target/debug/deps/radicle_crypto-55d6b392ea62c993)
running 12 tests
test ssh::fmt::test::test_key ... ok
test ssh::fmt::test::test_fingerprint ... ok
test ssh::keystore::tests::test_init_no_passphrase ... ok
test ssh::test::test_agent_encoding_remove ... ok
test ssh::test::test_agent_encoding_sign ... ok
test ssh::test::prop_encode_decode_sk ... ok
test tests::prop_encode_decode ... ok
test tests::test_e25519_dh ... ok
test tests::test_encode_decode ... ok
test tests::prop_key_equality ... ok
test ssh::keystore::tests::test_signer ... ok
test ssh::keystore::tests::test_init_passphrase ... ok
test result: ok. 12 passed; 0 failed; 0 ignored; 0 measured; 0 filtered out; finished in 0.89s
Running unittests src/lib.rs (target/debug/deps/radicle_dag-05f7457e7194a495)
running 20 tests
test tests::test_dependencies ... ok
test tests::test_cycle ... ok
test tests::test_contains ... ok
test tests::test_complex ... ok
test tests::test_diamond ... ok
test tests::test_fold_diamond ... ok
test tests::test_fold_multiple_roots ... ok
test tests::test_fold_sorting_2 ... ok
test tests::test_fold_sorting_1 ... ok
test tests::test_fold_reject ... ok
test tests::test_is_empty ... ok
test tests::test_len ... ok
test tests::test_merge_1 ... ok
test tests::test_merge_2 ... ok
test tests::test_prune_2 ... ok
test tests::test_prune_1 ... ok
test tests::test_get ... ok
test tests::test_remove ... ok
test tests::test_siblings ... ok
test tests::test_prune_by_sorting ... ok
test result: ok. 20 passed; 0 failed; 0 ignored; 0 measured; 0 filtered out; finished in 0.00s
Running unittests src/lib.rs (target/debug/deps/radicle_fetch-5a74d73406d0aae4)
running 1 test
test stage::test::valid_refspecs ... ok
test result: ok. 1 passed; 0 failed; 0 ignored; 0 measured; 0 filtered out; finished in 0.00s
Running unittests src/lib.rs (target/debug/deps/radicle_git_metadata-bd76d09cdbf02303)
running 24 tests
test commit::parse::test::error::invalid_author ... ok
test commit::parse::test::error::invalid_committer ... ok
test commit::parse::test::error::invalid_format_continuation_without_preceding_header ... ok
test commit::parse::test::error::invalid_parent ... ok
test commit::parse::test::error::missing_author ... ok
test commit::parse::test::error::invalid_tree ... ok
test commit::parse::test::error::missing_committer ... ok
test commit::parse::test::error::missing_header_body_separator ... ok
test commit::parse::test::error::missing_tree_empty_header ... ok
test commit::parse::test::error::missing_tree_wrong_first_line ... ok
test commit::parse::test::success::commit_gpgsig_is_preserved_and_strip_removes_it ... ok
test commit::parse::test::success::commit_with_multiline_gpgsig ... ok
test commit::parse::test::success::commit_last_paragraph_kept_in_message_when_not_all_trailers ... ok
test commit::parse::test::success::commit_with_extra_headers ... ok
test commit::parse::test::success::commit_with_single_parent ... ok
test commit::parse::test::success::commit_with_trailers ... ok
test commit::parse::test::success::merge_commit ... ok
test commit::parse::test::success::root_commit ... ok
test commit::parse::test::success::roundtrip ... ok
test commit::parse::test::unit::body_last_paragraph_not_trailers_stays_in_message ... ok
test commit::parse::test::unit::body_no_paragraph_separator_means_no_trailers ... ok
test commit::parse::test::unit::trailers_accepts_empty_input ... ok
test commit::parse::test::unit::trailers_rejects_invalid_token_chars ... ok
test commit::parse::test::unit::trailers_rejects_line_without_separator ... ok
test result: ok. 24 passed; 0 failed; 0 ignored; 0 measured; 0 filtered out; finished in 0.00s
Running unittests src/lib.rs (target/debug/deps/radicle_git_ref_format-09d2e35a065977f7)
running 9 tests
test test::component ... ok
test test::pattern ... ok
test test::component_invalid - should panic ... ok
test test::qualified ... ok
test test::qualified_invalid - should panic ... ok
test test::qualified_pattern ... ok
test test::qualified_pattern_invalid - should panic ... ok
test test::refname_invalid - should panic ... ok
test test::refname ... ok
test result: ok. 9 passed; 0 failed; 0 ignored; 0 measured; 0 filtered out; finished in 0.00s
Running unittests src/lib.rs (target/debug/deps/radicle_localtime-f75e94d3ba02c400)
running 1 test
test serde_impls::test::test_localtime ... ok
test result: ok. 1 passed; 0 failed; 0 ignored; 0 measured; 0 filtered out; finished in 0.00s
Running unittests src/lib.rs (target/debug/deps/radicle_node-f32098b6eb7859f1)
running 78 tests
test control::tests::test_control_socket ... ok
test reactor::timer::tests::test_next ... ok
test reactor::timer::tests::test_wake ... ok
test reactor::timer::tests::test_wake_exact ... ok
test fingerprint::tests::matching ... ok
test control::tests::test_seed_unseed ... ok
test tests::e2e::test_block_active_connection ... FAILED
test tests::e2e::test_background_foreground_fetch ... FAILED
test tests::e2e::missing_delegate_default_branch ... FAILED
test tests::e2e::missing_default_branch ... FAILED
test tests::e2e::test_block_prevents_connection ... FAILED
test tests::e2e::test_block_prevents_fetch ... FAILED
test tests::e2e::test_catchup_on_refs_announcements ... FAILED
test tests::e2e::test_channel_reader_limit ... FAILED
test tests::e2e::test_clone ... FAILED
test tests::e2e::test_concurrent_fetches ... FAILED
test tests::e2e::test_connection_crossing ... FAILED
test tests::e2e::test_dont_fetch_owned_refs ... FAILED
test tests::e2e::test_fetch_emits_canonical_ref_update ... FAILED
test tests::e2e::test_fetch_preserve_owned_refs ... FAILED
test tests::e2e::test_fetch_followed_remotes ... FAILED
test tests::e2e::test_fetch_unseeded ... FAILED
test tests::e2e::test_fetch_up_to_date ... FAILED
test tests::e2e::test_inventory_sync_bridge ... FAILED
test tests::e2e::test_inventory_sync_basic ... FAILED
test tests::e2e::test_inventory_sync_ring ... FAILED
test tests::e2e::test_large_fetch ... FAILED
test tests::e2e::test_inventory_sync_star ... FAILED
test tests::e2e::test_migrated_clone ... FAILED
test tests::e2e::test_missing_remote ... FAILED
test tests::e2e::test_non_fastforward_identity_doc ... FAILED
test tests::e2e::test_multiple_offline_inits ... FAILED
test tests::e2e::test_non_fastforward_sigrefs ... FAILED
test tests::e2e::test_outdated_delegate_sigrefs ... FAILED
test tests::e2e::test_replication ... FAILED
test tests::e2e::test_outdated_sigrefs ... FAILED
test tests::e2e::test_replication_invalid ... FAILED
test tests::e2e::test_replication_ref_in_sigrefs ... FAILED
test tests::test_announcement_rebroadcast ... FAILED
test tests::test_announcement_message_amplification ... FAILED
test tests::prop_inventory_exchange_dense ... FAILED
test tests::test_announcement_rebroadcast_duplicates ... FAILED
test tests::test_announcement_rebroadcast_timestamp_filtered ... FAILED
test tests::test_announcement_relay ... FAILED
test tests::test_disconnecting_unresponsive_peer ... FAILED
test tests::test_connection_kept_alive ... FAILED
test tests::test_fetch_missing_inventory_on_gossip ... FAILED
test tests::test_inventory_decode ... ok
test tests::test_fetch_missing_inventory_on_schedule ... FAILED
test tests::test_inbound_connection ... FAILED
test tests::test_init_and_seed ... FAILED
test tests::test_inventory_pruning ... FAILED
test tests::test_inventory_relay ... FAILED
test tests::test_inventory_sync ... FAILED
test tests::test_inventory_relay_bad_timestamp ... FAILED
test tests::test_maintain_connections ... FAILED
test tests::test_maintain_connections_failed_attempt ... FAILED
test tests::test_outbound_connection ... FAILED
test tests::test_maintain_connections_transient ... FAILED
test tests::test_persistent_peer_connect ... FAILED
test tests::test_persistent_peer_reconnect_attempt ... FAILED
test tests::test_ping_response ... FAILED
test tests::test_persistent_peer_reconnect_success ... FAILED
test tests::test_queued_fetch_from_ann_same_rid ... FAILED
test tests::test_queued_fetch_from_command_same_rid ... FAILED
test tests::test_redundant_connect ... FAILED
test tests::test_queued_fetch_max_capacity ... FAILED
test tests::test_refs_announcement_fetch_trusted_no_inventory ... FAILED
test tests::test_refs_announcement_followed ... FAILED
test tests::test_refs_announcement_no_subscribe ... FAILED
test tests::test_refs_announcement_relay_private ... FAILED
test tests::test_refs_synced_event ... FAILED
test tests::test_refs_announcement_relay_public ... FAILED
test wire::test::test_inventory_ann_with_extension ... ok
test wire::test::test_pong_message_with_extension ... ok
test tests::test_seed_repo_subscribe ... FAILED
test tests::test_refs_announcement_offline ... FAILED
test tests::test_seeding ... FAILED
failures:
---- tests::e2e::test_block_active_connection stdout ----
thread 'tests::e2e::test_block_active_connection' panicked at crates/radicle-node/src/test/node.rs:459:14:
called `Result::unwrap()` on an `Err` value: Internal(Error { code: Some(1), message: Some("no such function: concat") })
note: run with `RUST_BACKTRACE=1` environment variable to display a backtrace
---- tests::e2e::test_background_foreground_fetch stdout ----
thread 'tests::e2e::test_background_foreground_fetch' panicked at crates/radicle-node/src/test/node.rs:459:14:
called `Result::unwrap()` on an `Err` value: Internal(Error { code: Some(1), message: Some("no such function: concat") })
---- tests::e2e::missing_delegate_default_branch stdout ----
thread 'tests::e2e::missing_delegate_default_branch' panicked at crates/radicle-node/src/test/node.rs:459:14:
called `Result::unwrap()` on an `Err` value: Internal(Error { code: Some(1), message: Some("no such function: concat") })
---- tests::e2e::missing_default_branch stdout ----
thread 'tests::e2e::missing_default_branch' panicked at crates/radicle-node/src/test/node.rs:459:14:
called `Result::unwrap()` on an `Err` value: Internal(Error { code: Some(1), message: Some("no such function: concat") })
---- tests::e2e::test_block_prevents_connection stdout ----
thread 'tests::e2e::test_block_prevents_connection' panicked at crates/radicle-node/src/test/node.rs:459:14:
called `Result::unwrap()` on an `Err` value: Internal(Error { code: Some(1), message: Some("no such function: concat") })
---- tests::e2e::test_block_prevents_fetch stdout ----
thread 'tests::e2e::test_block_prevents_fetch' panicked at crates/radicle-node/src/test/node.rs:459:14:
called `Result::unwrap()` on an `Err` value: Internal(Error { code: Some(1), message: Some("no such function: concat") })
---- tests::e2e::test_catchup_on_refs_announcements stdout ----
thread 'tests::e2e::test_catchup_on_refs_announcements' panicked at crates/radicle-node/src/test/node.rs:459:14:
called `Result::unwrap()` on an `Err` value: Internal(Error { code: Some(1), message: Some("no such function: concat") })
---- tests::e2e::test_channel_reader_limit stdout ----
thread 'tests::e2e::test_channel_reader_limit' panicked at crates/radicle-node/src/test/node.rs:459:14:
called `Result::unwrap()` on an `Err` value: Internal(Error { code: Some(1), message: Some("no such function: concat") })
---- tests::e2e::test_clone stdout ----
thread 'tests::e2e::test_clone' panicked at crates/radicle-node/src/test/node.rs:459:14:
called `Result::unwrap()` on an `Err` value: Internal(Error { code: Some(1), message: Some("no such function: concat") })
---- tests::e2e::test_concurrent_fetches stdout ----
thread 'tests::e2e::test_concurrent_fetches' panicked at crates/radicle-node/src/test/node.rs:459:14:
called `Result::unwrap()` on an `Err` value: Internal(Error { code: Some(1), message: Some("no such function: concat") })
---- tests::e2e::test_connection_crossing stdout ----
thread 'tests::e2e::test_connection_crossing' panicked at crates/radicle-node/src/test/node.rs:459:14:
called `Result::unwrap()` on an `Err` value: Internal(Error { code: Some(1), message: Some("no such function: concat") })
---- tests::e2e::test_dont_fetch_owned_refs stdout ----
thread 'tests::e2e::test_dont_fetch_owned_refs' panicked at crates/radicle-node/src/test/node.rs:459:14:
called `Result::unwrap()` on an `Err` value: Internal(Error { code: Some(1), message: Some("no such function: concat") })
---- tests::e2e::test_fetch_emits_canonical_ref_update stdout ----
thread 'tests::e2e::test_fetch_emits_canonical_ref_update' panicked at crates/radicle-node/src/test/node.rs:459:14:
called `Result::unwrap()` on an `Err` value: Internal(Error { code: Some(1), message: Some("no such function: concat") })
---- tests::e2e::test_fetch_preserve_owned_refs stdout ----
thread 'tests::e2e::test_fetch_preserve_owned_refs' panicked at crates/radicle-node/src/test/node.rs:459:14:
called `Result::unwrap()` on an `Err` value: Internal(Error { code: Some(1), message: Some("no such function: concat") })
---- tests::e2e::test_fetch_followed_remotes stdout ----
thread 'tests::e2e::test_fetch_followed_remotes' panicked at crates/radicle-node/src/test/node.rs:459:14:
called `Result::unwrap()` on an `Err` value: Internal(Error { code: Some(1), message: Some("no such function: concat") })
---- tests::e2e::test_fetch_unseeded stdout ----
thread 'tests::e2e::test_fetch_unseeded' panicked at crates/radicle-node/src/test/node.rs:459:14:
called `Result::unwrap()` on an `Err` value: Internal(Error { code: Some(1), message: Some("no such function: concat") })
---- tests::e2e::test_fetch_up_to_date stdout ----
thread 'tests::e2e::test_fetch_up_to_date' panicked at crates/radicle-node/src/test/node.rs:459:14:
called `Result::unwrap()` on an `Err` value: Internal(Error { code: Some(1), message: Some("no such function: concat") })
---- tests::e2e::test_inventory_sync_bridge stdout ----
thread 'tests::e2e::test_inventory_sync_bridge' panicked at crates/radicle-node/src/test/node.rs:459:14:
called `Result::unwrap()` on an `Err` value: Internal(Error { code: Some(1), message: Some("no such function: concat") })
---- tests::e2e::test_inventory_sync_basic stdout ----
thread 'tests::e2e::test_inventory_sync_basic' panicked at crates/radicle-node/src/test/node.rs:459:14:
called `Result::unwrap()` on an `Err` value: Internal(Error { code: Some(1), message: Some("no such function: concat") })
---- tests::e2e::test_inventory_sync_ring stdout ----
thread 'tests::e2e::test_inventory_sync_ring' panicked at crates/radicle-node/src/test/node.rs:459:14:
called `Result::unwrap()` on an `Err` value: Internal(Error { code: Some(1), message: Some("no such function: concat") })
---- tests::e2e::test_large_fetch stdout ----
thread 'tests::e2e::test_large_fetch' panicked at crates/radicle-node/src/test/node.rs:459:14:
called `Result::unwrap()` on an `Err` value: Internal(Error { code: Some(1), message: Some("no such function: concat") })
---- tests::e2e::test_inventory_sync_star stdout ----
thread 'tests::e2e::test_inventory_sync_star' panicked at crates/radicle-node/src/test/node.rs:459:14:
called `Result::unwrap()` on an `Err` value: Internal(Error { code: Some(1), message: Some("no such function: concat") })
---- tests::e2e::test_migrated_clone stdout ----
thread 'tests::e2e::test_migrated_clone' panicked at crates/radicle-node/src/test/node.rs:459:14:
called `Result::unwrap()` on an `Err` value: Internal(Error { code: Some(1), message: Some("no such function: concat") })
---- tests::e2e::test_missing_remote stdout ----
thread 'tests::e2e::test_missing_remote' panicked at crates/radicle-node/src/test/node.rs:459:14:
called `Result::unwrap()` on an `Err` value: Internal(Error { code: Some(1), message: Some("no such function: concat") })
---- tests::e2e::test_non_fastforward_identity_doc stdout ----
thread 'tests::e2e::test_non_fastforward_identity_doc' panicked at crates/radicle-node/src/test/node.rs:459:14:
called `Result::unwrap()` on an `Err` value: Internal(Error { code: Some(1), message: Some("no such function: concat") })
---- tests::e2e::test_multiple_offline_inits stdout ----
thread 'tests::e2e::test_multiple_offline_inits' panicked at crates/radicle-node/src/test/node.rs:459:14:
called `Result::unwrap()` on an `Err` value: Internal(Error { code: Some(1), message: Some("no such function: concat") })
---- tests::e2e::test_non_fastforward_sigrefs stdout ----
thread 'tests::e2e::test_non_fastforward_sigrefs' panicked at crates/radicle-node/src/test/node.rs:459:14:
called `Result::unwrap()` on an `Err` value: Internal(Error { code: Some(1), message: Some("no such function: concat") })
---- tests::e2e::test_outdated_delegate_sigrefs stdout ----
thread 'tests::e2e::test_outdated_delegate_sigrefs' panicked at crates/radicle-node/src/test/node.rs:459:14:
called `Result::unwrap()` on an `Err` value: Internal(Error { code: Some(1), message: Some("no such function: concat") })
---- tests::e2e::test_replication stdout ----
thread 'tests::e2e::test_replication' panicked at crates/radicle-node/src/test/node.rs:459:14:
called `Result::unwrap()` on an `Err` value: Internal(Error { code: Some(1), message: Some("no such function: concat") })
---- tests::e2e::test_outdated_sigrefs stdout ----
thread 'tests::e2e::test_outdated_sigrefs' panicked at crates/radicle-node/src/test/node.rs:459:14:
called `Result::unwrap()` on an `Err` value: Internal(Error { code: Some(1), message: Some("no such function: concat") })
---- tests::e2e::test_replication_invalid stdout ----
thread 'tests::e2e::test_replication_invalid' panicked at crates/radicle-node/src/test/node.rs:459:14:
called `Result::unwrap()` on an `Err` value: Internal(Error { code: Some(1), message: Some("no such function: concat") })
---- tests::e2e::test_replication_ref_in_sigrefs stdout ----
thread 'tests::e2e::test_replication_ref_in_sigrefs' panicked at crates/radicle-node/src/test/node.rs:459:14:
called `Result::unwrap()` on an `Err` value: Internal(Error { code: Some(1), message: Some("no such function: concat") })
---- tests::test_announcement_rebroadcast stdout ----
thread 'tests::test_announcement_rebroadcast' panicked at crates/radicle-node/src/test/peer.rs:182:10:
called `Result::unwrap()` on an `Err` value: Internal(Error { code: Some(1), message: Some("no such function: concat") })
---- tests::test_announcement_message_amplification stdout ----
thread 'tests::test_announcement_message_amplification' panicked at crates/radicle-node/src/test/peer.rs:182:10:
called `Result::unwrap()` on an `Err` value: Internal(Error { code: Some(1), message: Some("no such function: concat") })
---- tests::prop_inventory_exchange_dense stdout ----
thread 'tests::prop_inventory_exchange_dense' panicked at crates/radicle-node/src/test/peer.rs:182:10:
called `Result::unwrap()` on an `Err` value: Internal(Error { code: Some(1), message: Some("no such function: concat") })
thread 'tests::prop_inventory_exchange_dense' panicked at /usr/local/cargo/registry/src/index.crates.io-1949cf8c6b5b557f/qcheck-1.0.0/src/tester.rs:165:28:
[quickcheck] TEST FAILED (runtime error). No Arguments Provided
Error: "called `Result::unwrap()` on an `Err` value: Internal(Error { code: Some(1), message: Some(\"no such function: concat\") })"
---- tests::test_announcement_rebroadcast_duplicates stdout ----
thread 'tests::test_announcement_rebroadcast_duplicates' panicked at crates/radicle-node/src/test/peer.rs:182:10:
called `Result::unwrap()` on an `Err` value: Internal(Error { code: Some(1), message: Some("no such function: concat") })
---- tests::test_announcement_rebroadcast_timestamp_filtered stdout ----
thread 'tests::test_announcement_rebroadcast_timestamp_filtered' panicked at crates/radicle-node/src/test/peer.rs:182:10:
called `Result::unwrap()` on an `Err` value: Internal(Error { code: Some(1), message: Some("no such function: concat") })
---- tests::test_announcement_relay stdout ----
thread 'tests::test_announcement_relay' panicked at crates/radicle-node/src/test/peer.rs:182:10:
called `Result::unwrap()` on an `Err` value: Internal(Error { code: Some(1), message: Some("no such function: concat") })
---- tests::test_disconnecting_unresponsive_peer stdout ----
thread 'tests::test_disconnecting_unresponsive_peer' panicked at crates/radicle-node/src/test/peer.rs:182:10:
called `Result::unwrap()` on an `Err` value: Internal(Error { code: Some(1), message: Some("no such function: concat") })
---- tests::test_connection_kept_alive stdout ----
thread 'tests::test_connection_kept_alive' panicked at crates/radicle-node/src/test/peer.rs:182:10:
called `Result::unwrap()` on an `Err` value: Internal(Error { code: Some(1), message: Some("no such function: concat") })
---- tests::test_fetch_missing_inventory_on_gossip stdout ----
thread 'tests::test_fetch_missing_inventory_on_gossip' panicked at crates/radicle-node/src/test/peer.rs:182:10:
called `Result::unwrap()` on an `Err` value: Internal(Error { code: Some(1), message: Some("no such function: concat") })
---- tests::test_fetch_missing_inventory_on_schedule stdout ----
thread 'tests::test_fetch_missing_inventory_on_schedule' panicked at crates/radicle-node/src/test/peer.rs:182:10:
called `Result::unwrap()` on an `Err` value: Internal(Error { code: Some(1), message: Some("no such function: concat") })
---- tests::test_inbound_connection stdout ----
thread 'tests::test_inbound_connection' panicked at crates/radicle-node/src/test/peer.rs:182:10:
called `Result::unwrap()` on an `Err` value: Internal(Error { code: Some(1), message: Some("no such function: concat") })
---- tests::test_init_and_seed stdout ----
thread 'tests::test_init_and_seed' panicked at crates/radicle-node/src/test/peer.rs:182:10:
called `Result::unwrap()` on an `Err` value: Internal(Error { code: Some(1), message: Some("no such function: concat") })
---- tests::test_inventory_pruning stdout ----
thread 'tests::test_inventory_pruning' panicked at crates/radicle-node/src/test/peer.rs:182:10:
called `Result::unwrap()` on an `Err` value: Internal(Error { code: Some(1), message: Some("no such function: concat") })
---- tests::test_inventory_relay stdout ----
thread 'tests::test_inventory_relay' panicked at crates/radicle-node/src/test/peer.rs:182:10:
called `Result::unwrap()` on an `Err` value: Internal(Error { code: Some(1), message: Some("no such function: concat") })
---- tests::test_inventory_sync stdout ----
thread 'tests::test_inventory_sync' panicked at crates/radicle-node/src/test/peer.rs:182:10:
called `Result::unwrap()` on an `Err` value: Internal(Error { code: Some(1), message: Some("no such function: concat") })
---- tests::test_inventory_relay_bad_timestamp stdout ----
thread 'tests::test_inventory_relay_bad_timestamp' panicked at crates/radicle-node/src/test/peer.rs:182:10:
called `Result::unwrap()` on an `Err` value: Internal(Error { code: Some(1), message: Some("no such function: concat") })
---- tests::test_maintain_connections stdout ----
thread 'tests::test_maintain_connections' panicked at crates/radicle-node/src/test/peer.rs:182:10:
called `Result::unwrap()` on an `Err` value: Internal(Error { code: Some(1), message: Some("no such function: concat") })
---- tests::test_maintain_connections_failed_attempt stdout ----
thread 'tests::test_maintain_connections_failed_attempt' panicked at crates/radicle-node/src/test/peer.rs:182:10:
called `Result::unwrap()` on an `Err` value: Internal(Error { code: Some(1), message: Some("no such function: concat") })
---- tests::test_outbound_connection stdout ----
thread 'tests::test_outbound_connection' panicked at crates/radicle-node/src/test/peer.rs:182:10:
called `Result::unwrap()` on an `Err` value: Internal(Error { code: Some(1), message: Some("no such function: concat") })
---- tests::test_maintain_connections_transient stdout ----
thread 'tests::test_maintain_connections_transient' panicked at crates/radicle-node/src/test/peer.rs:182:10:
called `Result::unwrap()` on an `Err` value: Internal(Error { code: Some(1), message: Some("no such function: concat") })
---- tests::test_persistent_peer_connect stdout ----
thread 'tests::test_persistent_peer_connect' panicked at crates/radicle-node/src/test/peer.rs:182:10:
called `Result::unwrap()` on an `Err` value: Internal(Error { code: Some(1), message: Some("no such function: concat") })
---- tests::test_persistent_peer_reconnect_attempt stdout ----
thread 'tests::test_persistent_peer_reconnect_attempt' panicked at crates/radicle-node/src/test/peer.rs:182:10:
called `Result::unwrap()` on an `Err` value: Internal(Error { code: Some(1), message: Some("no such function: concat") })
---- tests::test_ping_response stdout ----
thread 'tests::test_ping_response' panicked at crates/radicle-node/src/test/peer.rs:182:10:
called `Result::unwrap()` on an `Err` value: Internal(Error { code: Some(1), message: Some("no such function: concat") })
---- tests::test_persistent_peer_reconnect_success stdout ----
thread 'tests::test_persistent_peer_reconnect_success' panicked at crates/radicle-node/src/test/peer.rs:182:10:
called `Result::unwrap()` on an `Err` value: Internal(Error { code: Some(1), message: Some("no such function: concat") })
---- tests::test_queued_fetch_from_ann_same_rid stdout ----
thread 'tests::test_queued_fetch_from_ann_same_rid' panicked at crates/radicle-node/src/test/peer.rs:182:10:
called `Result::unwrap()` on an `Err` value: Internal(Error { code: Some(1), message: Some("no such function: concat") })
---- tests::test_queued_fetch_from_command_same_rid stdout ----
thread 'tests::test_queued_fetch_from_command_same_rid' panicked at crates/radicle-node/src/test/peer.rs:182:10:
called `Result::unwrap()` on an `Err` value: Internal(Error { code: Some(1), message: Some("no such function: concat") })
---- tests::test_redundant_connect stdout ----
thread 'tests::test_redundant_connect' panicked at crates/radicle-node/src/test/peer.rs:182:10:
called `Result::unwrap()` on an `Err` value: Internal(Error { code: Some(1), message: Some("no such function: concat") })
---- tests::test_queued_fetch_max_capacity stdout ----
thread 'tests::test_queued_fetch_max_capacity' panicked at crates/radicle-node/src/test/peer.rs:182:10:
called `Result::unwrap()` on an `Err` value: Internal(Error { code: Some(1), message: Some("no such function: concat") })
---- tests::test_refs_announcement_fetch_trusted_no_inventory stdout ----
thread 'tests::test_refs_announcement_fetch_trusted_no_inventory' panicked at crates/radicle-node/src/test/peer.rs:182:10:
called `Result::unwrap()` on an `Err` value: Internal(Error { code: Some(1), message: Some("no such function: concat") })
---- tests::test_refs_announcement_followed stdout ----
thread 'tests::test_refs_announcement_followed' panicked at crates/radicle-node/src/test/peer.rs:182:10:
called `Result::unwrap()` on an `Err` value: Internal(Error { code: Some(1), message: Some("no such function: concat") })
---- tests::test_refs_announcement_no_subscribe stdout ----
thread 'tests::test_refs_announcement_no_subscribe' panicked at crates/radicle-node/src/test/peer.rs:182:10:
called `Result::unwrap()` on an `Err` value: Internal(Error { code: Some(1), message: Some("no such function: concat") })
---- tests::test_refs_announcement_relay_private stdout ----
thread 'tests::test_refs_announcement_relay_private' panicked at crates/radicle-node/src/test/peer.rs:182:10:
called `Result::unwrap()` on an `Err` value: Internal(Error { code: Some(1), message: Some("no such function: concat") })
---- tests::test_refs_synced_event stdout ----
thread 'tests::test_refs_synced_event' panicked at crates/radicle-node/src/test/peer.rs:182:10:
called `Result::unwrap()` on an `Err` value: Internal(Error { code: Some(1), message: Some("no such function: concat") })
---- tests::test_refs_announcement_relay_public stdout ----
thread 'tests::test_refs_announcement_relay_public' panicked at crates/radicle-node/src/test/peer.rs:182:10:
called `Result::unwrap()` on an `Err` value: Internal(Error { code: Some(1), message: Some("no such function: concat") })
---- tests::test_seed_repo_subscribe stdout ----
thread 'tests::test_seed_repo_subscribe' panicked at crates/radicle-node/src/test/peer.rs:182:10:
called `Result::unwrap()` on an `Err` value: Internal(Error { code: Some(1), message: Some("no such function: concat") })
---- tests::test_refs_announcement_offline stdout ----
thread 'tests::test_refs_announcement_offline' panicked at crates/radicle-node/src/test/peer.rs:182:10:
called `Result::unwrap()` on an `Err` value: Internal(Error { code: Some(1), message: Some("no such function: concat") })
---- tests::test_seeding stdout ----
thread 'tests::test_seeding' panicked at crates/radicle-node/src/test/peer.rs:182:10:
called `Result::unwrap()` on an `Err` value: Internal(Error { code: Some(1), message: Some("no such function: concat") })
failures:
tests::e2e::missing_default_branch
tests::e2e::missing_delegate_default_branch
tests::e2e::test_background_foreground_fetch
tests::e2e::test_block_active_connection
tests::e2e::test_block_prevents_connection
tests::e2e::test_block_prevents_fetch
tests::e2e::test_catchup_on_refs_announcements
tests::e2e::test_channel_reader_limit
tests::e2e::test_clone
tests::e2e::test_concurrent_fetches
tests::e2e::test_connection_crossing
tests::e2e::test_dont_fetch_owned_refs
tests::e2e::test_fetch_emits_canonical_ref_update
tests::e2e::test_fetch_followed_remotes
tests::e2e::test_fetch_preserve_owned_refs
tests::e2e::test_fetch_unseeded
tests::e2e::test_fetch_up_to_date
tests::e2e::test_inventory_sync_basic
tests::e2e::test_inventory_sync_bridge
tests::e2e::test_inventory_sync_ring
tests::e2e::test_inventory_sync_star
tests::e2e::test_large_fetch
tests::e2e::test_migrated_clone
tests::e2e::test_missing_remote
tests::e2e::test_multiple_offline_inits
tests::e2e::test_non_fastforward_identity_doc
tests::e2e::test_non_fastforward_sigrefs
tests::e2e::test_outdated_delegate_sigrefs
tests::e2e::test_outdated_sigrefs
tests::e2e::test_replication
tests::e2e::test_replication_invalid
tests::e2e::test_replication_ref_in_sigrefs
tests::prop_inventory_exchange_dense
tests::test_announcement_message_amplification
tests::test_announcement_rebroadcast
tests::test_announcement_rebroadcast_duplicates
tests::test_announcement_rebroadcast_timestamp_filtered
tests::test_announcement_relay
tests::test_connection_kept_alive
tests::test_disconnecting_unresponsive_peer
tests::test_fetch_missing_inventory_on_gossip
tests::test_fetch_missing_inventory_on_schedule
tests::test_inbound_connection
tests::test_init_and_seed
tests::test_inventory_pruning
tests::test_inventory_relay
tests::test_inventory_relay_bad_timestamp
tests::test_inventory_sync
tests::test_maintain_connections
tests::test_maintain_connections_failed_attempt
tests::test_maintain_connections_transient
tests::test_outbound_connection
tests::test_persistent_peer_connect
tests::test_persistent_peer_reconnect_attempt
tests::test_persistent_peer_reconnect_success
tests::test_ping_response
tests::test_queued_fetch_from_ann_same_rid
tests::test_queued_fetch_from_command_same_rid
tests::test_queued_fetch_max_capacity
tests::test_redundant_connect
tests::test_refs_announcement_fetch_trusted_no_inventory
tests::test_refs_announcement_followed
tests::test_refs_announcement_no_subscribe
tests::test_refs_announcement_offline
tests::test_refs_announcement_relay_private
tests::test_refs_announcement_relay_public
tests::test_refs_synced_event
tests::test_seed_repo_subscribe
tests::test_seeding
test result: FAILED. 9 passed; 69 failed; 0 ignored; 0 measured; 0 filtered out; finished in 0.80s
running 0 tests
test result: ok. 0 passed; 0 failed; 0 ignored; 0 measured; 0 filtered out; finished in 0.00s
running 10 tests
test fmt::test::fixture ... ok
test fmt::test::git2 ... ok
test fmt::test::gix ... ok
test fmt::test::zero ... ok
test git2::test::zero ... ok
test gix::test::zero ... ok
test str::test::fixture ... ok
test str::test::git2_roundtrip ... ok
test str::test::zero ... ok
test str::test::gix_roundrip ... ok
test result: ok. 10 passed; 0 failed; 0 ignored; 0 measured; 0 filtered out; finished in 0.00s
error: test failed, to rerun pass `-p radicle-node --lib`
Running unittests src/main.rs (target/debug/deps/radicle_node-6ce0e9e4c117cda3)
Running unittests src/lib.rs (target/debug/deps/radicle_oid-8a3ece19594f1498)
Running unittests src/lib.rs (target/debug/deps/radicle_protocol-c7054b3b2cad6ea1)
running 99 tests
test deserializer::test::test_decode_next ... ok
test deserializer::test::test_unparsed ... ok
test deserializer::test::prop_decode_next ... ok
test fetcher::service::tests::test_fetch_coalescing_different_refs ... ok
test fetcher::test::queue::properties::capacity::rejection ... ok
test fetcher::test::queue::properties::capacity::bounded ... ok
test fetcher::test::queue::properties::dequeue::empty_queue_returns_none ... ok
test fetcher::test::queue::properties::capacity::restored_after_dequeue ... ok
test fetcher::test::queue::properties::dequeue::enables_reenqueue ... ok
test fetcher::test::queue::properties::capacity::capacity_reached_returns_same_item ... ok
test fetcher::test::queue::properties::dequeue::drained_queue_returns_none ... ok
test fetcher::test::queue::properties::fifo::interleaved_operations ... ok
test fetcher::test::queue::properties::fifo::ordering ... ok
test fetcher::test::queue::properties::equality::reflexive ... ok
test fetcher::test::queue::properties::merge::different_rid_accepted ... ok
test fetcher::test::queue::properties::merge::does_not_increase_queue_length ... ok
test fetcher::test::queue::properties::equality::symmetric ... ok
test fetcher::test::queue::properties::merge::longer_timeout_preserved ... ok
test fetcher::test::queue::properties::equality::transitive ... ok
test fetcher::test::queue::properties::merge::empty_refs_fetches_all ... ok
test fetcher::test::queue::unit::capacity_takes_precedence_over_merge_for_new_items ... ok
test fetcher::test::queue::unit::empty_refs_items_can_be_equal ... ok
test fetcher::test::queue::unit::max_timeout_accepted ... ok
test fetcher::test::queue::unit::merge_preserves_position_in_queue ... ok
test fetcher::test::queue::unit::zero_timeout_accepted ... ok
test fetcher::test::queue::properties::merge::combines_refs ... ok
test fetcher::test::state::command::cancel::non_existent_returns_unexpected ... ok
test fetcher::test::state::command::cancel::cancellation_is_isolated ... ok
test fetcher::test::state::command::cancel::single_ongoing ... ok
test fetcher::test::state::command::fetch::fetch_after_previous_completed ... ok
test fetcher::test::state::command::cancel::ongoing_and_queued ... ok
test fetcher::test::state::command::fetch::fetch_at_capacity_enqueues ... ok
test fetcher::test::state::command::fetch::fetch_different_repo_same_node_within_capacity ... ok
test fetcher::test::state::command::fetch::fetch_queue_merge_empty_refs_fetches_all ... ok
test fetcher::test::state::command::fetch::fetch_duplicate_returns_already_fetching ... ok
test fetcher::test::state::command::fetch::fetch_queue_merge_takes_longer_timeout ... ok
test fetcher::test::state::command::fetch::fetch_queue_merges_already_queued ... ok
test fetcher::test::state::command::fetch::fetch_queue_rejected_capacity_reached ... ok
test fetcher::test::state::command::fetch::fetch_same_repo_different_nodes_queues_second ... ok
test fetcher::test::queue::properties::merge::same_rid_merges_anywhere_in_queue ... ok
test fetcher::test::state::command::fetch::fetch_same_repo_different_refs_enqueues ... ok
test fetcher::test::state::command::fetched::complete_one_of_multiple ... ok
test fetcher::test::state::command::fetch::fetch_start_first_fetch_for_node ... ok
test fetcher::test::state::command::fetched::complete_single_ongoing ... ok
test fetcher::test::state::command::fetched::non_existent_returns_not_found ... ok
test fetcher::test::state::concurrent::fetched_then_cancel ... ok
test fetcher::test::state::concurrent::interleaved_operations ... ok
test fetcher::test::state::config::min_queue_size ... ok
test fetcher::test::state::command::fetched::complete_then_dequeue_fifo ... ok
test fetcher::test::state::dequeue::empty_queue_returns_none ... ok
test fetcher::test::state::dequeue::maintains_fifo_order ... ok
test fetcher::test::state::invariant::queue_integrity_after_merge ... ok
test fetcher::test::queue::properties::merge::succeed_when_at_capacity ... ok
test fetcher::test::state::multinode::independent_queues ... ok
test service::filter::test::compatible ... ok
test service::filter::test::test_parameters ... ok
test fetcher::test::state::dequeue::cannot_dequeue_while_node_at_capacity ... ok
test service::filter::test::test_sizes ... ok
test service::gossip::store::test::test_announced ... FAILED
test service::limiter::test::test_limiter_different_rates ... ok
test service::limiter::test::test_limiter_multi ... ok
test service::limiter::test::test_limiter_refill ... ok
test service::message::tests::test_inventory_limit ... ok
test fetcher::test::state::config::high_concurrency ... ok
test service::message::tests::test_ref_remote_limit ... ok
test wire::frame::test::test_encode_git_large ... ok
test wire::frame::test::test_stream_id ... ok
test fetcher::test::state::multinode::high_count ... ok
test wire::message::tests::prop_roundtrip_address ... ok
test service::message::tests::prop_refs_announcement_signing ... ok
test wire::message::tests::prop_zero_bytes_encode_decode ... ok
test wire::message::tests::test_inv_ann_max_size ... ok
test wire::message::tests::test_node_ann_max_size ... ok
test wire::message::tests::test_ping_encode_size_overflow - should panic ... ok
test wire::message::tests::test_pingpong_encode_max_size ... ok
test wire::message::tests::test_pong_encode_size_overflow - should panic ... ok
test wire::message::tests::prop_roundtrip_message ... ok
test wire::tests::prop_oid ... ok
test wire::tests::prop_roundtrip_filter ... ok
test wire::tests::prop_roundtrip_publickey ... ok
test wire::tests::prop_roundtrip_refs ... ok
test wire::tests::prop_roundtrip_repoid ... ok
test wire::tests::prop_roundtrip_tuple ... ok
test wire::tests::prop_roundtrip_u16 ... ok
test wire::tests::prop_roundtrip_u32 ... ok
test wire::tests::prop_roundtrip_u64 ... ok
test wire::tests::prop_roundtrip_vec ... ok
test wire::tests::prop_signature ... ok
test wire::tests::prop_string ... ok
test wire::tests::test_alias ... ok
test wire::tests::test_bounded_vec_limit ... ok
test wire::tests::test_filter_invalid ... ok
test wire::tests::test_string ... ok
test wire::varint::test::prop_roundtrip_varint ... ok
test wire::varint::test::test_encode_overflow - should panic ... ok
test wire::varint::test::test_encoding ... ok
test wire::message::tests::prop_message_decoder ... ok
test wire::message::tests::test_refs_ann_max_size ... ok
test service::message::tests::test_node_announcement_validate ... ok
failures:
---- service::gossip::store::test::test_announced stdout ----
thread 'service::gossip::store::test::test_announced' panicked at crates/radicle-protocol/src/service/gossip/store.rs:391:41:
called `Result::unwrap()` on an `Err` value: Internal(Error { code: Some(1), message: Some("no such function: concat") })
note: run with `RUST_BACKTRACE=1` environment variable to display a backtrace
failures:
service::gossip::store::test::test_announced
test result: FAILED. 98 passed; 1 failed; 0 ignored; 0 measured; 0 filtered out; finished in 1.83s
error: test failed, to rerun pass `-p radicle-protocol --lib`
Running unittests src/main.rs (target/debug/deps/git_remote_rad-879d204374147905)
running 12 tests
test protocol::tests::test_empty ... ok
test protocol::tests::test_fetch ... ok
test protocol::tests::test_capabilities ... ok
test protocol::tests::test_fetch_whitespace ... ok
test protocol::tests::test_invalid ... ok
test protocol::tests::test_list ... ok
test protocol::tests::test_list_for_push ... ok
test protocol::tests::test_option ... ok
test protocol::tests::test_option_whitespace_preservation ... ok
test protocol::tests::test_push ... ok
test protocol::tests::test_push_force ... ok
test protocol::tests::test_push_delete ... ok
test result: ok. 12 passed; 0 failed; 0 ignored; 0 measured; 0 filtered out; finished in 0.00s
Running unittests src/main.rs (target/debug/deps/radicle_schemars-2c05d8a3e9b64717)
running 0 tests
test result: ok. 0 passed; 0 failed; 0 ignored; 0 measured; 0 filtered out; finished in 0.00s
Running unittests src/lib.rs (target/debug/deps/radicle_signals-1a2ca7fd33a640da)
running 0 tests
test result: ok. 0 passed; 0 failed; 0 ignored; 0 measured; 0 filtered out; finished in 0.00s
Running unittests src/lib.rs (target/debug/deps/radicle_ssh-9f14aadafa88ba9c)
running 0 tests
test result: ok. 0 passed; 0 failed; 0 ignored; 0 measured; 0 filtered out; finished in 0.00s
Running unittests src/lib.rs (target/debug/deps/radicle_systemd-e2cf2d080022d36d)
running 0 tests
test result: ok. 0 passed; 0 failed; 0 ignored; 0 measured; 0 filtered out; finished in 0.00s
Running unittests src/lib.rs (target/debug/deps/radicle_term-0b9f55c733b570cc)
running 21 tests
test ansi::tests::colors_disabled ... ok
test ansi::tests::wrapping ... ok
test element::test::test_truncate ... ok
test element::test::test_spaced ... ok
test element::test::test_width ... ok
test cell::test::test_width ... ok
test ansi::tests::colors_enabled ... ok
test table::test::test_table ... ok
test table::test::test_table_border_truncated ... ok
test table::test::test_table_border ... ok
test table::test::test_table_border_maximized ... ok
test table::test::test_truncate ... ok
test table::test::test_table_unicode ... ok
test table::test::test_table_unicode_truncate ... ok
test table::test::test_table_truncate ... ok
test textarea::test::test_wrapping ... ok
test textarea::test::test_wrapping_code_block ... ok
test textarea::test::test_wrapping_paragraphs ... ok
test textarea::test::test_wrapping_fenced_block ... ok
test vstack::test::test_vstack_maximize ... ok
test vstack::test::test_vstack ... ok
test result: ok. 21 passed; 0 failed; 0 ignored; 0 measured; 0 filtered out; finished in 0.00s
Running unittests src/lib.rs (target/debug/deps/radicle_windows-2c067555aa9e0165)
running 0 tests
test result: ok. 0 passed; 0 failed; 0 ignored; 0 measured; 0 filtered out; finished in 0.00s
Doc-tests radicle
running 1 test
test crates/radicle/src/cob/patch/encoding/review.rs - cob::patch::encoding::review::Review (line 23) ... ignored
test result: ok. 0 passed; 0 failed; 1 ignored; 0 measured; 0 filtered out; finished in 0.00s
Doc-tests radicle_cli
running 0 tests
test result: ok. 0 passed; 0 failed; 0 ignored; 0 measured; 0 filtered out; finished in 0.00s
Doc-tests radicle_cli_test
running 0 tests
test result: ok. 0 passed; 0 failed; 0 ignored; 0 measured; 0 filtered out; finished in 0.00s
Doc-tests radicle_cob
running 1 test
test crates/radicle-cob/src/backend/stable.rs - backend::stable::with_advanced_timestamp (line 56) ... ignored
test result: ok. 0 passed; 0 failed; 1 ignored; 0 measured; 0 filtered out; finished in 0.00s
Doc-tests radicle_core
running 0 tests
test result: ok. 0 passed; 0 failed; 0 ignored; 0 measured; 0 filtered out; finished in 0.00s
Doc-tests radicle_crypto
running 0 tests
test result: ok. 0 passed; 0 failed; 0 ignored; 0 measured; 0 filtered out; finished in 0.00s
Doc-tests radicle_dag
running 0 tests
test result: ok. 0 passed; 0 failed; 0 ignored; 0 measured; 0 filtered out; finished in 0.00s
Doc-tests radicle_fetch
running 0 tests
test result: ok. 0 passed; 0 failed; 0 ignored; 0 measured; 0 filtered out; finished in 0.00s
Doc-tests radicle_git_metadata
running 0 tests
test result: ok. 0 passed; 0 failed; 0 ignored; 0 measured; 0 filtered out; finished in 0.00s
Doc-tests radicle_git_ref_format
running 0 tests
test result: ok. 0 passed; 0 failed; 0 ignored; 0 measured; 0 filtered out; finished in 0.00s
Doc-tests radicle_localtime
running 0 tests
test result: ok. 0 passed; 0 failed; 0 ignored; 0 measured; 0 filtered out; finished in 0.00s
Doc-tests radicle_node
running 0 tests
test result: ok. 0 passed; 0 failed; 0 ignored; 0 measured; 0 filtered out; finished in 0.00s
Doc-tests radicle_oid
running 0 tests
test result: ok. 0 passed; 0 failed; 0 ignored; 0 measured; 0 filtered out; finished in 0.00s
Doc-tests radicle_protocol
running 6 tests
test crates/radicle-protocol/src/bounded.rs - bounded::BoundedVec<T,N>::max (line 96) ... ok
test crates/radicle-protocol/src/bounded.rs - bounded::BoundedVec<T,N>::truncate (line 50) ... ok
test crates/radicle-protocol/src/bounded.rs - bounded::BoundedVec<T,N>::push (line 122) ... ok
test crates/radicle-protocol/src/bounded.rs - bounded::BoundedVec<T,N>::collect_from (line 30) ... ok
test crates/radicle-protocol/src/bounded.rs - bounded::BoundedVec<T,N>::unbound (line 149) ... ok
test crates/radicle-protocol/src/bounded.rs - bounded::BoundedVec<T,N>::with_capacity (line 66) ... ok
test result: ok. 6 passed; 0 failed; 0 ignored; 0 measured; 0 filtered out; finished in 0.36s
Doc-tests radicle_signals
running 0 tests
test result: ok. 0 passed; 0 failed; 0 ignored; 0 measured; 0 filtered out; finished in 0.00s
Doc-tests radicle_ssh
running 0 tests
test result: ok. 0 passed; 0 failed; 0 ignored; 0 measured; 0 filtered out; finished in 0.00s
Doc-tests radicle_systemd
running 0 tests
test result: ok. 0 passed; 0 failed; 0 ignored; 0 measured; 0 filtered out; finished in 0.00s
Doc-tests radicle_term
running 1 test
test crates/radicle-term/src/table.rs - table (line 4) ... ok
test result: ok. 1 passed; 0 failed; 0 ignored; 0 measured; 0 filtered out; finished in 0.14s
Doc-tests radicle_windows
running 0 tests
test result: ok. 0 passed; 0 failed; 0 ignored; 0 measured; 0 filtered out; finished in 0.00s
error: 4 targets failed:
`-p radicle --lib`
`-p radicle-cli --test commands`
`-p radicle-node --lib`
`-p radicle-protocol --lib`
Exit code: 101
{
"response": "finished",
"result": "failure"
}