rad:z3gqcJUoA1n9HaHKufZs5FCSGazv5 heartwoodc20685b78f10eeeb0795ca4826e6829a582b7e75
{
"request": "trigger",
"version": 1,
"event_type": "patch",
"repository": {
"id": "rad:z3gqcJUoA1n9HaHKufZs5FCSGazv5",
"name": "heartwood",
"description": "Radicle Heartwood Protocol & Stack",
"private": false,
"default_branch": "master",
"delegates": [
"did:key:z6MksFqXN3Yhqk8pTJdUGLwATkRfQvwZXPqR2qMEhbS9wzpT",
"did:key:z6MkireRatUThvd3qzfKht1S44wpm4FEWSSa4PRMTSQZ3voM",
"did:key:z6MkkPvBfjP4bQmco5Dm7UGsX2ruDBieEHi8n9DVJWX5sTEz"
]
},
"action": "Created",
"patch": {
"id": "05c753cfb1c9f96983bc2bd8646abdaa40bbb5b3",
"author": {
"id": "did:key:z6MkireRatUThvd3qzfKht1S44wpm4FEWSSa4PRMTSQZ3voM",
"alias": null
},
"title": "CVE-2026-25727",
"state": {
"status": "merged",
"conflicts": []
},
"before": "03bbe52417f131ec721a7c1cc57185019f0298a3",
"after": "c20685b78f10eeeb0795ca4826e6829a582b7e75",
"commits": [
"c20685b78f10eeeb0795ca4826e6829a582b7e75"
],
"target": "919d5c780c4da0b5b9f18f1549bc59dffd7125af",
"labels": [],
"assignees": [],
"revisions": [
{
"id": "05c753cfb1c9f96983bc2bd8646abdaa40bbb5b3",
"author": {
"id": "did:key:z6MkireRatUThvd3qzfKht1S44wpm4FEWSSa4PRMTSQZ3voM",
"alias": null
},
"description": "Report: <https://www.cve.org/CVERecord?id=CVE-2026-25727>\n\nThe `time` crate was a transitivie dependency of `human-panic`.\nUpdating `human-panic` to 2.0.6 removes the `plist`, and in turn,\n`time` dependencies.",
"base": "03bbe52417f131ec721a7c1cc57185019f0298a3",
"oid": "c20685b78f10eeeb0795ca4826e6829a582b7e75",
"timestamp": 1771004012
},
{
"id": "b0c7cb26162227dc6d4ecb5db58e45d11c38d0cb",
"author": {
"id": "did:key:z6MkireRatUThvd3qzfKht1S44wpm4FEWSSa4PRMTSQZ3voM",
"alias": null
},
"description": "Rebase",
"base": "31607cf7ad443475c66eabb846b1bdd37e5deff1",
"oid": "c06b00e330d82c8b8221cc8f8776c883208d159f",
"timestamp": 1771006134
}
]
}
}
{
"response": "triggered",
"run_id": {
"id": "477f61bc-11d5-4481-be7f-441c8572a73c"
},
"info_url": "https://cci.rad.levitte.org//477f61bc-11d5-4481-be7f-441c8572a73c.html"
}
Started at: 2026-09-07 18:21:54.039371+02:00
Commands:
$ rad clone rad:z3gqcJUoA1n9HaHKufZs5FCSGazv5 .
✓ Creating checkout in ./...
✓ Remote cloudhead@z6MksFqXN3Yhqk8pTJdUGLwATkRfQvwZXPqR2qMEhbS9wzpT added
✓ Remote-tracking branch cloudhead@z6MksFqXN3Yhqk8pTJdUGLwATkRfQvwZXPqR2qMEhbS9wzpT/master created for z6MksFqXN3Yhqk8pTJdUGLwATkRfQvwZXPqR2qMEhbS9wzpT
✓ Remote fintohaps@z6MkireRatUThvd3qzfKht1S44wpm4FEWSSa4PRMTSQZ3voM added
✓ Remote-tracking branch fintohaps@z6MkireRatUThvd3qzfKht1S44wpm4FEWSSa4PRMTSQZ3voM/master created for z6MkireRatUThvd3qzfKht1S44wpm4FEWSSa4PRMTSQZ3voM
✓ Remote lorenz@z6MkkPvBfjP4bQmco5Dm7UGsX2ruDBieEHi8n9DVJWX5sTEz added
✓ Remote-tracking branch lorenz@z6MkkPvBfjP4bQmco5Dm7UGsX2ruDBieEHi8n9DVJWX5sTEz/master created for z6MkkPvBfjP4bQmco5Dm7UGsX2ruDBieEHi8n9DVJWX5sTEz
✓ Repository successfully cloned under /opt/radcis/ci.rad.levitte.org/cci/state/477f61bc-11d5-4481-be7f-441c8572a73c/w/
╭────────────────────────────────────╮
│ heartwood │
│ Radicle Heartwood Protocol & Stack │
│ 189 issues · 37 patches │
╰────────────────────────────────────╯
Run `cd ./.` to go to the repository directory.
Exit code: 0
$ rad patch checkout 05c753cfb1c9f96983bc2bd8646abdaa40bbb5b3
✓ Switched to branch patch/05c753c at revision 05c753c
✓ Branch patch/05c753c setup to track rad/patches/05c753cfb1c9f96983bc2bd8646abdaa40bbb5b3
Exit code: 0
$ git config advice.detachedHead false
Exit code: 0
$ git checkout c20685b78f10eeeb0795ca4826e6829a582b7e75
HEAD is now at c20685b7 CVE-2026-25727
Exit code: 0
$ rad patch show 05c753cfb1c9f96983bc2bd8646abdaa40bbb5b3 -p
╭─────────────────────────────────────────────────────────────────────────────────╮
│ Title CVE-2026-25727 │
│ Patch 05c753cfb1c9f96983bc2bd8646abdaa40bbb5b3 │
│ Author fintohaps z6Mkire…SQZ3voM │
│ Head c20685b78f10eeeb0795ca4826e6829a582b7e75 │
│ Base 03bbe52417f131ec721a7c1cc57185019f0298a3 │
│ Target master │
│ Branches patch/05c753c │
│ Commits ahead 1, behind 556 │
│ Status merged │
│ │
│ Report: <https://www.cve.org/CVERecord?id=CVE-2026-25727> │
│ │
│ The `time` crate was a transitivie dependency of `human-panic`. │
│ Updating `human-panic` to 2.0.6 removes the `plist`, and in turn, │
│ `time` dependencies. │
├─────────────────────────────────────────────────────────────────────────────────┤
│ c20685b CVE-2026-25727 │
├─────────────────────────────────────────────────────────────────────────────────┤
│ ● Revision 05c753c @ 03bbe52..c20685b by fintohaps z6Mkire…SQZ3voM 6 months ago │
│ ↑ Revision b0c7cb2 @ 31607cf..c06b00e by lorenz z6MkkPv…WX5sTEz 6 months ago │
│ └─ ✓ merged by lorenz z6MkkPv…WX5sTEz │
╰─────────────────────────────────────────────────────────────────────────────────╯
commit c20685b78f10eeeb0795ca4826e6829a582b7e75
Author: Fintan Halpenny <fintan.halpenny@gmail.com>
Date: Wed Feb 11 16:12:51 2026 +0000
CVE-2026-25727
Report: <https://www.cve.org/CVERecord?id=CVE-2026-25727>
The `time` crate was a transitivie dependency of `human-panic`.
Updating `human-panic` to 2.0.6 removes the `plist`, and in turn,
`time` dependencies.
diff --git a/Cargo.lock b/Cargo.lock
index d571a626a..6db512ee3 100644
--- a/Cargo.lock
+++ b/Cargo.lock
@@ -4,9 +4,9 @@ version = 4
[[package]]
name = "addr2line"
-version = "0.24.2"
+version = "0.25.1"
source = "registry+https://github.com/rust-lang/crates.io-index"
-checksum = "dfbe277e56a376000877090da837660b4427aad530e3028d44e0bffe4f89a1c1"
+checksum = "1b5d307320b3181d6d7954e663bd7c774a838b8220fe0593c86d9fb09f498b4b"
dependencies = [
"gimli",
]
@@ -136,23 +136,24 @@ dependencies = [
[[package]]
name = "anstream"
-version = "0.6.13"
+version = "0.6.21"
source = "registry+https://github.com/rust-lang/crates.io-index"
-checksum = "d96bd03f33fe50a863e394ee9718a706f988b9079b20c3784fb726e7678b62fb"
+checksum = "43d5b281e737544384e969a5ccad3f1cdd24b48086a0fc1b2a5262a26b8f4f4a"
dependencies = [
"anstyle",
"anstyle-parse",
"anstyle-query",
"anstyle-wincon",
"colorchoice",
+ "is_terminal_polyfill",
"utf8parse",
]
[[package]]
name = "anstyle"
-version = "1.0.11"
+version = "1.0.13"
source = "registry+https://github.com/rust-lang/crates.io-index"
-checksum = "862ed96ca487e809f1c8e5a8447f6ee2cf102f846893800b20cebdf541fc6bbd"
+checksum = "5192cca8006f1fd4f7237516f40fa183bb07f8fbdfedaa0036de5ea9b0b45e78"
[[package]]
name = "anstyle-parse"
@@ -174,12 +175,13 @@ dependencies = [
[[package]]
name = "anstyle-wincon"
-version = "3.0.2"
+version = "3.0.11"
source = "registry+https://github.com/rust-lang/crates.io-index"
-checksum = "1cd54b81ec8d6180e24654d0b371ad22fc3dd083b6ff8ba325b72e00c87660a7"
+checksum = "291e6a250ff86cd4a820112fb8898808a366d8f9f58ce16d1f538353ad55747d"
dependencies = [
"anstyle",
- "windows-sys 0.52.0",
+ "once_cell_polyfill",
+ "windows-sys 0.60.2",
]
[[package]]
@@ -208,9 +210,9 @@ checksum = "f1fdabc7756949593fe60f30ec81974b613357de856987752631dea1e3394c80"
[[package]]
name = "backtrace"
-version = "0.3.75"
+version = "0.3.76"
source = "registry+https://github.com/rust-lang/crates.io-index"
-checksum = "6806a6321ec58106fea15becdad98371e28d92ccbc7c8f1b3b6dd724fe8f1002"
+checksum = "bb531853791a215d7c62a30daf0dde835f381ab5de4589cfe7c649d2cbe92bd6"
dependencies = [
"addr2line",
"cfg-if",
@@ -218,7 +220,7 @@ dependencies = [
"miniz_oxide",
"object",
"rustc-demangle",
- "windows-targets 0.52.6",
+ "windows-link 0.2.1",
]
[[package]]
@@ -745,15 +747,6 @@ dependencies = [
"zeroize",
]
-[[package]]
-name = "deranged"
-version = "0.4.0"
-source = "registry+https://github.com/rust-lang/crates.io-index"
-checksum = "9c9e6a11ca8224451684bc0d7d5a7adbf8f2fd6887261a1cfc3c0432f9d4068e"
-dependencies = [
- "powerfmt",
-]
-
[[package]]
name = "derive_more"
version = "2.0.1"
@@ -1124,9 +1117,9 @@ dependencies = [
[[package]]
name = "gimli"
-version = "0.31.1"
+version = "0.32.3"
source = "registry+https://github.com/rust-lang/crates.io-index"
-checksum = "07e28edb80900c19c28f1072f2e8aeca7fa06b23cd4169cefe1af5aa3260783f"
+checksum = "e629b9b98ef3dd8afe6ca2bd0f89306cec16d43d907889945bc5d6687f2f13c7"
[[package]]
name = "git-ref-format"
@@ -1742,16 +1735,16 @@ dependencies = [
[[package]]
name = "human-panic"
-version = "2.0.3"
+version = "2.0.6"
source = "registry+https://github.com/rust-lang/crates.io-index"
-checksum = "ac63a746b187e95d51fe16850eb04d1cfef203f6af98e6c405a6f262ad3df00a"
+checksum = "075e8747af11abcff07d55d98297c9c6c70eb5d6365b25e7b12f02e484935191"
dependencies = [
"anstream",
"anstyle",
"backtrace",
- "os_info",
"serde",
"serde_derive",
+ "sysinfo",
"toml",
"uuid",
]
@@ -1980,6 +1973,12 @@ dependencies = [
"libc",
]
+[[package]]
+name = "is_terminal_polyfill"
+version = "1.70.2"
+source = "registry+https://github.com/rust-lang/crates.io-index"
+checksum = "a6cb138bb79a146c1bd460005623e142ef0181e3d0219cb493e02f7d08a35695"
+
[[package]]
name = "itertools"
version = "0.14.0"
@@ -2316,6 +2315,15 @@ version = "0.3.0"
source = "registry+https://github.com/rust-lang/crates.io-index"
checksum = "61807f77802ff30975e01f4f071c8ba10c022052f98b3294119f3e615d13e5be"
+[[package]]
+name = "ntapi"
+version = "0.4.3"
+source = "registry+https://github.com/rust-lang/crates.io-index"
+checksum = "c3b335231dfd352ffb0f8017f3b6027a4917f7df785ea2143d8af2adc66980ae"
+dependencies = [
+ "winapi",
+]
+
[[package]]
name = "nu-ansi-term"
version = "0.46.0"
@@ -2382,12 +2390,6 @@ dependencies = [
"num-traits",
]
-[[package]]
-name = "num-conv"
-version = "0.1.0"
-source = "registry+https://github.com/rust-lang/crates.io-index"
-checksum = "51d515d32fb182ee37cda2ccdcb92950d6a3c2893aa280e540671c2cd0f3b1d9"
-
[[package]]
name = "num-integer"
version = "0.1.46"
@@ -2429,11 +2431,30 @@ dependencies = [
"libm",
]
+[[package]]
+name = "objc2-core-foundation"
+version = "0.3.2"
+source = "registry+https://github.com/rust-lang/crates.io-index"
+checksum = "2a180dd8642fa45cdb7dd721cd4c11b1cadd4929ce112ebd8b9f5803cc79d536"
+dependencies = [
+ "bitflags 2.9.1",
+]
+
+[[package]]
+name = "objc2-io-kit"
+version = "0.3.2"
+source = "registry+https://github.com/rust-lang/crates.io-index"
+checksum = "33fafba39597d6dc1fb709123dfa8289d39406734be322956a69f0931c73bb15"
+dependencies = [
+ "libc",
+ "objc2-core-foundation",
+]
+
[[package]]
name = "object"
-version = "0.36.7"
+version = "0.37.3"
source = "registry+https://github.com/rust-lang/crates.io-index"
-checksum = "62948e14d923ea95ea2c7c86c71013138b66525b86bdc08d2dcc262bdb497b87"
+checksum = "ff76201f031d8863c38aa7f905eca4f53abbfa15f609db4277d44cd8938f33fe"
dependencies = [
"memchr",
]
@@ -2445,22 +2466,16 @@ source = "registry+https://github.com/rust-lang/crates.io-index"
checksum = "42f5e15c9953c5e4ccceeb2e7382a716482c34515315f7b03532b8b4e8393d2d"
[[package]]
-name = "opaque-debug"
-version = "0.3.1"
+name = "once_cell_polyfill"
+version = "1.70.2"
source = "registry+https://github.com/rust-lang/crates.io-index"
-checksum = "c08d65885ee38876c4f86fa503fb49d7b507c2b62552df7c70b2fce627e06381"
+checksum = "384b8ab6d37215f3c5301a95a4accb5d64aa607f1fcb26a11b5303878451b4fe"
[[package]]
-name = "os_info"
-version = "3.12.0"
+name = "opaque-debug"
+version = "0.3.1"
source = "registry+https://github.com/rust-lang/crates.io-index"
-checksum = "d0e1ac5fde8d43c34139135df8ea9ee9465394b2d8d20f032d38998f64afffc3"
-dependencies = [
- "log",
- "plist",
- "serde",
- "windows-sys 0.52.0",
-]
+checksum = "c08d65885ee38876c4f86fa503fb49d7b507c2b62552df7c70b2fce627e06381"
[[package]]
name = "outref"
@@ -2532,7 +2547,7 @@ dependencies = [
"libc",
"redox_syscall 0.5.18",
"smallvec",
- "windows-link",
+ "windows-link 0.2.1",
]
[[package]]
@@ -2617,19 +2632,6 @@ version = "0.3.30"
source = "registry+https://github.com/rust-lang/crates.io-index"
checksum = "d231b230927b5e4ad203db57bbcbee2802f6bce620b1e4a9024a07d94e2907ec"
-[[package]]
-name = "plist"
-version = "1.7.4"
-source = "registry+https://github.com/rust-lang/crates.io-index"
-checksum = "3af6b589e163c5a788fab00ce0c0366f6efbb9959c2f9874b224936af7fce7e1"
-dependencies = [
- "base64 0.22.1",
- "indexmap",
- "quick-xml",
- "serde",
- "time",
-]
-
[[package]]
name = "poly1305"
version = "0.8.0"
@@ -2668,12 +2670,6 @@ dependencies = [
"portable-atomic",
]
-[[package]]
-name = "powerfmt"
-version = "0.2.0"
-source = "registry+https://github.com/rust-lang/crates.io-index"
-checksum = "439ee305def115ba05938db6eb1644ff94165c5ab5e9420d1c1bcedbba909391"
-
[[package]]
name = "ppv-lite86"
version = "0.2.17"
@@ -2784,15 +2780,6 @@ version = "1.2.3"
source = "registry+https://github.com/rust-lang/crates.io-index"
checksum = "a1d01941d82fa2ab50be1e79e6714289dd7cde78eba4c074bc5a4374f650dfe0"
-[[package]]
-name = "quick-xml"
-version = "0.38.1"
-source = "registry+https://github.com/rust-lang/crates.io-index"
-checksum = "9845d9dccf565065824e69f9f235fafba1587031eda353c1f1561cd6a6be78f4"
-dependencies = [
- "memchr",
-]
-
[[package]]
name = "quote"
version = "1.0.41"
@@ -3565,10 +3552,11 @@ dependencies = [
[[package]]
name = "serde"
-version = "1.0.219"
+version = "1.0.228"
source = "registry+https://github.com/rust-lang/crates.io-index"
-checksum = "5f0e2c6ed6606019b4e29e69dbaba95b11854410e5347d525002456dbbb786b6"
+checksum = "9a8e94ea7f378bd32cbbd37198a4a91436180c5bb472411e48b5ec2e2124ae9e"
dependencies = [
+ "serde_core",
"serde_derive",
]
@@ -3583,11 +3571,20 @@ dependencies = [
"typeid",
]
+[[package]]
+name = "serde_core"
+version = "1.0.228"
+source = "registry+https://github.com/rust-lang/crates.io-index"
+checksum = "41d385c7d4ca58e59fc732af25c3983b67ac852c1a25000afe1175de458b67ad"
+dependencies = [
+ "serde_derive",
+]
+
[[package]]
name = "serde_derive"
-version = "1.0.219"
+version = "1.0.228"
source = "registry+https://github.com/rust-lang/crates.io-index"
-checksum = "5b0276cf7f2c73365f7157c8123c21cd9a50fbbd844757af28ca1f5925fc2a00"
+checksum = "d540f220d3187173da220f885ab66608367b6574e925011a9353e4badda91d79"
dependencies = [
"proc-macro2",
"quote",
@@ -3629,11 +3626,11 @@ dependencies = [
[[package]]
name = "serde_spanned"
-version = "1.0.0"
+version = "1.0.4"
source = "registry+https://github.com/rust-lang/crates.io-index"
-checksum = "40734c41988f7306bb04f0ecf60ec0f3f1caa34290e4e8ea471dcd3346483b83"
+checksum = "f8bbf91e5a4d6315eee45e704372590b30e260ee83af6639d64557f51b067776"
dependencies = [
- "serde",
+ "serde_core",
]
[[package]]
@@ -4079,6 +4076,20 @@ dependencies = [
"syn 2.0.106",
]
+[[package]]
+name = "sysinfo"
+version = "0.37.2"
+source = "registry+https://github.com/rust-lang/crates.io-index"
+checksum = "16607d5caffd1c07ce073528f9ed972d88db15dd44023fa57142963be3feb11f"
+dependencies = [
+ "libc",
+ "memchr",
+ "ntapi",
+ "objc2-core-foundation",
+ "objc2-io-kit",
+ "windows 0.61.3",
+]
+
[[package]]
name = "systemd-journal-logger"
version = "2.2.2"
@@ -4184,37 +4195,6 @@ dependencies = [
"cfg-if",
]
-[[package]]
-name = "time"
-version = "0.3.41"
-source = "registry+https://github.com/rust-lang/crates.io-index"
-checksum = "8a7619e19bc266e0f9c5e6686659d394bc57973859340060a69221e57dbc0c40"
-dependencies = [
- "deranged",
- "itoa",
- "num-conv",
- "powerfmt",
- "serde",
- "time-core",
- "time-macros",
-]
-
-[[package]]
-name = "time-core"
-version = "0.1.4"
-source = "registry+https://github.com/rust-lang/crates.io-index"
-checksum = "c9e9a38711f559d9e3ce1cdb06dd7c5b8ea546bc90052da6d06bb76da74bb07c"
-
-[[package]]
-name = "time-macros"
-version = "0.2.22"
-source = "registry+https://github.com/rust-lang/crates.io-index"
-checksum = "3526739392ec93fd8b359c8e98514cb3e8e021beb4e5f597b00a0221f8ed8a49"
-dependencies = [
- "num-conv",
- "time-core",
-]
-
[[package]]
name = "timeago"
version = "0.4.2"
@@ -4264,11 +4244,11 @@ dependencies = [
[[package]]
name = "toml"
-version = "0.9.5"
+version = "0.9.12+spec-1.1.0"
source = "registry+https://github.com/rust-lang/crates.io-index"
-checksum = "75129e1dc5000bfbaa9fee9d1b21f974f9fbad9daec557a521ee6e080825f6e8"
+checksum = "cf92845e79fc2e2def6a5d828f0801e29a2f8acc037becc5ab08595c7d5e9863"
dependencies = [
- "serde",
+ "serde_core",
"serde_spanned",
"toml_datetime",
"toml_writer",
@@ -4276,18 +4256,18 @@ dependencies = [
[[package]]
name = "toml_datetime"
-version = "0.7.0"
+version = "0.7.5+spec-1.1.0"
source = "registry+https://github.com/rust-lang/crates.io-index"
-checksum = "bade1c3e902f58d73d3f294cd7f20391c1cb2fbcb643b73566bc773971df91e3"
+checksum = "92e1cfed4a3038bc5a127e35a2d360f145e1f4b971b551a2ba5fd7aedf7e1347"
dependencies = [
- "serde",
+ "serde_core",
]
[[package]]
name = "toml_writer"
-version = "1.0.2"
+version = "1.0.6+spec-1.1.0"
source = "registry+https://github.com/rust-lang/crates.io-index"
-checksum = "fcc842091f2def52017664b53082ecbbeb5c7731092bad69d2c63050401dfd64"
+checksum = "ab16f14aed21ee8bfd8ec22513f7287cd4a91aa92e44edfe2c17ddd004e92607"
[[package]]
name = "tracing"
@@ -4601,17 +4581,19 @@ checksum = "b6c140620e7ffbb22c2dee59cafe6084a59b5ffc27a8859a5f0d494b5d52b6be"
[[package]]
name = "utf8parse"
-version = "0.2.1"
+version = "0.2.2"
source = "registry+https://github.com/rust-lang/crates.io-index"
-checksum = "711b9620af191e0cdc7468a8d14e709c3dcdb115b36f838e601583af800a370a"
+checksum = "06abde3611657adf66d383f00b093d7faecc7fa57071cce2578660c9f1010821"
[[package]]
name = "uuid"
-version = "1.16.0"
+version = "1.20.0"
source = "registry+https://github.com/rust-lang/crates.io-index"
-checksum = "458f7a779bf54acc9f347480ac654f68407d3aab21269a6e3c9f922acd9e2da9"
+checksum = "ee48d38b119b0cd71fe4141b30f5ba9c7c5d9f4e7a3a8b4a674e4b6ef789976f"
dependencies = [
"getrandom 0.3.3",
+ "js-sys",
+ "wasm-bindgen",
]
[[package]]
@@ -4828,16 +4810,38 @@ dependencies = [
"windows-targets 0.52.6",
]
+[[package]]
+name = "windows"
+version = "0.61.3"
+source = "registry+https://github.com/rust-lang/crates.io-index"
+checksum = "9babd3a767a4c1aef6900409f85f5d53ce2544ccdfaa86dad48c91782c6d6893"
+dependencies = [
+ "windows-collections 0.2.0",
+ "windows-core 0.61.2",
+ "windows-future 0.2.1",
+ "windows-link 0.1.3",
+ "windows-numerics 0.2.0",
+]
+
[[package]]
name = "windows"
version = "0.62.2"
source = "registry+https://github.com/rust-lang/crates.io-index"
checksum = "527fadee13e0c05939a6a05d5bd6eec6cd2e3dbd648b9f8e447c6518133d8580"
dependencies = [
- "windows-collections",
+ "windows-collections 0.3.2",
"windows-core 0.62.2",
- "windows-future",
- "windows-numerics",
+ "windows-future 0.3.2",
+ "windows-numerics 0.3.1",
+]
+
+[[package]]
+name = "windows-collections"
+version = "0.2.0"
+source = "registry+https://github.com/rust-lang/crates.io-index"
+checksum = "3beeceb5e5cfd9eb1d76b381630e82c4241ccd0d27f1a39ed41b2760b255c5e8"
+dependencies = [
+ "windows-core 0.61.2",
]
[[package]]
@@ -4871,6 +4875,19 @@ dependencies = [
"windows-targets 0.52.6",
]
+[[package]]
+name = "windows-core"
+version = "0.61.2"
+source = "registry+https://github.com/rust-lang/crates.io-index"
+checksum = "c0fdd3ddb90610c7638aa2b3a3ab2904fb9e5cdbecc643ddb3647212781c4ae3"
+dependencies = [
+ "windows-implement 0.60.2",
+ "windows-interface 0.59.3",
+ "windows-link 0.1.3",
+ "windows-result 0.3.4",
+ "windows-strings 0.4.2",
+]
+
[[package]]
name = "windows-core"
version = "0.62.2"
@@ -4879,11 +4896,22 @@ checksum = "b8e83a14d34d0623b51dce9581199302a221863196a1dde71a7663a4c2be9deb"
dependencies = [
"windows-implement 0.60.2",
"windows-interface 0.59.3",
- "windows-link",
+ "windows-link 0.2.1",
"windows-result 0.4.1",
"windows-strings 0.5.1",
]
+[[package]]
+name = "windows-future"
+version = "0.2.1"
+source = "registry+https://github.com/rust-lang/crates.io-index"
+checksum = "fc6a41e98427b19fe4b73c550f060b59fa592d7d686537eebf9385621bfbad8e"
+dependencies = [
+ "windows-core 0.61.2",
+ "windows-link 0.1.3",
+ "windows-threading 0.1.0",
+]
+
[[package]]
name = "windows-future"
version = "0.3.2"
@@ -4891,8 +4919,8 @@ source = "registry+https://github.com/rust-lang/crates.io-index"
checksum = "e1d6f90251fe18a279739e78025bd6ddc52a7e22f921070ccdc67dde84c605cb"
dependencies = [
"windows-core 0.62.2",
- "windows-link",
- "windows-threading",
+ "windows-link 0.2.1",
+ "windows-threading 0.2.1",
]
[[package]]
@@ -4939,12 +4967,28 @@ dependencies = [
"syn 2.0.106",
]
+[[package]]
+name = "windows-link"
+version = "0.1.3"
+source = "registry+https://github.com/rust-lang/crates.io-index"
+checksum = "5e6ad25900d524eaabdbbb96d20b4311e1e7ae1699af4fb28c17ae66c80d798a"
+
[[package]]
name = "windows-link"
version = "0.2.1"
source = "registry+https://github.com/rust-lang/crates.io-index"
checksum = "f0805222e57f7521d6a62e36fa9163bc891acd422f971defe97d64e70d0a4fe5"
+[[package]]
+name = "windows-numerics"
+version = "0.2.0"
+source = "registry+https://github.com/rust-lang/crates.io-index"
+checksum = "9150af68066c4c5c07ddc0ce30421554771e528bde427614c61038bc2c92c2b1"
+dependencies = [
+ "windows-core 0.61.2",
+ "windows-link 0.1.3",
+]
+
[[package]]
name = "windows-numerics"
version = "0.3.1"
@@ -4952,7 +4996,7 @@ source = "registry+https://github.com/rust-lang/crates.io-index"
checksum = "6e2e40844ac143cdb44aead537bbf727de9b044e107a0f1220392177d15b0f26"
dependencies = [
"windows-core 0.62.2",
- "windows-link",
+ "windows-link 0.2.1",
]
[[package]]
@@ -4964,13 +5008,22 @@ dependencies = [
"windows-targets 0.52.6",
]
+[[package]]
+name = "windows-result"
+version = "0.3.4"
+source = "registry+https://github.com/rust-lang/crates.io-index"
+checksum = "56f42bd332cc6c8eac5af113fc0c1fd6a8fd2aa08a0119358686e5160d0586c6"
+dependencies = [
+ "windows-link 0.1.3",
+]
+
[[package]]
name = "windows-result"
version = "0.4.1"
source = "registry+https://github.com/rust-lang/crates.io-index"
checksum = "7781fa89eaf60850ac3d2da7af8e5242a5ea78d1a11c49bf2910bb5a73853eb5"
dependencies = [
- "windows-link",
+ "windows-link 0.2.1",
]
[[package]]
@@ -4983,13 +5036,22 @@ dependencies = [
"windows-targets 0.52.6",
]
+[[package]]
+name = "windows-strings"
+version = "0.4.2"
+source = "registry+https://github.com/rust-lang/crates.io-index"
+checksum = "56e6c93f3a0c3b36176cb1327a4958a0353d5d166c2a35cb268ace15e91d3b57"
+dependencies = [
+ "windows-link 0.1.3",
+]
+
[[package]]
name = "windows-strings"
version = "0.5.1"
source = "registry+https://github.com/rust-lang/crates.io-index"
checksum = "7837d08f69c77cf6b07689544538e017c1bfcf57e34b4c0ff58e6c2cd3b37091"
dependencies = [
- "windows-link",
+ "windows-link 0.2.1",
]
[[package]]
@@ -5075,13 +5137,22 @@ dependencies = [
"windows_x86_64_msvc 0.53.0",
]
+[[package]]
+name = "windows-threading"
+version = "0.1.0"
+source = "registry+https://github.com/rust-lang/crates.io-index"
+checksum = "b66463ad2e0ea3bbf808b7f1d371311c80e115c0b71d60efc142cafbcfb057a6"
+dependencies = [
+ "windows-link 0.1.3",
+]
+
[[package]]
name = "windows-threading"
version = "0.2.1"
source = "registry+https://github.com/rust-lang/crates.io-index"
checksum = "3949bd5b99cafdf1c7ca86b43ca564028dfe27d66958f2470940f73d86d75b37"
dependencies = [
- "windows-link",
+ "windows-link 0.2.1",
]
[[package]]
diff --git a/Cargo.toml b/Cargo.toml
index 449d8de1e..02ab75716 100644
--- a/Cargo.toml
+++ b/Cargo.toml
@@ -30,7 +30,7 @@ dunce = "1.0.5"
fastrand = { version = "2.0.0", default-features = false }
git2 = { version = "0.19.0", default-features = false, features = ["vendored-libgit2"] }
gix-hash = { version = "0.19.0", default-features = false }
-human-panic = "2"
+human-panic = "2.0.6"
itertools = "0.14"
lexopt = "0.3.0"
libc = "0.2.137"
Exit code: 0
shell: 'export RUSTDOCFLAGS=''-D warnings'' cargo --version rustc --version cargo fmt --check cargo clippy --all-targets --workspace -- --deny warnings cargo build --all-targets --workspace cargo doc --workspace --no-deps --all-features cargo test --workspace --no-fail-fast '
Commands:
$ podman run --name 477f61bc-11d5-4481-be7f-441c8572a73c -v /opt/radcis/ci.rad.levitte.org/cci/state/477f61bc-11d5-4481-be7f-441c8572a73c/s:/477f61bc-11d5-4481-be7f-441c8572a73c/s:ro -v /opt/radcis/ci.rad.levitte.org/cci/state/477f61bc-11d5-4481-be7f-441c8572a73c/w:/477f61bc-11d5-4481-be7f-441c8572a73c/w -w /477f61bc-11d5-4481-be7f-441c8572a73c/w -v /opt/radcis/ci.rad.levitte.org/.radicle:/${id}/.radicle:ro -e RAD_HOME=/${id}/.radicle rust:trixie bash /477f61bc-11d5-4481-be7f-441c8572a73c/s/script.sh
+ export 'RUSTDOCFLAGS=-D warnings'
+ RUSTDOCFLAGS='-D warnings'
+ cargo --version
info: syncing channel updates for '1.90-x86_64-unknown-linux-gnu'
info: latest update on 2025-09-18, rust version 1.90.0 (1159e78c4 2025-09-14)
info: downloading component 'cargo'
info: downloading component 'clippy'
info: downloading component 'rust-docs'
info: downloading component 'rust-src'
info: downloading component 'rust-std'
info: downloading component 'rustc'
info: downloading component 'rustfmt'
info: installing component 'cargo'
info: installing component 'clippy'
info: installing component 'rust-docs'
info: installing component 'rust-src'
info: installing component 'rust-std'
info: installing component 'rustc'
info: installing component 'rustfmt'
cargo 1.90.0 (840b83a10 2025-07-30)
+ rustc --version
rustc 1.90.0 (1159e78c4 2025-09-14)
+ cargo fmt --check
+ cargo clippy --all-targets --workspace -- --deny warnings
Updating crates.io index
Downloading crates ...
Downloaded aead v0.5.2
Downloaded adler2 v2.0.0
Downloaded amplify_derive v4.0.0
Downloaded addr2line v0.25.1
Downloaded aho-corasick v1.1.3
Downloaded fnv v1.0.7
Downloaded gix-revision v0.35.0
Downloaded gix-quote v0.6.0
Downloaded gix-revwalk v0.21.0
Downloaded gix-refspec v0.31.0
Downloaded matchers v0.1.0
Downloaded log v0.4.27
Downloaded itoa v1.0.11
Downloaded lexopt v0.3.0
Downloaded indexmap v2.2.6
Downloaded lazy_static v1.5.0
Downloaded ghash v0.5.1
Downloaded faster-hex v0.10.0
Downloaded maybe-async v0.2.10
Downloaded litrs v0.4.1
Downloaded gix-hash v0.19.0
Downloaded nonempty v0.9.0
Downloaded gix-utils v0.3.0
Downloaded lock_api v0.4.14
Downloaded home v0.5.9
Downloaded gix-sec v0.12.0
Downloaded keccak v0.1.5
Downloaded normalize-line-endings v0.3.0
Downloaded git-ref-format-core v0.6.0
Downloaded num-rational v0.4.2
Downloaded outref v0.5.2
Downloaded percent-encoding v2.3.1
Downloaded num-integer v0.1.46
Downloaded radicle-std-ext v0.2.0
Downloaded overload v0.1.1
Downloaded rand_chacha v0.3.1
Downloaded quick-error v1.2.3
Downloaded ref-cast-impl v1.0.24
Downloaded pkcs8 v0.10.2
Downloaded scrypt v0.11.0
Downloaded same-file v1.0.6
Downloaded scopeguard v1.2.0
Downloaded salsa20 v0.10.2
Downloaded rand_xorshift v0.4.0
Downloaded serde_fmt v1.0.3
Downloaded miniz_oxide v0.8.8
Downloaded strsim v0.11.1
Downloaded serde_spanned v1.0.4
Downloaded sqlite v0.32.0
Downloaded sval_ref v2.14.1
Downloaded signal-hook-registry v1.4.5
Downloaded sem_safe v0.2.0
Downloaded sval_json v2.14.1
Downloaded serde_derive_internals v0.29.1
Downloaded test-log-macros v0.2.18
Downloaded tinyvec_macros v0.1.1
Downloaded sval_serde v2.14.1
Downloaded sval v2.14.1
Downloaded unicode-display-width v0.3.0
Downloaded synstructure v0.13.1
Downloaded memchr v2.7.2
Downloaded tree-sitter-json v0.24.8
Downloaded thiserror v1.0.69
Downloaded value-bag-sval2 v1.11.1
Downloaded unit-prefix v0.5.1
Downloaded timeago v0.4.2
Downloaded wait-timeout v0.2.1
Downloaded yoke-derive v0.7.5
Downloaded version_check v0.9.4
Downloaded tempfile v3.23.0
Downloaded xattr v1.3.1
Downloaded rand v0.8.5
Downloaded zerofrom v0.1.6
Downloaded signal-hook v0.3.18
Downloaded zerovec-derive v0.10.3
Downloaded tar v0.4.40
Downloaded zeroize v1.7.0
Downloaded zerofrom-derive v0.1.6
Downloaded yansi v0.5.1
Downloaded unicode-ident v1.0.12
Downloaded writeable v0.5.5
Downloaded idna v1.0.3
Downloaded schemars v1.0.4
Downloaded value-bag v1.11.1
Downloaded url v2.5.4
Downloaded ssh-key v0.6.6
Downloaded unicode-segmentation v1.11.0
Downloaded tree-sitter-go v0.23.4
Downloaded tracing v0.1.41
Downloaded p521 v0.13.3
Downloaded zerovec v0.10.4
Downloaded unicode-normalization v0.1.23
Downloaded winnow v0.7.13
Downloaded tree-sitter-python v0.23.4
Downloaded gimli v0.32.3
Downloaded tree-sitter v0.24.4
Downloaded zerocopy v0.7.35
Downloaded unicode-width v0.2.1
Downloaded zlib-rs v0.5.2
Downloaded syn v2.0.106
Downloaded vcpkg v0.2.15
Downloaded regex-syntax v0.8.5
Downloaded tree-sitter-rust v0.23.2
Downloaded object v0.37.3
Downloaded tree-sitter-md v0.3.2
Downloaded rustix v0.38.34
Downloaded sysinfo v0.37.2
Downloaded tree-sitter-bash v0.23.3
Downloaded rustix v1.0.7
Downloaded tree-sitter-c v0.23.2
Downloaded tracing-subscriber v0.3.19
Downloaded regex-syntax v0.6.29
Downloaded p384 v0.13.0
Downloaded bstr v1.12.0
Downloaded bloomy v1.2.0
Downloaded tree-sitter-ruby v0.23.1
Downloaded syn v1.0.109
Downloaded regex-automata v0.4.9
Downloaded regex v1.11.1
Downloaded icu_properties_data v1.5.1
Downloaded proptest v1.9.0
Downloaded jiff v0.2.15
Downloaded git2 v0.19.0
Downloaded serde_json v1.0.140
Downloaded itertools v0.14.0
Downloaded linux-raw-sys v0.4.13
Downloaded tracing-core v0.1.34
Downloaded tree-sitter-typescript v0.23.2
Downloaded sha1-checked v0.10.0
Downloaded libc v0.2.174
Downloaded tokio v1.47.1
Downloaded radicle-surf v0.26.0
Downloaded prodash v30.0.1
Downloaded portable-atomic v1.11.0
Downloaded num-bigint-dig v0.8.4
Downloaded sha3 v0.10.8
Downloaded hashbrown v0.15.5
Downloaded uuid v1.20.0
Downloaded toml v0.9.12+spec-1.1.0
Downloaded serde v1.0.228
Downloaded mio v0.8.11
Downloaded hashbrown v0.14.3
Downloaded rand v0.9.2
Downloaded typenum v1.17.0
Downloaded rsa v0.9.6
Downloaded tree-sitter-html v0.23.2
Downloaded sharded-slab v0.1.7
Downloaded tree-sitter-css v0.23.1
Downloaded tracing-log v0.2.0
Downloaded regex-automata v0.1.10
Downloaded libm v0.2.8
Downloaded yoke v0.7.5
Downloaded vsimd v0.8.0
Downloaded socket2 v0.5.7
Downloaded snapbox v0.4.17
Downloaded similar v2.5.0
Downloaded signals_receipts v0.2.0
Downloaded num-bigint v0.4.6
Downloaded jsonschema v0.30.0
Downloaded walkdir v2.5.0
Downloaded serde_derive v1.0.228
Downloaded write16 v1.0.0
Downloaded unicode-width v0.1.11
Downloaded unarray v0.1.4
Downloaded tree-sitter-toml-ng v0.6.0
Downloaded toml_writer v1.0.6+spec-1.1.0
Downloaded tinyvec v1.6.0
Downloaded tinystr v0.7.6
Downloaded thiserror-impl v2.0.17
Downloaded smallvec v1.15.1
Downloaded serde_core v1.0.228
Downloaded jiff-static v0.2.15
Downloaded uuid-simd v0.8.0
Downloaded toml_datetime v0.7.5+spec-1.1.0
Downloaded thread_local v1.1.9
Downloaded thiserror-impl v1.0.69
Downloaded thiserror v2.0.17
Downloaded base64 v0.21.7
Downloaded inquire v0.7.5
Downloaded gix-pack v0.60.0
Downloaded emojis v0.6.4
Downloaded cyphernet v0.5.2
Downloaded clap_builder v4.5.44
Downloaded value-bag-serde1 v1.11.1
Downloaded utf8parse v0.2.2
Downloaded utf8_iter v1.0.4
Downloaded utf16_iter v1.0.5
Downloaded universal-hash v0.5.1
Downloaded sval_nested v2.14.1
Downloaded spin v0.9.8
Downloaded pretty_assertions v1.4.0
Downloaded systemd-journal-logger v2.2.2
Downloaded streaming-iterator v0.1.9
Downloaded ssh-cipher v0.2.0
Downloaded mio v1.0.4
Downloaded crossterm v0.25.0
Downloaded tree-sitter-highlight v0.24.4
Downloaded proc-macro2 v1.0.101
Downloaded sval_buffer v2.14.1
Downloaded typeid v1.0.3
Downloaded tree-sitter-language v0.1.2
Downloaded sval_fmt v2.14.1
Downloaded stable_deref_trait v1.2.0
Downloaded ssh-encoding v0.2.0
Downloaded spki v0.7.3
Downloaded ryu v1.0.17
Downloaded primeorder v0.13.6
Downloaded structured-logger v1.0.4
Downloaded derive_more-impl v2.0.1
Downloaded referencing v0.30.0
Downloaded test-log v0.2.18
Downloaded rustc-demangle v0.1.26
Downloaded p256 v0.13.2
Downloaded gix-transport v0.48.0
Downloaded subtle v2.5.0
Downloaded siphasher v0.3.11
Downloaded schemars_derive v1.0.4
Downloaded crossbeam-channel v0.5.15
Downloaded num-traits v0.2.19
Downloaded serde-untagged v0.1.7
Downloaded sec1 v0.7.3
Downloaded rusty-fork v0.3.1
Downloaded num-complex v0.4.6
Downloaded sval_dynamic v2.14.1
Downloaded sqlite3-sys v0.15.2
Downloaded snapbox-macros v0.3.8
Downloaded siphasher v1.0.1
Downloaded signature v2.2.0
Downloaded sha1 v0.10.6
Downloaded polyval v0.6.2
Downloaded icu_normalizer_data v1.5.1
Downloaded socks5-client v0.4.1
Downloaded signature v1.6.4
Downloaded sqlite3-src v0.5.1
Downloaded signal-hook-mio v0.2.4
Downloaded shlex v1.3.0
Downloaded shell-words v1.1.0
Downloaded sha2 v0.10.8
Downloaded proc-macro-error2 v2.0.1
Downloaded parking_lot_core v0.9.12
Downloaded heapless v0.8.0
Downloaded gix-diff v0.53.0
Downloaded arc-swap v1.7.1
Downloaded base64 v0.22.1
Downloaded quote v1.0.41
Downloaded poly1305 v0.8.0
Downloaded phf v0.11.3
Downloaded once_cell v1.21.3
Downloaded gix-url v0.32.0
Downloaded rand_chacha v0.9.0
Downloaded pin-project-lite v0.2.16
Downloaded rfc6979 v0.4.0
Downloaded rand_core v0.9.3
Downloaded rand_core v0.6.4
Downloaded phf_shared v0.11.3
Downloaded pem-rfc7468 v0.7.0
Downloaded radicle-git-ext v0.11.0
Downloaded backtrace v0.3.76
Downloaded ref-cast v1.0.24
Downloaded qcheck v1.0.0
Downloaded ppv-lite86 v0.2.17
Downloaded pkg-config v0.3.30
Downloaded parking_lot v0.12.5
Downloaded elliptic-curve v0.13.8
Downloaded pkcs1 v0.7.5
Downloaded iana-time-zone v0.1.60
Downloaded ecdsa v0.16.9
Downloaded diff v0.1.13
Downloaded libz-rs-sys v0.5.2
Downloaded gix-commitgraph v0.29.0
Downloaded derive_more v2.0.1
Downloaded gix-odb v0.70.0
Downloaded crc32fast v1.5.0
Downloaded colored v2.1.0
Downloaded byteorder v1.5.0
Downloaded proc-macro-error-attr2 v2.0.0
Downloaded icu_locid v1.5.0
Downloaded anstream v0.6.21
Downloaded gix-features v0.43.1
Downloaded getrandom v0.2.15
Downloaded qcheck-macros v1.0.0
Downloaded pbkdf2 v0.12.2
Downloaded newline-converter v0.3.0
Downloaded num-cmp v0.1.0
Downloaded nu-ansi-term v0.46.0
Downloaded noise-framework v0.4.0
Downloaded litemap v0.7.5
Downloaded icu_locid_transform v1.5.0
Downloaded icu_collections v1.5.0
Downloaded group v0.13.0
Downloaded gix-path v0.10.20
Downloaded bytecount v0.6.8
Downloaded amplify_syn v2.0.1
Downloaded paste v1.0.15
Downloaded opaque-debug v0.3.1
Downloaded num-iter v0.1.45
Downloaded num v0.4.3
Downloaded memmap2 v0.9.8
Downloaded gix-fs v0.16.1
Downloaded getrandom v0.3.3
Downloaded const-oid v0.9.6
Downloaded bytesize v2.0.1
Downloaded anyhow v1.0.82
Downloaded anstyle v1.0.13
Downloaded icu_properties v1.5.1
Downloaded email_address v0.2.9
Downloaded cbc v0.1.2
Downloaded bitflags v2.9.1
Downloaded bit-vec v0.8.0
Downloaded gix-validate v0.10.0
Downloaded fancy-regex v0.14.0
Downloaded displaydoc v0.2.5
Downloaded ctr v0.9.2
Downloaded block-buffer v0.10.4
Downloaded erased-serde v0.4.6
Downloaded data-encoding-macro v0.1.14
Downloaded cyphergraphy v0.3.0
Downloaded base16ct v0.2.0
Downloaded multibase v0.9.1
Downloaded jobserver v0.1.31
Downloaded env_logger v0.11.8
Downloaded der v0.7.9
Downloaded cipher v0.4.4
Downloaded base64ct v1.6.0
Downloaded anstyle-query v1.0.2
Downloaded gix-config-value v0.15.1
Downloaded gix-chunk v0.4.11
Downloaded env_filter v0.1.3
Downloaded ct-codecs v1.1.1
Downloaded crypto-common v0.1.6
Downloaded gix-tempfile v18.0.0
Downloaded gix-packetline v0.19.1
Downloaded git-ref-format-macro v0.6.0
Downloaded ec25519 v0.1.0
Downloaded gix-actor v0.35.4
Downloaded dunce v1.0.5
Downloaded clap_lex v0.7.5
Downloaded gix-prompt v0.11.1
Downloaded dyn-clone v1.0.17
Downloaded inout v0.1.3
Downloaded idna_adapter v1.2.0
Downloaded icu_provider_macros v1.5.0
Downloaded heck v0.5.0
Downloaded hash32 v0.3.1
Downloaded gix-shallow v0.5.0
Downloaded gix-date v0.10.5
Downloaded gix-command v0.6.2
Downloaded git-ref-format v0.6.0
Downloaded errno v0.3.13
Downloaded cypheraddr v0.4.0
Downloaded clap v4.5.44
Downloaded block-padding v0.3.3
Downloaded bit-set v0.8.0
Downloaded icu_provider v1.5.0
Downloaded icu_locid_transform_data v1.5.1
Downloaded hmac v0.12.1
Downloaded gix-negotiate v0.21.0
Downloaded gix-lock v18.0.0
Downloaded gix-hashtable v0.9.0
Downloaded console v0.16.0
Downloaded blowfish v0.9.1
Downloaded bcrypt-pbkdf v0.10.0
Downloaded ascii v1.1.0
Downloaded icu_normalizer v1.5.0
Downloaded fastrand v2.3.0
Downloaded equivalent v1.0.1
Downloaded ed25519 v1.5.3
Downloaded digest v0.10.7
Downloaded data-encoding-macro-internal v0.1.12
Downloaded data-encoding v2.5.0
Downloaded clap_derive v4.5.41
Downloaded clap_complete v4.5.60
Downloaded chacha20poly1305 v0.10.1
Downloaded chacha20 v0.9.1
Downloaded cfg-if v1.0.0
Downloaded bytes v1.10.1
Downloaded borrow-or-share v0.2.2
Downloaded bitflags v1.3.2
Downloaded autocfg v1.2.0
Downloaded anstyle-parse v0.2.3
Downloaded crypto-bigint v0.5.5
Downloaded gix-traverse v0.47.0
Downloaded fast-glob v0.3.3
Downloaded document-features v0.2.11
Downloaded crossterm v0.29.0
Downloaded convert_case v0.7.1
Downloaded cc v1.2.2
Downloaded base32 v0.4.0
Downloaded is_terminal_polyfill v1.70.2
Downloaded gix-object v0.50.2
Downloaded cpufeatures v0.2.12
Downloaded base-x v0.2.11
Downloaded amplify_num v0.5.2
Downloaded indicatif v0.18.0
Downloaded human-panic v2.0.6
Downloaded gix-trace v0.1.13
Downloaded escargot v0.5.10
Downloaded either v1.11.0
Downloaded fraction v0.15.3
Downloaded fluent-uri v0.3.2
Downloaded ff v0.13.0
Downloaded colorchoice v1.0.0
Downloaded chrono v0.4.38
Downloaded gix-ref v0.53.1
Downloaded filetime v0.2.23
Downloaded flate2 v1.1.1
Downloaded gix-protocol v0.51.0
Downloaded fxhash v0.2.1
Downloaded form_urlencoded v1.2.1
Downloaded crossbeam-utils v0.8.19
Downloaded gix-credentials v0.30.0
Downloaded generic-array v0.14.7
Downloaded aes-gcm v0.10.3
Downloaded aes v0.8.4
Downloaded amplify v4.6.0
Downloaded ahash v0.8.11
Downloaded libgit2-sys v0.17.0+1.8.1
Downloaded linux-raw-sys v0.9.4
Downloaded libz-sys v1.1.16
Compiling libc v0.2.174
Compiling proc-macro2 v1.0.101
Compiling quote v1.0.41
Compiling unicode-ident v1.0.12
Checking cfg-if v1.0.0
Compiling version_check v0.9.4
Checking memchr v2.7.2
Compiling syn v2.0.106
Compiling shlex v1.3.0
Checking getrandom v0.2.15
Compiling jobserver v0.1.31
Compiling typenum v1.17.0
Compiling generic-array v0.14.7
Compiling cc v1.2.2
Checking rand_core v0.6.4
Compiling serde_core v1.0.228
Checking crypto-common v0.1.6
Checking regex-syntax v0.8.5
Checking aho-corasick v1.1.3
Compiling serde v1.0.228
Checking smallvec v1.15.1
Compiling thiserror v2.0.17
Checking subtle v2.5.0
Checking regex-automata v0.4.9
Checking stable_deref_trait v1.2.0
Checking once_cell v1.21.3
Checking cpufeatures v0.2.12
Checking fastrand v2.3.0
Compiling parking_lot_core v0.9.12
Checking scopeguard v1.2.0
Checking lock_api v0.4.14
Checking block-buffer v0.10.4
Checking digest v0.10.7
Checking parking_lot v0.12.5
Compiling crc32fast v1.5.0
Checking bitflags v2.9.1
Checking byteorder v1.5.0
Checking tinyvec_macros v0.1.1
Checking tinyvec v1.6.0
Checking gix-trace v0.1.13
Compiling typeid v1.0.3
Compiling serde_derive v1.0.228
Compiling thiserror-impl v2.0.17
Checking unicode-normalization v0.1.23
Checking bstr v1.12.0
Checking gix-utils v0.3.0
Checking home v0.5.9
Compiling synstructure v0.13.1
Checking zlib-rs v0.5.2
Checking gix-validate v0.10.0
Checking gix-path v0.10.20
Checking itoa v1.0.11
Compiling zerofrom-derive v0.1.6
Checking same-file v1.0.6
Checking walkdir v2.5.0
Compiling yoke-derive v0.7.5
Checking libz-rs-sys v0.5.2
Checking flate2 v1.1.1
Checking prodash v30.0.1
Checking zerofrom v0.1.6
Compiling zerovec-derive v0.10.3
Checking yoke v0.7.5
Checking gix-features v0.43.1
Compiling displaydoc v0.2.5
Compiling heapless v0.8.0
Compiling getrandom v0.3.3
Checking erased-serde v0.4.6
Checking serde_fmt v1.0.3
Checking hash32 v0.3.1
Checking zeroize v1.7.0
Checking zerovec v0.10.4
Checking value-bag-serde1 v1.11.1
Checking value-bag v1.11.1
Checking writeable v0.5.5
Compiling icu_locid_transform_data v1.5.1
Checking log v0.4.27
Checking litemap v0.7.5
Compiling pkg-config v0.3.30
Compiling rustix v1.0.7
Checking faster-hex v0.10.0
Compiling icu_provider_macros v1.5.0
Checking tinystr v0.7.6
Checking linux-raw-sys v0.9.4
Checking icu_locid v1.5.0
Compiling icu_properties_data v1.5.1
Checking sha1 v0.10.6
Checking block-padding v0.3.3
Compiling icu_normalizer_data v1.5.1
Checking inout v0.1.3
Checking icu_provider v1.5.0
Checking sha1-checked v0.10.0
Checking icu_locid_transform v1.5.0
Checking icu_collections v1.5.0
Compiling syn v1.0.109
Checking gix-hash v0.19.0
Checking cipher v0.4.4
Checking write16 v1.0.0
Checking icu_properties v1.5.1
Checking utf8_iter v1.0.4
Checking utf16_iter v1.0.5
Checking percent-encoding v2.3.1
Compiling thiserror v1.0.69
Compiling thiserror-impl v1.0.69
Checking icu_normalizer v1.5.0
Checking hashbrown v0.14.3
Checking idna_adapter v1.2.0
Checking idna v1.0.3
Checking equivalent v1.0.1
Compiling serde_json v1.0.140
Checking form_urlencoded v1.2.1
Checking indexmap v2.2.6
Checking sha2 v0.10.8
Checking ryu v1.0.17
Compiling ref-cast v1.0.24
Compiling vcpkg v0.2.15
Checking url v2.5.4
Checking tempfile v3.23.0
Compiling libz-sys v1.1.16
Compiling ref-cast-impl v1.0.24
Checking universal-hash v0.5.1
Checking opaque-debug v0.3.1
Compiling autocfg v1.2.0
Checking dyn-clone v1.0.17
Compiling amplify_syn v2.0.1
Compiling libgit2-sys v0.17.0+1.8.1
Compiling num-traits v0.2.19
Checking signature v1.6.4
Checking ed25519 v1.5.3
Compiling serde_derive_internals v0.29.1
Checking aead v0.5.2
Checking amplify_num v0.5.2
Compiling amplify_derive v4.0.0
Checking ascii v1.1.0
Checking ct-codecs v1.1.1
Compiling schemars_derive v1.0.4
Checking ec25519 v0.1.0
Checking amplify v4.6.0
Checking git-ref-format-core v0.6.0
Checking poly1305 v0.8.0
Checking chacha20 v0.9.1
Checking cyphergraphy v0.3.0
Checking polyval v0.6.2
Checking schemars v1.0.4
Compiling sqlite3-src v0.5.1
Checking hmac v0.12.1
Checking keccak v0.1.5
Checking base64ct v1.6.0
Checking sha3 v0.10.8
Checking pem-rfc7468 v0.7.0
Checking pbkdf2 v0.12.2
Checking ghash v0.5.1
Checking ctr v0.9.2
Checking aes v0.8.4
Checking rand v0.8.5
Compiling data-encoding v2.5.0
Checking base32 v0.4.0
Checking cypheraddr v0.4.0
Checking qcheck v1.0.0
Compiling data-encoding-macro-internal v0.1.12
Checking aes-gcm v0.10.3
Checking ssh-encoding v0.2.0
Checking chacha20poly1305 v0.10.1
Checking cbc v0.1.2
Checking blowfish v0.9.1
Checking bcrypt-pbkdf v0.10.0
Checking ssh-cipher v0.2.0
Checking noise-framework v0.4.0
Checking data-encoding-macro v0.1.14
Checking socks5-client v0.4.1
Compiling crossbeam-utils v0.8.19
Checking base-x v0.2.11
Checking signature v2.2.0
Checking multibase v0.9.1
Checking ssh-key v0.6.6
Checking cyphernet v0.5.2
Checking radicle-ssh v0.10.0 (/477f61bc-11d5-4481-be7f-441c8572a73c/w/crates/radicle-ssh)
Checking lazy_static v1.5.0
Checking crossbeam-channel v0.5.15
Checking jiff v0.2.15
Checking nonempty v0.9.0
Checking siphasher v1.0.1
Checking anstyle-query v1.0.2
Checking radicle-git-metadata v0.1.0 (/477f61bc-11d5-4481-be7f-441c8572a73c/w/crates/radicle-git-metadata)
Checking radicle-dag v0.10.0 (/477f61bc-11d5-4481-be7f-441c8572a73c/w/crates/radicle-dag)
Checking winnow v0.7.13
Checking hashbrown v0.15.5
Checking utf8parse v0.2.2
Checking anstyle-parse v0.2.3
Checking gix-hashtable v0.9.0
Checking radicle-git-ref-format v0.1.0 (/477f61bc-11d5-4481-be7f-441c8572a73c/w/crates/radicle-git-ref-format)
Checking gix-date v0.10.5
Checking anstyle v1.0.13
Checking iana-time-zone v0.1.60
Checking gix-actor v0.35.4
Checking base64 v0.21.7
Checking is_terminal_polyfill v1.70.2
Checking colorchoice v1.0.0
Checking gix-object v0.50.2
Checking anstream v0.6.21
Checking chrono v0.4.38
Checking colored v2.1.0
Checking radicle-localtime v0.1.0 (/477f61bc-11d5-4481-be7f-441c8572a73c/w/crates/radicle-localtime)
Checking serde-untagged v0.1.7
Checking bytesize v2.0.1
Checking memmap2 v0.9.8
Checking fast-glob v0.3.3
Checking dunce v1.0.5
Checking tree-sitter-language v0.1.2
Checking gix-chunk v0.4.11
Checking gix-fs v0.16.1
Checking gix-commitgraph v0.29.0
Checking gix-tempfile v18.0.0
Checking mio v1.0.4
Checking gix-revwalk v0.21.0
Checking gix-quote v0.6.0
Checking errno v0.3.13
Checking sem_safe v0.2.0
Checking either v1.11.0
Checking shell-words v1.1.0
Checking signals_receipts v0.2.0
Checking gix-command v0.6.2
Compiling object v0.37.3
Compiling signal-hook v0.3.18
Checking gix-lock v18.0.0
Checking gix-url v0.32.0
Checking gix-config-value v0.15.1
Checking gix-sec v0.12.0
Checking signal-hook-registry v1.4.5
Checking gimli v0.32.3
Checking adler2 v2.0.0
Compiling rustix v0.38.34
Checking miniz_oxide v0.8.8
Checking gix-prompt v0.11.1
Checking addr2line v0.25.1
Checking radicle-signals v0.11.0 (/477f61bc-11d5-4481-be7f-441c8572a73c/w/crates/radicle-signals)
Checking gix-revision v0.35.0
Checking gix-traverse v0.47.0
Checking gix-diff v0.53.0
Checking gix-packetline v0.19.1
Checking mio v0.8.11
Compiling tree-sitter v0.24.4
Compiling linux-raw-sys v0.4.13
Compiling anyhow v1.0.82
Compiling unicode-segmentation v1.11.0
Checking rustc-demangle v0.1.26
Compiling convert_case v0.7.1
Checking backtrace v0.3.76
Checking signal-hook-mio v0.2.4
Checking gix-transport v0.48.0
Checking gix-pack v0.60.0
Checking gix-refspec v0.31.0
Checking gix-credentials v0.30.0
Checking gix-ref v0.53.1
Checking gix-shallow v0.5.0
Checking gix-negotiate v0.21.0
Checking regex v1.11.1
Compiling maybe-async v0.2.10
Compiling proc-macro-error-attr2 v2.0.0
Checking arc-swap v1.7.1
Compiling portable-atomic v1.11.0
Checking gix-odb v0.70.0
Checking gix-protocol v0.51.0
Compiling proc-macro-error2 v2.0.1
Compiling xattr v1.3.1
Compiling derive_more-impl v2.0.1
Compiling filetime v0.2.23
Checking uuid v1.20.0
Checking bytes v1.10.1
Compiling litrs v0.4.1
Checking bitflags v1.3.2
Checking unicode-width v0.2.1
Checking crossterm v0.25.0
Checking console v0.16.0
Compiling document-features v0.2.11
Checking derive_more v2.0.1
Compiling tar v0.4.40
Compiling git-ref-format-macro v0.6.0
Checking sqlite3-sys v0.15.2
Checking sqlite v0.32.0
Checking radicle-crypto v0.14.0 (/477f61bc-11d5-4481-be7f-441c8572a73c/w/crates/radicle-crypto)
Checking newline-converter v0.3.0
Checking snapbox-macros v0.3.8
Checking salsa20 v0.10.2
Checking fxhash v0.2.1
Checking strsim v0.11.1
Checking unit-prefix v0.5.1
Checking clap_lex v0.7.5
Compiling heck v0.5.0
Checking siphasher v0.3.11
Checking unicode-width v0.1.11
Checking similar v2.5.0
Checking normalize-line-endings v0.3.0
Checking streaming-iterator v0.1.9
Checking bloomy v1.2.0
Compiling clap_derive v4.5.41
Checking snapbox v0.4.17
Checking inquire v0.7.5
Checking clap_builder v4.5.44
Checking indicatif v0.18.0
Compiling radicle-surf v0.26.0
Checking scrypt v0.11.0
Checking git-ref-format v0.6.0
Checking crossterm v0.29.0
Checking unicode-display-width v0.3.0
Checking systemd-journal-logger v2.2.2
Checking serde_spanned v1.0.4
Checking toml_datetime v0.7.5+spec-1.1.0
Compiling tree-sitter-ruby v0.23.1
Compiling tree-sitter-bash v0.23.3
Compiling tree-sitter-go v0.23.4
Compiling tree-sitter-python v0.23.4
Compiling tree-sitter-rust v0.23.2
Compiling tree-sitter-md v0.3.2
Compiling tree-sitter-json v0.24.8
Compiling tree-sitter-html v0.23.2
Compiling tree-sitter-toml-ng v0.6.0
Compiling tree-sitter-typescript v0.23.2
Compiling tree-sitter-c v0.23.2
Compiling tree-sitter-css v0.23.1
Checking pin-project-lite v0.2.16
Checking radicle-std-ext v0.2.0
Checking toml_writer v1.0.6+spec-1.1.0
Checking tokio v1.47.1
Checking toml v0.9.12+spec-1.1.0
Checking clap v4.5.44
Checking sysinfo v0.37.2
Compiling radicle-cli v0.17.0 (/477f61bc-11d5-4481-be7f-441c8572a73c/w/crates/radicle-cli)
Checking diff v0.1.13
Compiling radicle-node v0.16.0 (/477f61bc-11d5-4481-be7f-441c8572a73c/w/crates/radicle-node)
Checking yansi v0.5.1
Checking pretty_assertions v1.4.0
Checking human-panic v2.0.6
Checking clap_complete v4.5.60
Checking structured-logger v1.0.4
Checking radicle-systemd v0.11.0 (/477f61bc-11d5-4481-be7f-441c8572a73c/w/crates/radicle-systemd)
Checking tree-sitter-highlight v0.24.4
Checking itertools v0.14.0
Checking num-integer v0.1.46
Compiling qcheck-macros v1.0.0
Checking socket2 v0.5.7
Checking lexopt v0.3.0
Compiling escargot v0.5.10
Checking timeago v0.4.2
Checking bit-vec v0.8.0
Checking bit-set v0.8.0
Checking num-bigint v0.4.6
Checking rand_core v0.9.3
Compiling ahash v0.8.11
Checking num-iter v0.1.45
Checking num-complex v0.4.6
Checking env_filter v0.1.3
Checking borrow-or-share v0.2.2
Checking zerocopy v0.7.35
Checking fluent-uri v0.3.2
Checking num-rational v0.4.2
Checking env_logger v0.11.8
Checking phf_shared v0.11.3
Compiling test-log-macros v0.2.18
Checking wait-timeout v0.2.1
Checking num v0.4.3
Checking quick-error v1.2.3
Compiling paste v1.0.15
Checking ppv-lite86 v0.2.17
Checking vsimd v0.8.0
Checking outref v0.5.2
Checking fnv v1.0.7
Compiling radicle-remote-helper v0.14.0 (/477f61bc-11d5-4481-be7f-441c8572a73c/w/crates/radicle-remote-helper)
Checking rand_chacha v0.9.0
Checking uuid-simd v0.8.0
Checking rusty-fork v0.3.1
Checking test-log v0.2.18
Checking fraction v0.15.3
Checking phf v0.11.3
Checking referencing v0.30.0
Checking rand v0.9.2
Checking rand_xorshift v0.4.0
Checking fancy-regex v0.14.0
Checking email_address v0.2.9
Checking base64 v0.22.1
Checking num-cmp v0.1.0
Checking bytecount v0.6.8
Checking unarray v0.1.4
Checking emojis v0.6.4
Checking jsonschema v0.30.0
Checking proptest v1.9.0
Checking radicle-windows v0.1.0 (/477f61bc-11d5-4481-be7f-441c8572a73c/w/crates/radicle-windows)
Checking git2 v0.19.0
Checking radicle-oid v0.1.0 (/477f61bc-11d5-4481-be7f-441c8572a73c/w/crates/radicle-oid)
Checking radicle-git-ext v0.11.0
Checking radicle-term v0.16.0 (/477f61bc-11d5-4481-be7f-441c8572a73c/w/crates/radicle-term)
Checking radicle-cob v0.17.0 (/477f61bc-11d5-4481-be7f-441c8572a73c/w/crates/radicle-cob)
Checking radicle-core v0.1.0 (/477f61bc-11d5-4481-be7f-441c8572a73c/w/crates/radicle-core)
Checking radicle v0.20.0 (/477f61bc-11d5-4481-be7f-441c8572a73c/w/crates/radicle)
Checking radicle-fetch v0.16.0 (/477f61bc-11d5-4481-be7f-441c8572a73c/w/crates/radicle-fetch)
Checking radicle-cli-test v0.13.0 (/477f61bc-11d5-4481-be7f-441c8572a73c/w/crates/radicle-cli-test)
Checking radicle-protocol v0.4.0 (/477f61bc-11d5-4481-be7f-441c8572a73c/w/crates/radicle-protocol)
Checking radicle-schemars v0.6.0 (/477f61bc-11d5-4481-be7f-441c8572a73c/w/crates/radicle-schemars)
Finished `dev` profile [unoptimized + debuginfo] target(s) in 49.51s
+ cargo build --all-targets --workspace
Compiling libc v0.2.174
Compiling cfg-if v1.0.0
Compiling memchr v2.7.2
Compiling shlex v1.3.0
Compiling typenum v1.17.0
Compiling serde_core v1.0.228
Compiling jobserver v0.1.31
Compiling getrandom v0.2.15
Compiling generic-array v0.14.7
Compiling cc v1.2.2
Compiling rand_core v0.6.4
Compiling crypto-common v0.1.6
Compiling regex-syntax v0.8.5
Compiling aho-corasick v1.1.3
Compiling serde v1.0.228
Compiling smallvec v1.15.1
Compiling thiserror v2.0.17
Compiling subtle v2.5.0
Compiling stable_deref_trait v1.2.0
Compiling regex-automata v0.4.9
Compiling once_cell v1.21.3
Compiling cpufeatures v0.2.12
Compiling fastrand v2.3.0
Compiling scopeguard v1.2.0
Compiling lock_api v0.4.14
Compiling parking_lot_core v0.9.12
Compiling block-buffer v0.10.4
Compiling bitflags v2.9.1
Compiling digest v0.10.7
Compiling parking_lot v0.12.5
Compiling byteorder v1.5.0
Compiling tinyvec_macros v0.1.1
Compiling tinyvec v1.6.0
Compiling crc32fast v1.5.0
Compiling gix-trace v0.1.13
Compiling home v0.5.9
Compiling typeid v1.0.3
Compiling zlib-rs v0.5.2
Compiling itoa v1.0.11
Compiling erased-serde v0.4.6
Compiling unicode-normalization v0.1.23
Compiling same-file v1.0.6
Compiling walkdir v2.5.0
Compiling gix-utils v0.3.0
Compiling bstr v1.12.0
Compiling zerofrom v0.1.6
Compiling prodash v30.0.1
Compiling gix-validate v0.10.0
Compiling serde_fmt v1.0.3
Compiling gix-path v0.10.20
Compiling value-bag-serde1 v1.11.1
Compiling yoke v0.7.5
Compiling zerovec v0.10.4
Compiling value-bag v1.11.1
Compiling log v0.4.27
Compiling hash32 v0.3.1
Compiling zeroize v1.7.0
Compiling libz-rs-sys v0.5.2
Compiling flate2 v1.1.1
Compiling heapless v0.8.0
Compiling gix-features v0.43.1
Compiling tinystr v0.7.6
Compiling getrandom v0.3.3
Compiling litemap v0.7.5
Compiling writeable v0.5.5
Compiling faster-hex v0.10.0
Compiling linux-raw-sys v0.9.4
Compiling icu_locid_transform_data v1.5.1
Compiling icu_locid v1.5.0
Compiling sha1 v0.10.6
Compiling block-padding v0.3.3
Compiling sha1-checked v0.10.0
Compiling inout v0.1.3
Compiling icu_properties_data v1.5.1
Compiling icu_provider v1.5.0
Compiling icu_collections v1.5.0
Compiling rustix v1.0.7
Compiling icu_locid_transform v1.5.0
Compiling gix-hash v0.19.0
Compiling cipher v0.4.4
Compiling icu_normalizer_data v1.5.1
Compiling utf16_iter v1.0.5
Compiling utf8_iter v1.0.4
Compiling write16 v1.0.0
Compiling icu_properties v1.5.1
Compiling percent-encoding v2.3.1
Compiling equivalent v1.0.1
Compiling hashbrown v0.14.3
Compiling form_urlencoded v1.2.1
Compiling indexmap v2.2.6
Compiling sha2 v0.10.8
Compiling ryu v1.0.17
Compiling libz-sys v1.1.16
Compiling serde_json v1.0.140
Compiling thiserror v1.0.69
Compiling universal-hash v0.5.1
Compiling icu_normalizer v1.5.0
Compiling tempfile v3.23.0
Compiling idna_adapter v1.2.0
Compiling opaque-debug v0.3.1
Compiling ref-cast v1.0.24
Compiling idna v1.0.3
Compiling dyn-clone v1.0.17
Compiling libgit2-sys v0.17.0+1.8.1
Compiling signature v1.6.4
Compiling ed25519 v1.5.3
Compiling url v2.5.4
Compiling aead v0.5.2
Compiling ascii v1.1.0
Compiling ct-codecs v1.1.1
Compiling amplify_num v0.5.2
Compiling ec25519 v0.1.0
Compiling num-traits v0.2.19
Compiling poly1305 v0.8.0
Compiling git-ref-format-core v0.6.0
Compiling chacha20 v0.9.1
Compiling schemars v1.0.4
Compiling amplify v4.6.0
Compiling cyphergraphy v0.3.0
Compiling polyval v0.6.2
Compiling sqlite3-src v0.5.1
Compiling hmac v0.12.1
Compiling base64ct v1.6.0
Compiling keccak v0.1.5
Compiling pem-rfc7468 v0.7.0
Compiling sha3 v0.10.8
Compiling pbkdf2 v0.12.2
Compiling ghash v0.5.1
Compiling ctr v0.9.2
Compiling aes v0.8.4
Compiling rand v0.8.5
Compiling base32 v0.4.0
Compiling cypheraddr v0.4.0
Compiling aes-gcm v0.10.3
Compiling qcheck v1.0.0
Compiling ssh-encoding v0.2.0
Compiling chacha20poly1305 v0.10.1
Compiling cbc v0.1.2
Compiling blowfish v0.9.1
Compiling data-encoding v2.5.0
Compiling data-encoding-macro v0.1.14
Compiling bcrypt-pbkdf v0.10.0
Compiling ssh-cipher v0.2.0
Compiling noise-framework v0.4.0
Compiling socks5-client v0.4.1
Compiling base-x v0.2.11
Compiling signature v2.2.0
Compiling multibase v0.9.1
Compiling ssh-key v0.6.6
Compiling cyphernet v0.5.2
Compiling radicle-ssh v0.10.0 (/477f61bc-11d5-4481-be7f-441c8572a73c/w/crates/radicle-ssh)
Compiling crossbeam-utils v0.8.19
Compiling crossbeam-channel v0.5.15
Compiling lazy_static v1.5.0
Compiling jiff v0.2.15
Compiling nonempty v0.9.0
Compiling siphasher v1.0.1
Compiling anstyle-query v1.0.2
Compiling radicle-dag v0.10.0 (/477f61bc-11d5-4481-be7f-441c8572a73c/w/crates/radicle-dag)
Compiling radicle-git-metadata v0.1.0 (/477f61bc-11d5-4481-be7f-441c8572a73c/w/crates/radicle-git-metadata)
Compiling winnow v0.7.13
Compiling hashbrown v0.15.5
Compiling utf8parse v0.2.2
Compiling anstyle-parse v0.2.3
Compiling gix-hashtable v0.9.0
Compiling radicle-git-ref-format v0.1.0 (/477f61bc-11d5-4481-be7f-441c8572a73c/w/crates/radicle-git-ref-format)
Compiling is_terminal_polyfill v1.70.2
Compiling anstyle v1.0.13
Compiling colorchoice v1.0.0
Compiling gix-date v0.10.5
Compiling gix-actor v0.35.4
Compiling iana-time-zone v0.1.60
Compiling base64 v0.21.7
Compiling chrono v0.4.38
Compiling gix-object v0.50.2
Compiling anstream v0.6.21
Compiling colored v2.1.0
Compiling radicle-localtime v0.1.0 (/477f61bc-11d5-4481-be7f-441c8572a73c/w/crates/radicle-localtime)
Compiling serde-untagged v0.1.7
Compiling bytesize v2.0.1
Compiling memmap2 v0.9.8
Compiling dunce v1.0.5
Compiling fast-glob v0.3.3
Compiling tree-sitter-language v0.1.2
Compiling gix-chunk v0.4.11
Compiling gix-commitgraph v0.29.0
Compiling adler2 v2.0.0
Compiling gix-fs v0.16.1
Compiling gix-revwalk v0.21.0
Compiling gix-tempfile v18.0.0
Compiling mio v1.0.4
Compiling gix-quote v0.6.0
Compiling errno v0.3.13
Compiling sem_safe v0.2.0
Compiling either v1.11.0
Compiling shell-words v1.1.0
Compiling unicode-segmentation v1.11.0
Compiling gix-command v0.6.2
Compiling signals_receipts v0.2.0
Compiling gix-lock v18.0.0
Compiling gix-url v0.32.0
Compiling gix-config-value v0.15.1
Compiling gix-sec v0.12.0
Compiling signal-hook-registry v1.4.5
Compiling gimli v0.32.3
Compiling signal-hook v0.3.18
Compiling gix-prompt v0.11.1
Compiling radicle-signals v0.11.0 (/477f61bc-11d5-4481-be7f-441c8572a73c/w/crates/radicle-signals)
Compiling object v0.37.3
Compiling addr2line v0.25.1
Compiling gix-revision v0.35.0
Compiling gix-traverse v0.47.0
Compiling miniz_oxide v0.8.8
Compiling gix-diff v0.53.0
Compiling gix-packetline v0.19.1
Compiling mio v0.8.11
Compiling tree-sitter v0.24.4
Compiling rustc-demangle v0.1.26
Compiling rustix v0.38.34
Compiling backtrace v0.3.76
Compiling sqlite3-sys v0.15.2
Compiling signal-hook-mio v0.2.4
Compiling sqlite v0.32.0
Compiling gix-transport v0.48.0
Compiling radicle-crypto v0.14.0 (/477f61bc-11d5-4481-be7f-441c8572a73c/w/crates/radicle-crypto)
Compiling gix-pack v0.60.0
Compiling gix-refspec v0.31.0
Compiling gix-credentials v0.30.0
Compiling gix-ref v0.53.1
Compiling gix-shallow v0.5.0
Compiling convert_case v0.7.1
Compiling gix-negotiate v0.21.0
Compiling regex v1.11.1
Compiling arc-swap v1.7.1
Compiling gix-protocol v0.51.0
Compiling gix-odb v0.70.0
Compiling derive_more-impl v2.0.1
Compiling xattr v1.3.1
Compiling uuid v1.20.0
Compiling filetime v0.2.23
Compiling bytes v1.10.1
Compiling bitflags v1.3.2
Compiling unicode-width v0.2.1
Compiling console v0.16.0
Compiling crossterm v0.25.0
Compiling tar v0.4.40
Compiling git-ref-format-macro v0.6.0
Compiling derive_more v2.0.1
Compiling portable-atomic v1.11.0
Compiling anyhow v1.0.82
Compiling newline-converter v0.3.0
Compiling snapbox-macros v0.3.8
Compiling salsa20 v0.10.2
Compiling fxhash v0.2.1
Compiling similar v2.5.0
Compiling unit-prefix v0.5.1
Compiling siphasher v0.3.11
Compiling streaming-iterator v0.1.9
Compiling unicode-width v0.1.11
Compiling strsim v0.11.1
Compiling clap_lex v0.7.5
Compiling normalize-line-endings v0.3.0
Compiling clap_builder v4.5.44
Compiling snapbox v0.4.17
Compiling inquire v0.7.5
Compiling bloomy v1.2.0
Compiling indicatif v0.18.0
Compiling scrypt v0.11.0
Compiling radicle-surf v0.26.0
Compiling crossterm v0.29.0
Compiling git-ref-format v0.6.0
Compiling unicode-display-width v0.3.0
Compiling systemd-journal-logger v2.2.2
Compiling tree-sitter-typescript v0.23.2
Compiling tree-sitter-ruby v0.23.1
Compiling tree-sitter-toml-ng v0.6.0
Compiling tree-sitter-c v0.23.2
Compiling tree-sitter-bash v0.23.3
Compiling tree-sitter-html v0.23.2
Compiling tree-sitter-python v0.23.4
Compiling tree-sitter-md v0.3.2
Compiling tree-sitter-rust v0.23.2
Compiling tree-sitter-json v0.24.8
Compiling tree-sitter-css v0.23.1
Compiling tree-sitter-go v0.23.4
Compiling serde_spanned v1.0.4
Compiling toml_datetime v0.7.5+spec-1.1.0
Compiling radicle-std-ext v0.2.0
Compiling pin-project-lite v0.2.16
Compiling toml_writer v1.0.6+spec-1.1.0
Compiling tokio v1.47.1
Compiling toml v0.9.12+spec-1.1.0
Compiling clap v4.5.44
Compiling sysinfo v0.37.2
Compiling radicle-cli v0.17.0 (/477f61bc-11d5-4481-be7f-441c8572a73c/w/crates/radicle-cli)
Compiling yansi v0.5.1
Compiling diff v0.1.13
Compiling radicle-node v0.16.0 (/477f61bc-11d5-4481-be7f-441c8572a73c/w/crates/radicle-node)
Compiling pretty_assertions v1.4.0
Compiling human-panic v2.0.6
Compiling clap_complete v4.5.60
Compiling structured-logger v1.0.4
Compiling radicle-systemd v0.11.0 (/477f61bc-11d5-4481-be7f-441c8572a73c/w/crates/radicle-systemd)
Compiling tree-sitter-highlight v0.24.4
Compiling itertools v0.14.0
Compiling num-integer v0.1.46
Compiling socket2 v0.5.7
Compiling timeago v0.4.2
Compiling lexopt v0.3.0
Compiling bit-vec v0.8.0
Compiling escargot v0.5.10
Compiling bit-set v0.8.0
Compiling num-bigint v0.4.6
Compiling rand_core v0.9.3
Compiling num-iter v0.1.45
Compiling num-complex v0.4.6
Compiling env_filter v0.1.3
Compiling num-rational v0.4.2
Compiling borrow-or-share v0.2.2
Compiling zerocopy v0.7.35
Compiling ahash v0.8.11
Compiling num v0.4.3
Compiling fluent-uri v0.3.2
Compiling env_logger v0.11.8
Compiling phf_shared v0.11.3
Compiling wait-timeout v0.2.1
Compiling outref v0.5.2
Compiling ppv-lite86 v0.2.17
Compiling vsimd v0.8.0
Compiling fnv v1.0.7
Compiling quick-error v1.2.3
Compiling radicle-remote-helper v0.14.0 (/477f61bc-11d5-4481-be7f-441c8572a73c/w/crates/radicle-remote-helper)
Compiling rand_chacha v0.9.0
Compiling uuid-simd v0.8.0
Compiling rusty-fork v0.3.1
Compiling test-log v0.2.18
Compiling referencing v0.30.0
Compiling phf v0.11.3
Compiling fraction v0.15.3
Compiling rand v0.9.2
Compiling rand_xorshift v0.4.0
Compiling fancy-regex v0.14.0
Compiling email_address v0.2.9
Compiling bytecount v0.6.8
Compiling base64 v0.22.1
Compiling num-cmp v0.1.0
Compiling unarray v0.1.4
Compiling jsonschema v0.30.0
Compiling proptest v1.9.0
Compiling emojis v0.6.4
Compiling git2 v0.19.0
Compiling radicle-windows v0.1.0 (/477f61bc-11d5-4481-be7f-441c8572a73c/w/crates/radicle-windows)
Compiling radicle-oid v0.1.0 (/477f61bc-11d5-4481-be7f-441c8572a73c/w/crates/radicle-oid)
Compiling radicle-git-ext v0.11.0
Compiling radicle-term v0.16.0 (/477f61bc-11d5-4481-be7f-441c8572a73c/w/crates/radicle-term)
Compiling radicle-core v0.1.0 (/477f61bc-11d5-4481-be7f-441c8572a73c/w/crates/radicle-core)
Compiling radicle-cob v0.17.0 (/477f61bc-11d5-4481-be7f-441c8572a73c/w/crates/radicle-cob)
Compiling radicle v0.20.0 (/477f61bc-11d5-4481-be7f-441c8572a73c/w/crates/radicle)
Compiling radicle-fetch v0.16.0 (/477f61bc-11d5-4481-be7f-441c8572a73c/w/crates/radicle-fetch)
Compiling radicle-protocol v0.4.0 (/477f61bc-11d5-4481-be7f-441c8572a73c/w/crates/radicle-protocol)
Compiling radicle-cli-test v0.13.0 (/477f61bc-11d5-4481-be7f-441c8572a73c/w/crates/radicle-cli-test)
Compiling radicle-schemars v0.6.0 (/477f61bc-11d5-4481-be7f-441c8572a73c/w/crates/radicle-schemars)
Finished `dev` profile [unoptimized + debuginfo] target(s) in 1m 08s
+ cargo doc --workspace --no-deps --all-features
Checking regex-automata v0.4.9
Compiling syn v1.0.109
Checking idna v1.0.3
Compiling num-traits v0.2.19
Checking radicle-ssh v0.10.0 (/477f61bc-11d5-4481-be7f-441c8572a73c/w/crates/radicle-ssh)
Checking url v2.5.4
Checking git2 v0.19.0
Checking proptest v1.9.0
Checking bstr v1.12.0
Compiling amplify_syn v2.0.1
Compiling data-encoding-macro-internal v0.1.12
Checking gix-validate v0.10.0
Checking gix-path v0.10.20
Checking git-ref-format-core v0.6.0
Checking gix-features v0.43.1
Checking data-encoding-macro v0.1.14
Checking multibase v0.9.1
Checking gix-hash v0.19.0
Compiling amplify_derive v4.0.0
Checking radicle-git-ref-format v0.1.0 (/477f61bc-11d5-4481-be7f-441c8572a73c/w/crates/radicle-git-ref-format)
Checking gix-date v0.10.5
Checking radicle-dag v0.10.0 (/477f61bc-11d5-4481-be7f-441c8572a73c/w/crates/radicle-dag)
Checking radicle-oid v0.1.0 (/477f61bc-11d5-4481-be7f-441c8572a73c/w/crates/radicle-oid)
Checking gix-hashtable v0.9.0
Checking gix-actor v0.35.4
Checking radicle-git-metadata v0.1.0 (/477f61bc-11d5-4481-be7f-441c8572a73c/w/crates/radicle-git-metadata)
Checking chrono v0.4.38
Checking gix-object v0.50.2
Checking gix-commitgraph v0.29.0
Checking radicle-localtime v0.1.0 (/477f61bc-11d5-4481-be7f-441c8572a73c/w/crates/radicle-localtime)
Checking gix-fs v0.16.1
Checking gix-tempfile v18.0.0
Checking gix-quote v0.6.0
Checking gix-command v0.6.2
Checking gix-revwalk v0.21.0
Checking gix-lock v18.0.0
Checking gix-url v0.32.0
Checking gix-config-value v0.15.1
Checking gix-traverse v0.47.0
Checking gix-revision v0.35.0
Checking gix-prompt v0.11.1
Checking radicle-signals v0.11.0 (/477f61bc-11d5-4481-be7f-441c8572a73c/w/crates/radicle-signals)
Checking gix-diff v0.53.0
Checking gix-packetline v0.19.1
Checking regex v1.11.1
Checking gix-pack v0.60.0
Checking gix-transport v0.48.0
Checking amplify v4.6.0
Checking tree-sitter v0.24.4
Checking gix-credentials v0.30.0
Checking cyphergraphy v0.3.0
Checking gix-refspec v0.31.0
Checking git-ref-format v0.6.0
Checking cypheraddr v0.4.0
Checking noise-framework v0.4.0
Checking gix-ref v0.53.1
Checking socks5-client v0.4.1
Checking gix-shallow v0.5.0
Checking gix-negotiate v0.21.0
Checking gix-odb v0.70.0
Checking cyphernet v0.5.2
Checking radicle-crypto v0.14.0 (/477f61bc-11d5-4481-be7f-441c8572a73c/w/crates/radicle-crypto)
Checking radicle-git-ext v0.11.0
Checking radicle-cob v0.17.0 (/477f61bc-11d5-4481-be7f-441c8572a73c/w/crates/radicle-cob)
Checking radicle-core v0.1.0 (/477f61bc-11d5-4481-be7f-441c8572a73c/w/crates/radicle-core)
Checking gix-protocol v0.51.0
Checking uuid v1.20.0
Compiling radicle-cli v0.17.0 (/477f61bc-11d5-4481-be7f-441c8572a73c/w/crates/radicle-cli)
Checking radicle-surf v0.26.0
Checking human-panic v2.0.6
Checking tree-sitter-toml-ng v0.6.0
Checking radicle v0.20.0 (/477f61bc-11d5-4481-be7f-441c8572a73c/w/crates/radicle)
Checking radicle-term v0.16.0 (/477f61bc-11d5-4481-be7f-441c8572a73c/w/crates/radicle-term)
Checking tree-sitter-highlight v0.24.4
Checking radicle-systemd v0.11.0 (/477f61bc-11d5-4481-be7f-441c8572a73c/w/crates/radicle-systemd)
Documenting radicle-systemd v0.11.0 (/477f61bc-11d5-4481-be7f-441c8572a73c/w/crates/radicle-systemd)
Documenting radicle v0.20.0 (/477f61bc-11d5-4481-be7f-441c8572a73c/w/crates/radicle)
Documenting radicle-cob v0.17.0 (/477f61bc-11d5-4481-be7f-441c8572a73c/w/crates/radicle-cob)
Documenting radicle-core v0.1.0 (/477f61bc-11d5-4481-be7f-441c8572a73c/w/crates/radicle-core)
Documenting radicle-crypto v0.14.0 (/477f61bc-11d5-4481-be7f-441c8572a73c/w/crates/radicle-crypto)
Documenting radicle-term v0.16.0 (/477f61bc-11d5-4481-be7f-441c8572a73c/w/crates/radicle-term)
Documenting radicle-signals v0.11.0 (/477f61bc-11d5-4481-be7f-441c8572a73c/w/crates/radicle-signals)
Documenting radicle-oid v0.1.0 (/477f61bc-11d5-4481-be7f-441c8572a73c/w/crates/radicle-oid)
Documenting radicle-git-ref-format v0.1.0 (/477f61bc-11d5-4481-be7f-441c8572a73c/w/crates/radicle-git-ref-format)
Documenting radicle-localtime v0.1.0 (/477f61bc-11d5-4481-be7f-441c8572a73c/w/crates/radicle-localtime)
Documenting radicle-ssh v0.10.0 (/477f61bc-11d5-4481-be7f-441c8572a73c/w/crates/radicle-ssh)
Documenting radicle-dag v0.10.0 (/477f61bc-11d5-4481-be7f-441c8572a73c/w/crates/radicle-dag)
Documenting radicle-git-metadata v0.1.0 (/477f61bc-11d5-4481-be7f-441c8572a73c/w/crates/radicle-git-metadata)
Documenting radicle-windows v0.1.0 (/477f61bc-11d5-4481-be7f-441c8572a73c/w/crates/radicle-windows)
Checking radicle-fetch v0.16.0 (/477f61bc-11d5-4481-be7f-441c8572a73c/w/crates/radicle-fetch)
Documenting radicle-cli v0.17.0 (/477f61bc-11d5-4481-be7f-441c8572a73c/w/crates/radicle-cli)
Documenting radicle-fetch v0.16.0 (/477f61bc-11d5-4481-be7f-441c8572a73c/w/crates/radicle-fetch)
Checking radicle-protocol v0.4.0 (/477f61bc-11d5-4481-be7f-441c8572a73c/w/crates/radicle-protocol)
Documenting radicle-protocol v0.4.0 (/477f61bc-11d5-4481-be7f-441c8572a73c/w/crates/radicle-protocol)
Documenting radicle-node v0.16.0 (/477f61bc-11d5-4481-be7f-441c8572a73c/w/crates/radicle-node)
Documenting radicle-cli-test v0.13.0 (/477f61bc-11d5-4481-be7f-441c8572a73c/w/crates/radicle-cli-test)
Documenting radicle-schemars v0.6.0 (/477f61bc-11d5-4481-be7f-441c8572a73c/w/crates/radicle-schemars)
Documenting radicle-remote-helper v0.14.0 (/477f61bc-11d5-4481-be7f-441c8572a73c/w/crates/radicle-remote-helper)
Finished `dev` profile [unoptimized + debuginfo] target(s) in 12.24s
Generated /477f61bc-11d5-4481-be7f-441c8572a73c/w/target/doc/radicle/index.html and 21 other files
+ cargo test --workspace --no-fail-fast
Finished `test` profile [unoptimized + debuginfo] target(s) in 0.15s
Running unittests src/lib.rs (target/debug/deps/radicle-be5594320bccd74f)
running 236 tests
test canonical::formatter::test::ascii_control_characters ... ok
test canonical::formatter::test::ordered_nested_object ... ok
test canonical::formatter::test::securesystemslib_asserts ... ok
test cob::cache::migrations::_2::tests::test_patch_json_deserialization ... ok
test cob::cache::migrations::_2::tests::test_migration_2 ... ok
test cob::common::test::test_color ... ok
test cob::common::test::test_emojis ... ok
test cob::common::test::test_title ... ok
test cob::cache::tests::test_check_version ... ok
test cob::cache::tests::test_migrate_to ... ok
test cob::identity::test::prop_json_eq_str ... ok
test cob::identity::test::test_identity_redact_revision ... ok
test cob::identity::test::test_identity_updates ... ok
test cob::identity::test::test_identity_remove_delegate_concurrent ... ok
test cob::identity::test::test_identity_update_rejected ... ok
test cob::identity::test::test_identity_reject_concurrent ... ok
test cob::issue::cache::tests::test_counts ... ok
test cob::issue::cache::tests::test_get ... ok
test cob::issue::cache::tests::test_is_empty ... ok
test cob::issue::cache::tests::test_list ... ok
test cob::issue::cache::tests::test_list_by_status ... ok
test cob::issue::cache::tests::test_remove ... ok
test cob::identity::test::test_valid_identity ... ok
test cob::issue::test::test_embeds ... ok
test cob::identity::test::test_identity_updates_concurrent ... ok
test cob::issue::test::test_embeds_edit ... ok
test cob::identity::test::test_identity_updates_concurrent_outdated ... ok
test cob::issue::test::test_invalid_actions ... ok
test cob::issue::test::test_invalid_tx_reference ... ok
test cob::issue::test::test_concurrency ... ok
test cob::issue::test::test_invalid_cob ... ok
test cob::issue::test::test_invalid_tx ... ok
test cob::issue::test::test_issue_all ... ok
test cob::issue::test::test_issue_comment ... ok
test cob::issue::test::test_issue_comment_redact ... ok
test cob::issue::test::test_issue_create_and_assign ... ok
test cob::issue::test::test_issue_create_and_change_state ... ok
test cob::issue::test::test_issue_create_and_get ... ok
test cob::issue::test::test_issue_create_and_reassign ... ok
test cob::issue::test::test_issue_create_and_unassign ... ok
test cob::issue::test::test_issue_edit ... ok
test cob::issue::test::test_issue_edit_description ... ok
test cob::issue::test::test_issue_multilines ... ok
test cob::issue::test::test_issue_state_serde ... ok
test cob::issue::test::test_ordering ... ok
test cob::patch::actions::test::test_review_edit ... ok
test cob::issue::test::test_issue_label ... ok
test cob::issue::test::test_issue_react ... ok
test cob::patch::cache::tests::test_get ... ok
test cob::patch::cache::tests::test_is_empty ... ok
test cob::patch::cache::tests::test_list ... ok
test cob::patch::cache::tests::test_list_by_status ... ok
test cob::issue::test::test_issue_reply ... ok
test cob::patch::encoding::review::test::test_review_deserialize_summary_migration_null_summary ... ok
test cob::patch::encoding::review::test::test_review_deserialize_summary_migration_with_summary ... ok
test cob::patch::encoding::review::test::test_review_deserialize_summary_migration_without_summary ... ok
test cob::patch::encoding::review::test::test_review_deserialize_summary_v2 ... ok
test cob::patch::encoding::review::test::test_review_summary ... ok
test cob::patch::test::test_json ... ok
test cob::patch::test::test_json_serialization ... ok
test cob::patch::cache::tests::test_remove ... ok
test cob::patch::test::test_patch_create_and_get ... ok
test cob::patch::test::test_patch_discussion ... ok
test cob::patch::cache::tests::test_counts ... ok
test cob::patch::test::test_patch_merge ... ok
test cob::patch::test::test_patch_redact ... ok
test cob::patch::test::test_patch_review_comment ... ok
test cob::patch::test::test_patch_review ... ok
test cob::patch::test::test_patch_review_duplicate ... ok
test cob::patch::test::test_patch_review_edit_comment ... ok
test cob::patch::test::test_patch_review_edit ... ok
test cob::patch::test::test_patch_review_remove_summary ... ok
test cob::patch::test::test_reactions_json_serialization ... ok
test cob::patch::test::test_revision_edit_redact ... ok
test cob::patch::test::test_revision_reaction ... ok
test cob::patch::test::test_revision_review_merge_redacted ... ok
test cob::stream::tests::test_all_from ... ok
test cob::stream::tests::test_all_from_until ... ok
test cob::patch::test::test_patch_review_revision_redact ... ok
test cob::patch::cache::tests::test_find_by_revision ... ok
test cob::stream::tests::test_all_until ... ok
test cob::stream::tests::test_regression_from_until ... ok
test cob::thread::tests::test_comment_edit_missing ... ok
test cob::thread::tests::test_comment_edit_redacted ... ok
test cob::thread::tests::test_comment_redact_missing ... ok
test cob::stream::tests::test_from_until ... ok
test cob::thread::tests::test_edit_comment ... ok
test cob::thread::tests::test_duplicate_comments ... ok
test cob::thread::tests::test_redact_comment ... ok
test git::canonical::quorum::test::merge_base_commutative ... ok
test git::canonical::quorum::test::test_merge_bases ... ok
test cob::thread::tests::test_timeline ... ok
test git::canonical::rules::tests::test_deserialization ... ok
test git::canonical::rules::tests::test_deserialize_extensions ... ok
test cob::patch::test::test_patch_update ... ok
test git::canonical::rules::tests::test_order ... ok
test git::canonical::rules::tests::test_roundtrip ... ok
test git::canonical::rules::tests::test_rule_validate_success ... ok
test git::canonical::rules::tests::test_special_branches ... ok
test git::canonical::tests::test_commit_quorum_fork_of_a_fork ... ok
test git::canonical::tests::test_commit_quorum_forked_merge_commits ... ok
test git::canonical::tests::test_commit_quorum_groups ... ok
test git::canonical::tests::test_commit_quorum_linear ... ok
test git::canonical::tests::test_commit_quorum_merges ... ok
test git::canonical::tests::test_commit_quorum_single ... ok
test git::canonical::tests::test_commit_quorum_three_way_fork ... ok
test git::canonical::tests::test_commit_quorum_two_way_fork ... ok
test git::canonical::tests::test_quorum_different_types ... ok
test git::canonical::rules::tests::test_canonical ... ok
test git::canonical::tests::test_tag_quorum ... ok
test git::test::test_version_from_str ... ok
test git::test::test_version_ord ... ok
test identity::did::test::test_did_encode_decode ... ok
test identity::did::test::test_did_vectors ... ok
test git::canonical::rules::tests::test_rule_validate_failures ... ok
test identity::doc::test::test_canonical_doc ... ok
test identity::doc::test::test_canonical_example ... ok
test identity::doc::test::test_duplicate_dids ... ok
test identity::doc::test::test_future_version_error ... ok
test identity::doc::test::test_is_valid_version ... ok
test identity::doc::test::test_max_delegates ... ok
test identity::doc::test::test_not_found ... ok
test identity::doc::test::test_parse_version ... ok
test identity::doc::test::test_visibility_json ... ok
test identity::doc::update::test::test_can_update_crefs ... ok
test identity::doc::update::test::test_cannot_include_default_branch_rule ... ok
test identity::doc::update::test::test_default_branch_rule_exists_after_verification ... ok
test identity::project::test::test_project_name ... ok
test node::address::store::test::test_alias ... ok
test node::address::store::test::test_disconnected ... ok
test node::address::store::test::test_disconnected_ban ... ok
test node::address::store::test::test_empty ... ok
test node::address::store::test::test_entries ... ok
test node::address::store::test::test_get_none ... ok
test node::address::store::test::test_insert_and_get ... ok
test node::address::store::test::test_insert_and_remove ... ok
test node::address::store::test::test_insert_and_update ... ok
test node::address::store::test::test_insert_duplicate ... ok
test node::address::store::test::test_node_aliases ... ok
test node::address::store::test::test_remove_nothing ... ok
test node::command::test::command_result ... ok
test node::config::test::partial ... ok
test node::db::test::test_version ... ok
test node::features::test::test_operations ... ok
test node::notifications::store::test::test_branch_notifications ... ok
test node::notifications::store::test::test_clear ... ok
test node::notifications::store::test::test_cob_notifications ... ok
test node::notifications::store::test::test_counts_by_repo ... ok
test node::notifications::store::test::test_duplicate_notifications ... ok
test node::notifications::store::test::test_notification_status ... ok
test node::policy::store::test::test_follow_and_unfollow_node ... ok
test node::policy::store::test::test_node_aliases ... ok
test node::policy::store::test::test_node_policies ... ok
test node::policy::store::test::test_node_policy ... ok
test node::policy::store::test::test_repo_policies ... ok
test node::policy::store::test::test_repo_policy ... ok
test node::policy::store::test::test_seed_and_unseed_repo ... ok
test node::policy::store::test::test_update_alias ... ok
test node::policy::store::test::test_update_scope ... ok
test node::refs::store::test::test_count ... ok
test node::refs::store::test::test_set_and_delete ... ok
test node::refs::store::test::test_set_and_get ... ok
test node::routing::test::test_count ... ok
test node::routing::test::test_entries ... ok
test node::routing::test::test_insert_and_get ... ok
test node::routing::test::test_insert_and_get_resources ... ok
test node::routing::test::test_insert_and_remove ... ok
test node::routing::test::test_insert_duplicate ... ok
test node::routing::test::test_insert_existing_updated_time ... ok
test node::routing::test::test_len ... ok
test node::routing::test::test_prune ... ok
test node::routing::test::test_remove_many ... ok
test node::routing::test::test_remove_redundant ... ok
test node::routing::test::test_update_existing_multi ... ok
test node::sync::announce::test::all_synced_nodes_are_preferred_seeds ... ok
test node::sync::announce::test::announcer_adapts_target_to_reach ... ok
test node::sync::announce::test::announcer_preferred_seeds_or_replica_factor ... ok
test node::sync::announce::test::announcer_reached_max_replication_target ... ok
test node::sync::announce::test::announcer_reached_min_replication_target ... ok
test node::sync::announce::test::announcer_reached_preferred_seeds ... ok
test git::canonical::tests::test_quorum_properties ... ok
test node::sync::announce::test::announcer_synced_with_unknown_node ... ok
test node::sync::announce::test::announcer_with_replication_factor_zero_and_preferred_seeds ... ok
test node::sync::announce::test::announcer_timed_out ... ok
test node::sync::announce::test::construct_node_appears_in_multiple_input_sets ... ok
test node::sync::announce::test::construct_only_preferred_seeds_provided ... ok
test node::sync::announce::test::cannot_construct_announcer ... ok
test node::sync::announce::test::local_node_in_multiple_sets ... ok
test node::sync::announce::test::local_node_in_preferred_seeds ... ok
test node::sync::announce::test::invariant_progress_should_match_state ... ok
test node::sync::announce::test::local_node_in_unsynced_set ... ok
test node::sync::announce::test::local_node_in_synced_set ... ok
test node::sync::announce::test::local_node_only_in_all_sets_results_in_no_seeds_error ... ok
test node::sync::announce::test::preferred_seeds_already_synced ... ok
test node::sync::announce::test::synced_with_local_node_is_ignored ... ok
test node::sync::announce::test::synced_with_same_node_multiple_times ... ok
test node::sync::announce::test::timed_out_after_reaching_success ... ok
test node::sync::fetch::test::all_nodes_are_candidates ... ok
test node::sync::fetch::test::could_not_reach_target ... ok
test node::sync::fetch::test::all_nodes_are_fetchable ... ok
test node::sync::fetch::test::ignores_duplicates_and_local_node ... ok
test node::sync::fetch::test::preferred_seeds_target_returned_over_replicas ... ok
test node::sync::fetch::test::reaches_target_of_max_replicas ... ok
test node::sync::fetch::test::reaches_target_of_preferred_seeds ... ok
test node::sync::fetch::test::reaches_target_of_replicas ... ok
test node::sync::test::ensure_replicas_construction ... ok
test node::sync::test::replicas_constrain_to ... ok
test node::test::test_alias ... ok
test node::test::test_command_result ... ok
test node::test::test_user_agent ... ok
test node::timestamp::tests::test_timestamp_max ... ok
test profile::test::canonicalize_home ... ok
test profile::test::test_config ... ok
test cob::thread::tests::prop_ordering ... ok
test rad::tests::test_checkout ... ok
test rad::tests::test_fork ... ok
test rad::tests::test_init ... ok
test storage::git::tests::test_references_of ... ok
test profile::config::test::schema ... ok
test storage::git::transport::local::url::test::test_url_parse ... ok
test storage::git::transport::local::url::test::test_url_to_string ... ok
test storage::git::transport::remote::url::test::test_url_parse ... ok
test storage::refs::tests::prop_canonical_roundtrip ... ok
test storage::git::tests::test_sign_refs ... ok
test storage::tests::test_storage ... ok
test test::assert::test::assert_with_message ... ok
test test::assert::test::test_assert_no_move ... ok
test test::assert::test::test_assert_panic_0 - should panic ... ok
test test::assert::test::test_assert_panic_1 - should panic ... ok
test test::assert::test::test_assert_panic_2 - should panic ... ok
test test::assert::test::test_assert_succeed ... ok
test test::assert::test::test_panic_message ... ok
test version::test::test_version ... ok
test storage::git::tests::test_remote_refs ... ok
test storage::refs::tests::test_rid_verification ... ok
test identity::doc::test::prop_encode_decode ... ok
test result: ok. 236 passed; 0 failed; 0 ignored; 0 measured; 0 filtered out; finished in 2.33s
Running unittests src/lib.rs (target/debug/deps/radicle_cli-2ee9490cac79901e)
running 46 tests
test commands::block::args::test::should_not_parse ... ok
test commands::block::args::test::should_parse_nid ... ok
test commands::block::args::test::should_parse_rid ... ok
test commands::clone::args::test::should_parse_rid_non_urn ... ok
test commands::clone::args::test::should_parse_rid_urn ... ok
test commands::clone::args::test::should_parse_rid_url ... ok
test commands::cob::args::test::should_allow_update_json_format ... ok
test commands::cob::args::test::should_allow_log_json_format ... ok
test commands::cob::args::test::should_not_allow_show_pretty_format ... ok
test commands::cob::args::test::should_allow_log_pretty_format ... ok
test commands::cob::args::test::should_allow_show_json_format ... ok
test commands::fork::args::test::should_not_parse_rid_url ... ok
test commands::cob::args::test::should_not_allow_update_pretty_format ... ok
test commands::fork::args::test::should_parse_rid_urn ... ok
test commands::fork::args::test::should_parse_rid_non_urn ... ok
test commands::id::args::test::should_not_parse_into_payload - should panic ... ok
test commands::id::args::test::should_not_clobber_payload_args ... ok
test commands::id::args::test::should_not_parse_single_payload ... ok
test commands::id::args::test::should_parse_single_payload ... ok
test commands::id::args::test::should_parse_multiple_payloads ... ok
test commands::init::args::test::should_not_parse_rid_url ... ok
test commands::id::args::test::should_not_parse_single_payloads ... ok
test commands::init::args::test::should_parse_rid_non_urn ... ok
test commands::id::args::test::should_parse_into_payload ... ok
test commands::init::args::test::should_parse_rid_urn ... ok
test commands::patch::review::builder::tests::test_review_comments_basic ... ok
test commands::patch::review::builder::tests::test_review_comments_before ... ok
test commands::patch::review::builder::tests::test_review_comments_multiline ... ok
test commands::inspect::test::test_tree ... ok
test commands::patch::review::builder::tests::test_review_comments_split_hunk ... ok
test commands::publish::args::test::should_not_parse_rid_url ... ok
test commands::publish::args::test::should_parse_rid_non_urn ... ok
test commands::publish::args::test::should_parse_rid_urn ... ok
test git::pretty_diff::test::test_pretty ... ignored
test git::unified_diff::test::test_diff_content_encode_decode_content ... ok
test commands::watch::args::test::should_parse_ref_str ... ok
test git::unified_diff::test::test_diff_encode_decode_diff ... ok
test git::ddiff::tests::diff_encode_decode_ddiff_hunk ... ok
test terminal::args::test::should_parse_rid ... ok
test terminal::args::test::should_parse_nid ... ok
test terminal::format::test::test_bytes ... ok
test terminal::format::test::test_strip_comments ... ok
test terminal::patch::test::test_edit_display_message ... ok
test terminal::args::test::should_not_parse ... ok
test terminal::patch::test::test_create_display_message ... ok
test terminal::patch::test::test_update_display_message ... ok
test result: ok. 45 passed; 0 failed; 1 ignored; 0 measured; 0 filtered out; finished in 0.01s
Running unittests src/main.rs (target/debug/deps/rad-f2174746f92d6bed)
running 0 tests
test result: ok. 0 passed; 0 failed; 0 ignored; 0 measured; 0 filtered out; finished in 0.00s
Running tests/commands.rs (target/debug/deps/commands-81e5d79fa9f0fdce)
running 111 tests
test framework_home ... ok
test git_push_amend ... ok
test git_push_and_fetch ... ok
test git_push_canonical_annotated_tags ... ok
test git_push_canonical_lightweight_tags ... ok
test git_push_force_with_lease ... ok
test git_push_diverge ... ok
test rad_auth ... ok
test rad_auth_errors ... ok
test rad_block ... ok
test git_tag ... ok
test rad_checkout ... ok
test git_push_rollback ... ok
test git_push_converge ... ok
test rad_clone ... ok
test rad_clone_bare ... ok
test rad_clean ... ok
test rad_clone_connect ... ok
test rad_clone_all ... ok
test rad_clone_unknown ... ok
test rad_clone_directory ... ok
test rad_cob_multiset ... ok
test rad_cob_log ... ok
test rad_cob_migrate ... ok
test rad_cob_operations ... ok
test rad_clone_partial_fail ... ok
test rad_cob_show ... ok
test rad_cob_update ... ok
test rad_config ... ok
test rad_cob_update_identity ... ok
test rad_diff ... ok
test rad_help ... ok
test rad_id_collaboration ... ignored, slow
test rad_id ... ok
test rad_id_conflict ... ok
test rad_id_private ... ok
test rad_id_multi_delegate ... ok
test rad_id_threshold ... ok
test rad_id_threshold_soft_fork ... ok
test rad_id_unauthorized_delegate ... ok
test rad_id_unknown_field ... ok
test rad_id_update_delete_field ... ok
test rad_init ... ignored, part of many other tests
test rad_init_bare ... ok
test rad_init_detached_head ... ok
test rad_init_existing ... ok
test rad_init_existing_bare ... ok
test rad_init_no_git ... ok
test rad_init_no_seed ... ok
test rad_init_private ... ok
test rad_fetch ... ok
test rad_inbox ... ok
test rad_init_private_no_seed ... ok
test rad_fork ... ok
test rad_init_private_clone ... ok
test rad_init_sync_not_connected ... ok
test rad_init_private_clone_seed ... ok
test rad_init_private_seed ... ok
test rad_init_sync_preferred ... ok
test rad_init_with_existing_remote ... ok
test rad_inspect ... ok
test rad_issue ... ok
test rad_jj_bare ... ok
test rad_jj_colocated_patch ... ok
test rad_issue_list ... ok
test rad_key_mismatch ... ok
test rad_merge_no_ff ... ok
test rad_merge_after_update ... ok
test rad_merge_via_push ... ok
test rad_node_connect ... ok
test rad_node_connect_without_address ... ok
test rad_patch ... ok
test rad_node ... ok
test rad_patch_change_base ... ok
test rad_patch_ahead_behind ... ok
test rad_patch_checkout ... ok
test rad_patch_checkout_revision ... ok
test rad_patch_checkout_force ... ok
test rad_patch_detached_head ... ok
test rad_init_sync_and_clone ... ok
test rad_init_sync_timeout ... ok
test rad_patch_diff ... ok
test rad_patch_draft ... ok
test rad_patch_edit ... ok
test rad_patch_fetch_2 ... FAILED
test rad_patch_merge_draft ... ok
test rad_patch_fetch_1 ... ok
test rad_patch_delete ... ok
test rad_patch_revert_merge ... ok
test rad_patch_open_explore ... ok
test rad_patch_via_push ... FAILED
test rad_patch_update ... ok
test rad_publish ... ok
test rad_review_by_hunk ... ok
test rad_seed_and_follow ... ok
test rad_remote ... ok
test rad_self ... ok
test rad_seed_many ... ok
test rad_sync_without_node ... ok
test rad_unseed ... ok
test rad_push_and_pull_patches ... ok
test rad_warn_old_nodes ... ok
test rad_unseed_many ... ok
test rad_sync ... ok
test rad_watch ... ok
test test_clone_without_seeds ... ok
test test_cob_deletion ... ok
test test_cob_replication ... ok
test rad_workflow ... ok
test rad_patch_pull_update ... ok
test test_replication_via_seed ... ok
failures:
---- rad_patch_fetch_2 stdout ----
1788798322 test: Using PATH ["/477f61bc-11d5-4481-be7f-441c8572a73c/w/crates/radicle-cli/target/debug", "/usr/local/cargo/bin", "/usr/local/sbin", "/usr/local/bin", "/usr/sbin", "/usr/bin", "/sbin", "/bin", "/tmp/.tmpFWbVh0/alice/work"]
1788798322 test: rad-init.md: Running `/477f61bc-11d5-4481-be7f-441c8572a73c/w/target/debug/rad` with ["init", "--name", "heartwood", "--description", "Radicle Heartwood Protocol & Stack", "--no-confirm", "--public", "-v"] in `/tmp/.tmpFWbVh0/alice/work`..
1788798322 test: rad-init.md: Running `/477f61bc-11d5-4481-be7f-441c8572a73c/w/target/debug/rad` with ["init"] in `/tmp/.tmpFWbVh0/alice/work`..
1788798322 test: rad-init.md: Running `/477f61bc-11d5-4481-be7f-441c8572a73c/w/target/debug/rad` with ["ls"] in `/tmp/.tmpFWbVh0/alice/work`..
1788798322 test: rad-init.md: Running `/477f61bc-11d5-4481-be7f-441c8572a73c/w/target/debug/rad` with ["node", "inventory"] in `/tmp/.tmpFWbVh0/alice/work`..
1788798322 test: Using PATH ["/477f61bc-11d5-4481-be7f-441c8572a73c/w/crates/radicle-cli/target/debug", "/usr/local/cargo/bin", "/usr/local/sbin", "/usr/local/bin", "/usr/sbin", "/usr/bin", "/sbin", "/bin", "/tmp/.tmpFWbVh0/alice/work"]
1788798322 test: rad-patch-fetch-2.md: Running `git` with ["checkout", "-b", "alice/1", "-q"] in `/tmp/.tmpFWbVh0/alice/work`..
1788798322 test: rad-patch-fetch-2.md: Running `git` with ["commit", "--allow-empty", "-m", "Changes #1", "-q"] in `/tmp/.tmpFWbVh0/alice/work`..
1788798322 test: rad-patch-fetch-2.md: Running `git` with ["push", "rad", "-o", "patch.message=Changes", "HEAD:refs/patches"] in `/tmp/.tmpFWbVh0/alice/work`..
1788798323 test: rad-patch-fetch-2.md: Running `git` with ["checkout", "master", "-q"] in `/tmp/.tmpFWbVh0/alice/work`..
1788798323 test: rad-patch-fetch-2.md: Running `git` with ["branch", "-D", "alice/1", "-q"] in `/tmp/.tmpFWbVh0/alice/work`..
1788798323 test: rad-patch-fetch-2.md: Running `git` with ["update-ref", "-d", "refs/remotes/rad/alice/1"] in `/tmp/.tmpFWbVh0/alice/work`..
1788798323 test: rad-patch-fetch-2.md: Running `git` with ["update-ref", "-d", "refs/remotes/rad/patches/5e2dedcc5d515fcbc1cca483d3376609fe889bfb"] in `/tmp/.tmpFWbVh0/alice/work`..
1788798323 test: rad-patch-fetch-2.md: Running `git` with ["gc", "--prune=now"] in `/tmp/.tmpFWbVh0/alice/work`..
1788798323 test: rad-patch-fetch-2.md: Running `git` with ["branch", "-r"] in `/tmp/.tmpFWbVh0/alice/work`..
1788798323 test: rad-patch-fetch-2.md: Running `git` with ["pull"] in `/tmp/.tmpFWbVh0/alice/work`..
1788798323 test: rad-patch-fetch-2.md: Running `git` with ["branch", "-r"] in `/tmp/.tmpFWbVh0/alice/work`..
thread 'rad_patch_fetch_2' panicked at crates/radicle-cli-test/src/lib.rs:515:36:
--- Expected
++++ actual: stdout
1 - rad/HEAD -> rad/master
2 1 | rad/master
3 2 | rad/patches/5e2dedcc5d515fcbc1cca483d3376609fe889bfb
Exit status: 0
note: run with `RUST_BACKTRACE=1` environment variable to display a backtrace
---- rad_patch_via_push stdout ----
1788798324 test: Using PATH ["/477f61bc-11d5-4481-be7f-441c8572a73c/w/crates/radicle-cli/target/debug", "/usr/local/cargo/bin", "/usr/local/sbin", "/usr/local/bin", "/usr/sbin", "/usr/bin", "/sbin", "/bin", "/tmp/.tmpbRJexi/alice/work"]
1788798324 test: rad-init.md: Running `/477f61bc-11d5-4481-be7f-441c8572a73c/w/target/debug/rad` with ["init", "--name", "heartwood", "--description", "Radicle Heartwood Protocol & Stack", "--no-confirm", "--public", "-v"] in `/tmp/.tmpbRJexi/alice/work`..
1788798324 test: rad-init.md: Running `/477f61bc-11d5-4481-be7f-441c8572a73c/w/target/debug/rad` with ["init"] in `/tmp/.tmpbRJexi/alice/work`..
1788798324 test: rad-init.md: Running `/477f61bc-11d5-4481-be7f-441c8572a73c/w/target/debug/rad` with ["ls"] in `/tmp/.tmpbRJexi/alice/work`..
1788798324 test: rad-init.md: Running `/477f61bc-11d5-4481-be7f-441c8572a73c/w/target/debug/rad` with ["node", "inventory"] in `/tmp/.tmpbRJexi/alice/work`..
1788798324 test: Using PATH ["/477f61bc-11d5-4481-be7f-441c8572a73c/w/crates/radicle-cli/target/debug", "/usr/local/cargo/bin", "/usr/local/sbin", "/usr/local/bin", "/usr/sbin", "/usr/bin", "/sbin", "/bin", "/tmp/.tmpbRJexi/alice/work"]
1788798324 test: rad-patch-via-push.md: Running `git` with ["checkout", "-b", "feature/1"] in `/tmp/.tmpbRJexi/alice/work`..
1788798324 test: rad-patch-via-push.md: Running `git` with ["commit", "-a", "-m", "Add things", "-q", "--allow-empty"] in `/tmp/.tmpbRJexi/alice/work`..
1788798324 test: rad-patch-via-push.md: Running `git` with ["push", "-o", "patch.message=Add things #1", "-o", "patch.message=See commits for details.", "rad", "HEAD:refs/patches"] in `/tmp/.tmpbRJexi/alice/work`..
1788798324 test: rad-patch-via-push.md: Running `/477f61bc-11d5-4481-be7f-441c8572a73c/w/target/debug/rad` with ["patch", "show", "6035d2f582afbe01ff23ea87528ae523d76875b6"] in `/tmp/.tmpbRJexi/alice/work`..
1788798324 test: rad-patch-via-push.md: Running `git` with ["branch", "-vv"] in `/tmp/.tmpbRJexi/alice/work`..
1788798324 test: rad-patch-via-push.md: Running `git` with ["status", "--short", "--branch"] in `/tmp/.tmpbRJexi/alice/work`..
1788798324 test: rad-patch-via-push.md: Running `git` with ["fetch"] in `/tmp/.tmpbRJexi/alice/work`..
1788798324 test: rad-patch-via-push.md: Running `git` with ["push"] in `/tmp/.tmpbRJexi/alice/work`..
1788798324 test: rad-patch-via-push.md: Running `git` with ["show-ref"] in `/tmp/.tmpbRJexi/alice/work`..
thread 'rad_patch_via_push' panicked at crates/radicle-cli-test/src/lib.rs:515:36:
--- Expected
++++ actual: stdout
1 1 | 42d894a83c9c356552a57af09ccdbd5587a99045 refs/heads/feature/1
2 2 | f2de534b5e81d7c6e2dcaf58c3dd91573c0a0354 refs/heads/master
3 - f2de534b5e81d7c6e2dcaf58c3dd91573c0a0354 refs/remotes/rad/HEAD
4 3 | f2de534b5e81d7c6e2dcaf58c3dd91573c0a0354 refs/remotes/rad/master
5 4 | 42d894a83c9c356552a57af09ccdbd5587a99045 refs/remotes/rad/patches/6035d2f582afbe01ff23ea87528ae523d76875b6
Exit status: 0
failures:
rad_patch_fetch_2
rad_patch_via_push
test result: FAILED. 107 passed; 2 failed; 2 ignored; 0 measured; 0 filtered out; finished in 76.64s
error: test failed, to rerun pass `-p radicle-cli --test commands`
Running unittests src/lib.rs (target/debug/deps/radicle_cli_test-7fd01462c12c0fa0)
running 3 tests
test tests::test_parse ... ok
test tests::test_run ... ok
test tests::test_example_spaced_brackets ... ok
test result: ok. 3 passed; 0 failed; 0 ignored; 0 measured; 0 filtered out; finished in 0.00s
Running unittests src/lib.rs (target/debug/deps/radicle_cob-f91f4efce1967fa0)
running 9 tests
test object::tests::test_serde ... ok
test tests::git::list_cobs ... ok
test tests::git::update_cob ... ok
test tests::git::roundtrip ... ok
test type_name::test::invalid_typenames ... ok
test type_name::test::valid_typenames ... ok
test tests::git::traverse_cobs ... ok
test tests::invalid_parse_refstr ... ok
test tests::parse_refstr ... ok
test result: ok. 9 passed; 0 failed; 0 ignored; 0 measured; 0 filtered out; finished in 0.01s
Running unittests src/lib.rs (target/debug/deps/radicle_core-e1c4c52dcc9c6545)
running 4 tests
test repo::test::invalid ... ok
test repo::test::valid ... ok
test repo::test::assert_prop_roundtrip_parse ... ok
test repo::serde_impls::test::assert_prop_roundtrip_serde_json ... ok
test result: ok. 4 passed; 0 failed; 0 ignored; 0 measured; 0 filtered out; finished in 0.00s
Running unittests src/lib.rs (target/debug/deps/radicle_crypto-865b9295f74e428d)
running 12 tests
test ssh::fmt::test::test_key ... ok
test ssh::fmt::test::test_fingerprint ... ok
test ssh::keystore::tests::test_init_no_passphrase ... ok
test ssh::test::test_agent_encoding_remove ... ok
test ssh::test::test_agent_encoding_sign ... ok
test ssh::test::prop_encode_decode_sk ... ok
test tests::prop_encode_decode ... ok
test tests::test_e25519_dh ... ok
test tests::test_encode_decode ... ok
test tests::prop_key_equality ... ok
test ssh::keystore::tests::test_signer ... ok
test ssh::keystore::tests::test_init_passphrase ... ok
test result: ok. 12 passed; 0 failed; 0 ignored; 0 measured; 0 filtered out; finished in 0.86s
Running unittests src/lib.rs (target/debug/deps/radicle_dag-05f7457e7194a495)
running 20 tests
test tests::test_contains ... ok
test tests::test_cycle ... ok
test tests::test_dependencies ... ok
test tests::test_diamond ... ok
test tests::test_fold_diamond ... ok
test tests::test_fold_multiple_roots ... ok
test tests::test_fold_sorting_1 ... ok
test tests::test_fold_reject ... ok
test tests::test_fold_sorting_2 ... ok
test tests::test_get ... ok
test tests::test_is_empty ... ok
test tests::test_merge_1 ... ok
test tests::test_complex ... ok
test tests::test_len ... ok
test tests::test_merge_2 ... ok
test tests::test_prune_1 ... ok
test tests::test_prune_2 ... ok
test tests::test_prune_by_sorting ... ok
test tests::test_siblings ... ok
test tests::test_remove ... ok
test result: ok. 20 passed; 0 failed; 0 ignored; 0 measured; 0 filtered out; finished in 0.00s
Running unittests src/lib.rs (target/debug/deps/radicle_fetch-737133977aa0b55a)
running 0 tests
test result: ok. 0 passed; 0 failed; 0 ignored; 0 measured; 0 filtered out; finished in 0.00s
Running unittests src/lib.rs (target/debug/deps/radicle_git_metadata-ccdb6d430095148e)
running 0 tests
test result: ok. 0 passed; 0 failed; 0 ignored; 0 measured; 0 filtered out; finished in 0.00s
Running unittests src/lib.rs (target/debug/deps/radicle_git_ref_format-09d2e35a065977f7)
running 9 tests
test test::component ... ok
test test::component_invalid - should panic ... ok
test test::pattern ... ok
test test::qualified ... ok
test test::qualified_invalid - should panic ... ok
test test::qualified_pattern ... ok
test test::qualified_pattern_invalid - should panic ... ok
test test::refname ... ok
test test::refname_invalid - should panic ... ok
test result: ok. 9 passed; 0 failed; 0 ignored; 0 measured; 0 filtered out; finished in 0.00s
Running unittests src/lib.rs (target/debug/deps/radicle_localtime-4456862f66617725)
running 1 test
test serde_impls::test::test_localtime ... ok
test result: ok. 1 passed; 0 failed; 0 ignored; 0 measured; 0 filtered out; finished in 0.00s
Running unittests src/lib.rs (target/debug/deps/radicle_node-c5acce3e43ff5839)
running 74 tests
test control::tests::test_control_socket ... ok
test reactor::timer::tests::test_next ... ok
test reactor::timer::tests::test_wake ... ok
test reactor::timer::tests::test_wake_exact ... ok
test control::tests::test_seed_unseed ... ok
test fingerprint::tests::matching ... ok
test tests::e2e::missing_default_branch ... ok
test tests::e2e::missing_delegate_default_branch ... ok
test tests::e2e::test_catchup_on_refs_announcements ... ok
test tests::e2e::test_background_foreground_fetch ... ok
test tests::e2e::test_channel_reader_limit ... ok
test tests::e2e::test_clone ... ok
test tests::e2e::test_dont_fetch_owned_refs ... ok
test tests::e2e::test_connection_crossing ... ok
test tests::e2e::test_fetch_followed_remotes ... ok
test tests::e2e::test_concurrent_fetches ... ok
test tests::e2e::test_fetch_preserve_owned_refs ... ok
test tests::e2e::test_fetch_unseeded ... ok
test tests::e2e::test_fetch_up_to_date ... ok
test tests::e2e::test_inventory_sync_basic ... ok
test tests::e2e::test_fetch_emits_canonical_ref_update ... ok
test tests::e2e::test_large_fetch ... ok
test tests::e2e::test_migrated_clone ... ok
test tests::e2e::test_missing_remote ... ok
test tests::e2e::test_multiple_offline_inits ... ok
test tests::e2e::test_non_fastforward_sigrefs ... ok
test tests::e2e::test_outdated_delegate_sigrefs ... ok
test tests::e2e::test_outdated_sigrefs ... ok
test tests::e2e::test_replication ... ok
test tests::e2e::test_replication_invalid ... ok
test tests::e2e::test_inventory_sync_bridge ... ok
test tests::e2e::test_replication_ref_in_sigrefs ... ok
test tests::e2e::test_inventory_sync_ring ... ok
test tests::e2e::test_inventory_sync_star ... ok
test tests::test_announcement_rebroadcast ... ok
test tests::test_announcement_rebroadcast_duplicates ... ok
test tests::test_announcement_relay ... ok
test tests::test_announcement_rebroadcast_timestamp_filtered ... ok
test tests::test_connection_kept_alive ... ok
test tests::test_disconnecting_unresponsive_peer ... ok
test tests::test_fetch_missing_inventory_on_gossip ... ok
test tests::test_fetch_missing_inventory_on_schedule ... ok
test tests::test_inbound_connection ... ok
test tests::test_inventory_decode ... ok
test tests::test_init_and_seed ... ok
test tests::test_inventory_relay ... ok
test tests::test_inventory_relay_bad_timestamp ... ok
test tests::test_inventory_sync ... ok
test tests::test_maintain_connections ... ok
test tests::test_maintain_connections_failed_attempt ... ok
test tests::test_maintain_connections_transient ... ok
test tests::test_outbound_connection ... ok
test tests::test_persistent_peer_connect ... ok
test tests::test_inventory_pruning ... ok
test tests::test_persistent_peer_reconnect_success ... ok
test tests::test_persistent_peer_reconnect_attempt ... ok
test tests::test_ping_response ... ok
test tests::test_queued_fetch_from_ann_same_rid ... ok
test tests::test_queued_fetch_from_command_same_rid ... ok
test tests::test_queued_fetch_max_capacity ... ok
test tests::test_redundant_connect ... ok
test tests::test_refs_announcement_followed ... ok
test tests::test_refs_announcement_fetch_trusted_no_inventory ... ok
test tests::test_refs_announcement_no_subscribe ... ok
test tests::test_refs_announcement_offline ... ok
test tests::test_refs_announcement_relay_private ... ok
test tests::test_refs_announcement_relay_public ... ok
test tests::test_refs_synced_event ... ok
test tests::test_seeding ... ok
test wire::test::test_inventory_ann_with_extension ... ok
test wire::test::test_pong_message_with_extension ... ok
test tests::test_seed_repo_subscribe ... ok
test tests::prop_inventory_exchange_dense ... ok
test tests::test_announcement_message_amplification ... ok
test result: ok. 74 passed; 0 failed; 0 ignored; 0 measured; 0 filtered out; finished in 16.85s
Running unittests src/main.rs (target/debug/deps/radicle_node-c1c1a6214bccf203)
running 0 tests
test result: ok. 0 passed; 0 failed; 0 ignored; 0 measured; 0 filtered out; finished in 0.00s
Running unittests src/lib.rs (target/debug/deps/radicle_oid-028cdb253cf60541)
running 10 tests
test fmt::test::fixture ... ok
test fmt::test::git2 ... ok
test fmt::test::gix ... ok
test fmt::test::zero ... ok
test gix::test::zero ... ok
test str::test::fixture ... ok
test git2::test::zero ... ok
test str::test::zero ... ok
test str::test::gix_roundrip ... ok
test str::test::git2_roundtrip ... ok
test result: ok. 10 passed; 0 failed; 0 ignored; 0 measured; 0 filtered out; finished in 0.00s
Running unittests src/lib.rs (target/debug/deps/radicle_protocol-8600b227541bca85)
running 100 tests
test deserializer::test::test_unparsed ... ok
test deserializer::test::test_decode_next ... ok
test deserializer::test::prop_decode_next ... ok
test fetcher::service::tests::test_fetch_coalescing_different_refs ... ok
test fetcher::test::queue::properties::capacity::bounded ... ok
test fetcher::test::queue::properties::dequeue::drained_queue_returns_none ... ok
test fetcher::test::queue::properties::dequeue::empty_queue_returns_none ... ok
test fetcher::test::queue::properties::dequeue::enables_reenqueue ... ok
test fetcher::test::queue::properties::capacity::restored_after_dequeue ... ok
test fetcher::test::queue::properties::capacity::rejection ... ok
test fetcher::test::queue::properties::capacity::capacity_reached_returns_same_item ... ok
test fetcher::test::queue::properties::fifo::interleaved_operations ... ok
test fetcher::test::queue::properties::fifo::ordering ... ok
test fetcher::test::queue::properties::equality::reflexive ... ok
test fetcher::test::queue::properties::merge::different_rid_accepted ... ok
test fetcher::test::queue::properties::merge::combines_refs ... ok
test fetcher::test::queue::properties::equality::symmetric ... ok
test fetcher::test::queue::properties::merge::longer_timeout_preserved ... ok
test fetcher::test::queue::properties::merge::does_not_increase_queue_length ... ok
test fetcher::test::queue::properties::merge::empty_refs_fetches_all ... ok
test fetcher::test::queue::unit::capacity_takes_precedence_over_merge_for_new_items ... ok
test fetcher::test::queue::unit::empty_refs_items_can_be_equal ... ok
test fetcher::test::queue::unit::max_timeout_accepted ... ok
test fetcher::test::queue::unit::merge_preserves_position_in_queue ... ok
test fetcher::test::queue::unit::zero_timeout_accepted ... ok
test fetcher::test::state::command::cancel::cancellation_is_isolated ... ok
test fetcher::test::state::command::cancel::non_existent_returns_unexpected ... ok
test fetcher::test::state::command::cancel::ongoing_and_queued ... ok
test fetcher::test::state::command::cancel::single_ongoing ... ok
test fetcher::test::state::command::fetch::fetch_after_previous_completed ... ok
test fetcher::test::state::command::fetch::fetch_at_capacity_enqueues ... ok
test fetcher::test::state::command::fetch::fetch_different_repo_same_node_within_capacity ... ok
test fetcher::test::state::command::fetch::fetch_duplicate_returns_already_fetching ... ok
test fetcher::test::state::command::fetch::fetch_queue_merge_empty_refs_fetches_all ... ok
test fetcher::test::state::command::fetch::fetch_queue_merge_takes_longer_timeout ... ok
test fetcher::test::state::command::fetch::fetch_queue_merges_already_queued ... ok
test fetcher::test::state::command::fetch::fetch_queue_rejected_capacity_reached ... ok
test fetcher::test::state::command::fetch::fetch_same_repo_different_nodes_queues_second ... ok
test fetcher::test::queue::properties::equality::transitive ... ok
test fetcher::test::state::command::fetch::fetch_start_first_fetch_for_node ... ok
test fetcher::test::state::command::fetch::fetch_same_repo_different_refs_enqueues ... ok
test fetcher::test::queue::properties::merge::same_rid_merges_anywhere_in_queue ... ok
test fetcher::test::state::command::fetched::complete_one_of_multiple ... ok
test fetcher::test::state::command::fetched::complete_single_ongoing ... ok
test fetcher::test::state::command::fetched::complete_then_dequeue_fifo ... ok
test fetcher::test::state::concurrent::fetched_then_cancel ... ok
test fetcher::test::state::concurrent::interleaved_operations ... ok
test fetcher::test::state::command::fetched::non_existent_returns_not_found ... ok
test fetcher::test::state::config::min_queue_size ... ok
test fetcher::test::state::dequeue::empty_queue_returns_none ... ok
test fetcher::test::state::dequeue::cannot_dequeue_while_node_at_capacity ... ok
test fetcher::test::state::dequeue::maintains_fifo_order ... ok
test fetcher::test::state::invariant::queue_integrity_after_merge ... ok
test fetcher::test::state::multinode::independent_queues ... ok
test service::filter::test::compatible ... ok
test service::filter::test::test_parameters ... ok
test fetcher::test::queue::properties::merge::succeed_when_at_capacity ... ok
test service::filter::test::test_sizes ... ok
test service::limiter::test::test_limitter_different_rates ... ok
test service::gossip::store::test::test_announced ... ok
test service::limiter::test::test_limitter_multi ... ok
test service::limiter::test::test_limitter_refill ... ok
test service::message::tests::test_inventory_limit ... ok
test fetcher::test::state::config::high_concurrency ... ok
test service::message::tests::test_ref_remote_limit ... ok
test wire::frame::test::test_encode_git_large ... ok
test wire::frame::test::test_stream_id ... ok
test service::message::tests::prop_refs_announcement_signing ... ok
test fetcher::test::state::multinode::high_count ... ok
test wire::message::tests::prop_roundtrip_address ... ok
test wire::message::tests::prop_zero_bytes_encode_decode ... ok
test wire::message::tests::test_inv_ann_max_size ... ok
test wire::message::tests::test_node_ann_max_size ... ok
test wire::message::tests::test_ping_encode_size_overflow - should panic ... ok
test wire::message::tests::test_pingpong_encode_max_size ... ok
test wire::message::tests::test_pong_encode_size_overflow - should panic ... ok
test wire::message::tests::prop_message_decoder ... ok
test wire::tests::prop_oid ... ok
test wire::tests::prop_roundtrip_filter ... ok
test wire::tests::prop_roundtrip_publickey ... ok
test wire::tests::prop_roundtrip_refs ... ok
test wire::tests::prop_roundtrip_repoid ... ok
test wire::tests::prop_roundtrip_signed_refs ... ok
test wire::tests::prop_roundtrip_tuple ... ok
test wire::tests::prop_roundtrip_u16 ... ok
test wire::tests::prop_roundtrip_u32 ... ok
test wire::tests::prop_roundtrip_u64 ... ok
test wire::tests::prop_roundtrip_vec ... ok
test wire::tests::prop_signature ... ok
test wire::tests::prop_string ... ok
test wire::tests::test_alias ... ok
test wire::tests::test_bounded_vec_limit ... ok
test wire::tests::test_filter_invalid ... ok
test wire::tests::test_string ... ok
test wire::varint::test::prop_roundtrip_varint ... ok
test wire::varint::test::test_encode_overflow - should panic ... ok
test wire::varint::test::test_encoding ... ok
test wire::message::tests::prop_roundtrip_message ... ok
test wire::message::tests::test_refs_ann_max_size ... ok
test service::message::tests::test_node_announcement_validate ... ok
test result: ok. 100 passed; 0 failed; 0 ignored; 0 measured; 0 filtered out; finished in 1.77s
Running unittests src/main.rs (target/debug/deps/git_remote_rad-843dd707398292f1)
running 0 tests
test result: ok. 0 passed; 0 failed; 0 ignored; 0 measured; 0 filtered out; finished in 0.00s
Running unittests src/main.rs (target/debug/deps/radicle_schemars-7421ed3ac2aaca36)
running 0 tests
test result: ok. 0 passed; 0 failed; 0 ignored; 0 measured; 0 filtered out; finished in 0.00s
Running unittests src/lib.rs (target/debug/deps/radicle_signals-bb66f1d798396f61)
running 0 tests
test result: ok. 0 passed; 0 failed; 0 ignored; 0 measured; 0 filtered out; finished in 0.00s
Running unittests src/lib.rs (target/debug/deps/radicle_ssh-ced840136c32d8e4)
running 0 tests
test result: ok. 0 passed; 0 failed; 0 ignored; 0 measured; 0 filtered out; finished in 0.00s
Running unittests src/lib.rs (target/debug/deps/radicle_systemd-26fc537364dfeb10)
running 0 tests
test result: ok. 0 passed; 0 failed; 0 ignored; 0 measured; 0 filtered out; finished in 0.00s
Running unittests src/lib.rs (target/debug/deps/radicle_term-84e75e992d83bd33)
running 21 tests
test ansi::tests::colors_disabled ... ok
test cell::test::test_width ... ok
test element::test::test_spaced ... ok
test ansi::tests::wrapping ... ok
test ansi::tests::colors_enabled ... ok
test element::test::test_width ... ok
test table::test::test_table ... ok
test element::test::test_truncate ... ok
test table::test::test_table_border_truncated ... ok
test table::test::test_table_border_maximized ... ok
test table::test::test_table_truncate ... ok
test table::test::test_table_unicode ... ok
test table::test::test_table_border ... ok
test table::test::test_truncate ... ok
test table::test::test_table_unicode_truncate ... ok
test textarea::test::test_wrapping_code_block ... ok
test textarea::test::test_wrapping ... ok
test textarea::test::test_wrapping_fenced_block ... ok
test textarea::test::test_wrapping_paragraphs ... ok
test vstack::test::test_vstack ... ok
test vstack::test::test_vstack_maximize ... ok
test result: ok. 21 passed; 0 failed; 0 ignored; 0 measured; 0 filtered out; finished in 0.00s
Running unittests src/lib.rs (target/debug/deps/radicle_windows-2c067555aa9e0165)
running 0 tests
test result: ok. 0 passed; 0 failed; 0 ignored; 0 measured; 0 filtered out; finished in 0.00s
Doc-tests radicle
running 1 test
test crates/radicle/src/cob/patch/encoding/review.rs - cob::patch::encoding::review::Review (line 23) ... ignored
test result: ok. 0 passed; 0 failed; 1 ignored; 0 measured; 0 filtered out; finished in 0.00s
Doc-tests radicle_cli
running 0 tests
test result: ok. 0 passed; 0 failed; 0 ignored; 0 measured; 0 filtered out; finished in 0.00s
Doc-tests radicle_cli_test
running 0 tests
test result: ok. 0 passed; 0 failed; 0 ignored; 0 measured; 0 filtered out; finished in 0.00s
Doc-tests radicle_cob
running 1 test
test crates/radicle-cob/src/backend/stable.rs - backend::stable::with_advanced_timestamp (line 56) ... ignored
test result: ok. 0 passed; 0 failed; 1 ignored; 0 measured; 0 filtered out; finished in 0.00s
Doc-tests radicle_core
running 0 tests
test result: ok. 0 passed; 0 failed; 0 ignored; 0 measured; 0 filtered out; finished in 0.00s
Doc-tests radicle_crypto
running 0 tests
test result: ok. 0 passed; 0 failed; 0 ignored; 0 measured; 0 filtered out; finished in 0.00s
Doc-tests radicle_dag
running 0 tests
test result: ok. 0 passed; 0 failed; 0 ignored; 0 measured; 0 filtered out; finished in 0.00s
Doc-tests radicle_fetch
running 0 tests
test result: ok. 0 passed; 0 failed; 0 ignored; 0 measured; 0 filtered out; finished in 0.00s
Doc-tests radicle_git_metadata
running 0 tests
test result: ok. 0 passed; 0 failed; 0 ignored; 0 measured; 0 filtered out; finished in 0.00s
Doc-tests radicle_git_ref_format
running 0 tests
test result: ok. 0 passed; 0 failed; 0 ignored; 0 measured; 0 filtered out; finished in 0.00s
Doc-tests radicle_localtime
running 0 tests
test result: ok. 0 passed; 0 failed; 0 ignored; 0 measured; 0 filtered out; finished in 0.00s
Doc-tests radicle_node
running 0 tests
test result: ok. 0 passed; 0 failed; 0 ignored; 0 measured; 0 filtered out; finished in 0.00s
Doc-tests radicle_oid
running 0 tests
test result: ok. 0 passed; 0 failed; 0 ignored; 0 measured; 0 filtered out; finished in 0.00s
Doc-tests radicle_protocol
running 6 tests
test crates/radicle-protocol/src/bounded.rs - bounded::BoundedVec<T,N>::max (line 96) ... ok
test crates/radicle-protocol/src/bounded.rs - bounded::BoundedVec<T,N>::push (line 122) ... ok
test crates/radicle-protocol/src/bounded.rs - bounded::BoundedVec<T,N>::truncate (line 50) ... ok
test crates/radicle-protocol/src/bounded.rs - bounded::BoundedVec<T,N>::collect_from (line 30) ... ok
test crates/radicle-protocol/src/bounded.rs - bounded::BoundedVec<T,N>::unbound (line 149) ... ok
test crates/radicle-protocol/src/bounded.rs - bounded::BoundedVec<T,N>::with_capacity (line 66) ... ok
test result: ok. 6 passed; 0 failed; 0 ignored; 0 measured; 0 filtered out; finished in 0.41s
Doc-tests radicle_signals
running 0 tests
test result: ok. 0 passed; 0 failed; 0 ignored; 0 measured; 0 filtered out; finished in 0.00s
Doc-tests radicle_ssh
running 0 tests
test result: ok. 0 passed; 0 failed; 0 ignored; 0 measured; 0 filtered out; finished in 0.00s
Doc-tests radicle_systemd
running 0 tests
test result: ok. 0 passed; 0 failed; 0 ignored; 0 measured; 0 filtered out; finished in 0.00s
Doc-tests radicle_term
running 1 test
test crates/radicle-term/src/table.rs - table (line 4) ... ok
test result: ok. 1 passed; 0 failed; 0 ignored; 0 measured; 0 filtered out; finished in 0.15s
Doc-tests radicle_windows
running 0 tests
test result: ok. 0 passed; 0 failed; 0 ignored; 0 measured; 0 filtered out; finished in 0.00s
error: 1 target failed:
`-p radicle-cli --test commands`
Exit code: 101
{
"response": "finished",
"result": "failure"
}